Organisation Name,NACS Code,Organisation Type,Address1,Address2,Address3,Address4,Address5,PostCode,Telephone Number,Opening time,Value  (Opening time),Banding Classification  (Opening time),NHS.UK users rating,Value  (NHS.UK users rating),Banding Classification  (NHS.UK users rating),Car parking (Is there car parking at this organisation?)
Ashleigh Sight Care,OP_5LY_14850__000001_SO518BU,OPT,,8 Church Street,,Romsey,Hampshire,SO51 8BU,Tel: 01794 512480, - ,,,No ratings yet Rate it yourself - /Services/opticians/LeaveReview/DefaultView.aspx?id=OP_5LY_14850__000001_SO518BU,0,0,
Mark Freeman Opticians,SO51 8NB__000003_SO518NB,OPT,3 Market Place,,Romsey,Hants,,SO51 8NB,Tel: 01794 513953, - ,,,No ratings yet Rate it yourself - /Services/opticians/LeaveReview/DefaultView.aspx?id=SO51 8NB__000003_SO518NB,0,0,
D N White Opticians,OP_5LY_14855__000001_SO518NA,OPT,23 Market Place,,Romsey,Hampshire,,SO51 8NA,Tel: 01794 517311, - ,,,No ratings yet Rate it yourself - /Services/opticians/LeaveReview/DefaultView.aspx?id=OP_5LY_14855__000001_SO518NA,0,0,
Romsey Eyecare,OPT_SO51 8DE,OPT,,"1 Victoria Place, Love Lane",,Romsey,Hampshire,SO51 8DE,Tel: 01794 522747, - ,,,No ratings yet Rate it yourself - /Services/opticians/LeaveReview/DefaultView.aspx?id=OPT_SO51 8DE,0,0,
Boots Opticians,G7K1V,OPT,,3-5 The Hundred,,Romsey,Hampshire,SO51 8GD,Tel: 01794 513258, - ,,,No ratings yet Rate it yourself - /Services/opticians/LeaveReview/DefaultView.aspx?id=G7K1V,0,0,
Bourneside Optometry Limited - Mrs S Downie,OPT_SP46HL_1,OPT,,Bourneside House,,Salisbury,,SP4 6HL,Tel: 01980 611433, - ,,,No ratings yet Rate it yourself - /Services/opticians/LeaveReview/DefaultView.aspx?id=OPT_SP46HL_1,0,0,
A J Bass,OP_5DH_11495__000001_SP53LX,OPT,53 The Borough,Downton,Salisbury,Wiltshire,,SP5 3LX,Tel: 01725 512058, - ,,,No ratings yet Rate it yourself - /Services/opticians/LeaveReview/DefaultView.aspx?id=OP_5DH_11495__000001_SP53LX,0,0,
Boots-Salisbury - Catherine St,OP_5DJ_10591__000001_SP12DF,OPT,17 Catherine Street,,,Salisbury,Wiltshire,SP1 2DF,Tel: 01722 322 522, - ,,,No ratings yet Rate it yourself - /Services/opticians/LeaveReview/DefaultView.aspx?id=OP_5DJ_10591__000001_SP12DF,0,0,
Memory Opticians,OP_5DJ_8550__000002_SP12DF,OPT,13 Catherine Street,,Salisbury,,,SP1 2DF,Tel: 01722 410959, - ,,,No ratings yet Rate it yourself - /Services/opticians/LeaveReview/DefaultView.aspx?id=OP_5DJ_8550__000002_SP12DF,0,0,
Specsavers Opticians,OP_5DJ_9766__000001_SP12DG,OPT,1 Catherine Street,,Salisbury,,,SP1 2DF,Tel: 01722 412255, - ,,,No ratings yet Rate it yourself - /Services/opticians/LeaveReview/DefaultView.aspx?id=OP_5DJ_9766__000001_SP12DG,0,0,
Silverthornes Opticians,OP_5DJ_14126__000001_SP12DD,OPT,50 Catherine Street,,Salisbury,Wiltshire,,SP1 2DD,Tel: 01722 322880, - ,,,No ratings yet Rate it yourself - /Services/opticians/LeaveReview/DefaultView.aspx?id=OP_5DJ_14126__000001_SP12DD,0,0,
Vision Express (UK) Ltd,OP_5DJ_1147__000002_SP11EP,OPT,25-27 Butcher Row,,Salisbury,,,SP1 1EP,Tel: 01722 330056, - ,,,No ratings yet Rate it yourself - /Services/opticians/LeaveReview/DefaultView.aspx?id=OP_5DJ_1147__000002_SP11EP,0,0,
Boots Opticians Limited,OP_5DJ_11593__000001_SP12AA,OPT,49-51 New Canel,,Salisbury,,,SP1 2AA,Tel: 01722 412625, - ,,,No ratings yet Rate it yourself - /Services/opticians/LeaveReview/DefaultView.aspx?id=OP_5DJ_11593__000001_SP12AA,0,0,
Boots-Salisbury - Silver St,SP1 2NG_29481,OPT,,41-49 Silver Street,,Salisbury,Wiltshire,SP1 2NG,Tel: 01722 412625, - ,,,No ratings yet Rate it yourself - /Services/opticians/LeaveReview/DefaultView.aspx?id=SP1 2NG_29481,0,0,
Batemans (Opticians) Ltd,OP_5DJ_3495__000001_SP12LX,OPT,6 Bridge Street,,Salisbury,,,SP1 2LX,Tel: 01722 322585, - ,,,No ratings yet Rate it yourself - /Services/opticians/LeaveReview/DefaultView.aspx?id=OP_5DJ_3495__000001_SP12LX,0,0,
Mark Jones Eyecare,OP_5DJ_14125__000001_SP27SU,OPT,,21 Fisherton Street,,Salisbury,,SP2 7SU,Tel: 01722 322891, - ,,,No ratings yet Rate it yourself - /Services/opticians/LeaveReview/DefaultView.aspx?id=OP_5DJ_14125__000001_SP27SU,0,0,
Hampson Opticians,OP_SO532FW_85744,OPT,,3A Hursley Road,,Chandlers Ford,,SO53 2FW,, - ,,,No ratings yet Rate it yourself - /Services/opticians/LeaveReview/DefaultView.aspx?id=OP_SO532FW_85744,0,0,
CGW Limited,OPT_SO533DA_1,OPT,,7 Bournemouth Road,,Chandlers Ford,,SO53 3DA,, - ,,,No ratings yet Rate it yourself - /Services/opticians/LeaveReview/DefaultView.aspx?id=OPT_SO533DA_1,0,0,
Peter Bennett,SO53 3AF__000001_SO533AF,OPT,232 Bournemouth Road,Chandlers Ford,Eastleigh,Hants,,SO53 3AF,, - ,,,No ratings yet Rate it yourself - /Services/opticians/LeaveReview/DefaultView.aspx?id=SO53 3AF__000001_SO533AF,0,0,
Rawlings Opticians,OP_5LY_14074__000001_SO533DB,OPT,,"14 Fryern Arcade, Winchester Road",Chandlers Ford,Chandlers Ford,,SO53 2DQ,Tel: 023 8025 2428, - ,,,No ratings yet Rate it yourself - /Services/opticians/LeaveReview/DefaultView.aspx?id=OP_5LY_14074__000001_SO533DB,0,0,
Leightons Opticians & Hearing Care,OP_5LY_14073__000001_SO532QD,OPT,,"4-5 The Mall, Winchester Road",Chandlers Ford,Southampton,Hampshire,SO53 2QD,Tel: 02380 266 181, - ,,,No ratings yet Rate it yourself - /Services/opticians/LeaveReview/DefaultView.aspx?id=OP_5LY_14073__000001_SO532QD,0,0,
Leightons Opticians & Hearing Care,OP_5A1_14101__000001_SO403DG,OPT,,17 Water Lane,Totton,Southampton,Hampshire,SO40 3DG,Tel: 02380 862 456, - ,,,No ratings yet Rate it yourself - /Services/opticians/LeaveReview/DefaultView.aspx?id=OP_5A1_14101__000001_SO403DG,0,0,
Specsavers,SO40 3BX__000003_SO403BX,OPT,11 Commercial Road,,,Totton,,SO40 3BX,Tel: 02380 580 070, - ,,,No ratings yet Rate it yourself - /Services/opticians/LeaveReview/DefaultView.aspx?id=SO40 3BX__000003_SO403BX,0,0,
Clapham Eyecare,OPT_SO403BX_1,OPT,,9 Commercial Road,,Totton,,SO40 3BX,, - ,,,No ratings yet Rate it yourself - /Services/opticians/LeaveReview/DefaultView.aspx?id=OPT_SO403BX_1,0,0,
ASDA Opticians,OP_5LY_14072__000002_SO533YJ,OPT,Bournemouth Road,Chandlers Ford,Eastleigh,Hampshire,,SO53 3YJ,Tel: 023 8026 8341, - ,,,No ratings yet Rate it yourself - /Services/opticians/LeaveReview/DefaultView.aspx?id=OP_5LY_14072__000002_SO533YJ,0,0,
Optique Opticians,OP_5A1_14102__000001_SO403BU,OPT,89 Junction Road,,Totton,Southampton (Totton),Hampshire,SO40 3BU,Tel: 023 8087 0002, - ,,,No ratings yet Rate it yourself - /Services/opticians/LeaveReview/DefaultView.aspx?id=OP_5A1_14102__000001_SO403BU,0,0,
Carol Underwood,PCTCAROLUNDERWOOD1__000001_SP103DG,OPT,King George Road,,andover,Hants,,SP10 3DG,Tel: 0845 602 3842, - ,,,No ratings yet Rate it yourself - /Services/opticians/LeaveReview/DefaultView.aspx?id=PCTCAROLUNDERWOOD1__000001_SP103DG,0,0,
Vision Express,OP_5E9_1549__000001_SP101LU,OPT,45 Chantry Way,The Chantry Centre,andover,Hampshire,,SP10 1LQ,Tel: 01264 324801, - ,,,No ratings yet Rate it yourself - /Services/opticians/LeaveReview/DefaultView.aspx?id=OP_5E9_1549__000001_SP101LU,0,0,
Leightons Opticians & Hearing Care,OP_5E9_433__000001_SP101RW,OPT,,68 The Chantry Centre,,Andover,Hampshire,SP10 1RW,Tel: 01264 365695, - ,,,No ratings yet Rate it yourself - /Services/opticians/LeaveReview/DefaultView.aspx?id=OP_5E9_433__000001_SP101RW,0,0,
Boots-Andover - High St,OP_5E9_6071__000001_SP101LP,OPT,63 High Street,,,Andover,Hampshire,SP10 1LP,Tel: 01264 352887, - ,,,No ratings yet Rate it yourself - /Services/opticians/LeaveReview/DefaultView.aspx?id=OP_5E9_6071__000001_SP101LP,0,0,
West Country Eyecare,OL/5FT__000004_SP101NG,OPT,76 High Street,,andover,Hants,,SP10 1NG,Tel: 01264 366165, - ,,,No ratings yet Rate it yourself - /Services/opticians/LeaveReview/DefaultView.aspx?id=OL/5FT__000004_SP101NG,0,0,
Specsavers,OP_5E9_5988__000001_SP101NG,OPT,,72 High Street,,Andover,Hampshire,SP10 1NG,Tel: 01264 339 369, - ,,,No ratings yet Rate it yourself - /Services/opticians/LeaveReview/DefaultView.aspx?id=OP_5E9_5988__000001_SP101NG,0,0,
Specsavers,OP_5LY_14851__000001_SO509EP,OPT,9 Leigh Road,,Eastleigh,Hampshire,,SO50 9EP,Tel: 023 8062 0011, - ,,,No ratings yet Rate it yourself - /Services/opticians/LeaveReview/DefaultView.aspx?id=OP_5LY_14851__000001_SO509EP,0,0,
Scrivens Opticians & Hearing Care,OP_5L1_14121__000001_SO153NG,OPT,40 Shirley High Street,Shirley,,Southampton (Shirley),Hampshire,SO15 3NG,Tel: 023 8077 0804, - ,,,No ratings yet Rate it yourself - /Services/opticians/LeaveReview/DefaultView.aspx?id=OP_5L1_14121__000001_SO153NG,0,0,
Specsavers,SO15 3NH__000002_SO153NH,OPT,18-20 Shirley High Street,Shirley,Southampton,Hants,,SO15 3NH,Tel: 02380 778818, - ,,,No ratings yet Rate it yourself - /Services/opticians/LeaveReview/DefaultView.aspx?id=SO15 3NH__000002_SO153NH,0,0,
Rawlings Opticians,OP_5E9_615__000003_SO239BX,OPT,60-61 High Street,,Winchester,Hampshire,,SO23 9BX,Tel: 01962 853082, - ,,,No ratings yet Rate it yourself - /Services/opticians/LeaveReview/DefaultView.aspx?id=OP_5E9_615__000003_SO239BX,0,0,
Eyesite Opticians,OP_5E9_12451__000001_SO239BX,OPT,Southgate Corner,65 High Street,,Winchester,Hampshire,SO23 9BX,Tel: 01962 864446, - ,,,No ratings yet Rate it yourself - /Services/opticians/LeaveReview/DefaultView.aspx?id=OP_5E9_12451__000001_SO239BX,0,0,
Haine & Smith Opticians,SP4 7HD,OPT,,20 Salisbury Street,,Amesbury,Wiltshire,SP4 7HD,Tel: 01980 626551, - ,,,No ratings yet Rate it yourself - /Services/opticians/LeaveReview/DefaultView.aspx?id=SP4 7HD,0,0,
Batemans (Opticians) Ltd,OP_5DJ_10456__000004_SP47HD,OPT,12 Salisbury Street,,,Amesbury,Wiltshire,SP4 7HD,Tel: 01980 623228, - ,,,No ratings yet Rate it yourself - /Services/opticians/LeaveReview/DefaultView.aspx?id=OP_5DJ_10456__000004_SP47HD,0,0,
Memory Opticians,OP_5DJ_14124__000005_SP47HD,OPT,44b Salisbury Street,,Amesbury,,,SP4 7HD,Tel: 01980 624065, - ,,,No ratings yet Rate it yourself - /Services/opticians/LeaveReview/DefaultView.aspx?id=OP_5DJ_14124__000005_SP47HD,0,0,
Specsavers Opticians,OPT_SO239AH_1,OPT,,106a High Street,,Winchester,,SO23 9AH,, - ,,,No ratings yet Rate it yourself - /Services/opticians/LeaveReview/DefaultView.aspx?id=OPT_SO239AH_1,0,0,
Vision Express,OP_5E9_2258__000002_SO239BL,OPT,,40 High Street,,Winchester,Hampshire,SO23 9BL,Tel: 01962 856850, - ,,,No ratings yet Rate it yourself - /Services/opticians/LeaveReview/DefaultView.aspx?id=OP_5E9_2258__000002_SO239BL,0,0,
Costco Wholesale UK Ltd,OPT_SO158TA_1,OPT,,Regents Park Road,,Southampton,,SO15 8TA,Tel: 02380 764 825, - ,,,No ratings yet Rate it yourself - /Services/opticians/LeaveReview/DefaultView.aspx?id=OPT_SO158TA_1,0,0,
Leightons Opticians & Hearing Care,OP_5E9_158__000001_SO238AH,OPT,,67 St. Georges Street,,Winchester,Hampshire,SO23 8AH,Tel: 01962 852961, - ,,,No ratings yet Rate it yourself - /Services/opticians/LeaveReview/DefaultView.aspx?id=OP_5E9_158__000001_SO238AH,0,0,
Specsavers,OP_5E9_643__000001_SO238AF,OPT,The Brooks Centre,,Winchester,Hampshire,,SO23 8QY,Tel: 01962 844833, - ,,,No ratings yet Rate it yourself - /Services/opticians/LeaveReview/DefaultView.aspx?id=OP_5E9_643__000001_SO238AF,0,0,
Boots-Winchester - High St,OP_5E9_1446__000001_SO239AY,OPT,144 High Street,,Winchester,Winchester,Hampshire,SO23 9AY,Tel: 01962 854553, - ,,,No ratings yet Rate it yourself - /Services/opticians/LeaveReview/DefaultView.aspx?id=OP_5E9_1446__000001_SO239AY,0,0,
Vision Express,OP_SO505RH_30046,OPT,,25 Market Street,,Eastleigh,Hampshire,SO50 5RH,Tel: 02380 650640, - ,,,No ratings yet Rate it yourself - /Services/opticians/LeaveReview/DefaultView.aspx?id=OP_SO505RH_30046,0,0,
Specsavers,OPT_SO505RG_1,OPT,,35-37 Market Street,,Eastleigh,Hampshire,SO50 5RG,Tel: 02380 620011, - ,,,No ratings yet Rate it yourself - /Services/opticians/LeaveReview/DefaultView.aspx?id=OPT_SO505RG_1,0,0,
Tesco Opticians,OP_SP101UZ_29725,OPT,,River Way,,Andover,Hampshire,SP10 1UZ,Tel: 0345 601 3479, - ,,,No ratings yet Rate it yourself - /Services/opticians/LeaveReview/DefaultView.aspx?id=OP_SP101UZ_29725,0,0,
Boots Opticians,OPT_SO505SF_1,OPT,,48 Swan Centre,,Eastleigh,,SO50 5SF,, - ,,,No ratings yet Rate it yourself - /Services/opticians/LeaveReview/DefaultView.aspx?id=OPT_SO505SF_1,0,0,
Ashleigh Sight Care,OP_5L1_14117__000002_SO172NG,OPT,255 Portswood Road,Portswood,,Southampton,,SO17 2NG,Tel: 023 8055 0431, - ,,,No ratings yet Rate it yourself - /Services/opticians/LeaveReview/DefaultView.aspx?id=OP_5L1_14117__000002_SO172NG,0,0,yes
Wilton i Ltd,SP2 0DF,OPT,within The Old Orchard Surgery,South Street,,Wilton,,SP2 0JU,Tel: 01722 743122, - ,,,No ratings yet Rate it yourself - /Services/opticians/LeaveReview/DefaultView.aspx?id=SP2 0DF,0,0,
Leightons Opticians & Hearing Care,OP_5L1_14320__000001_SO171XS,OPT,,Stag Gates,68 The Avenue,Southampton,Hampshire,SO17 1XS,Tel: 02380 223 185, - ,,,No ratings yet Rate it yourself - /Services/opticians/LeaveReview/DefaultView.aspx?id=OP_5L1_14320__000001_SO171XS,0,0,
Opticial Express,OP_12345_S017 1XN,OPT,36-38 The Avenue,,,Southampton,Hampshire,SO17 1XN,Tel: 0800 023 2020, - ,,,No ratings yet Rate it yourself - /Services/opticians/LeaveReview/DefaultView.aspx?id=OP_12345_S017 1XN,0,0,
Tesco Opticians,OP_SO237RS_29727,OPT,,Easton Lane,,Winchester,Hampshire,SO23 7RS,Tel: 0845 601 3479, - ,,,No ratings yet Rate it yourself - /Services/opticians/LeaveReview/DefaultView.aspx?id=OP_SO237RS_29727,0,0,
Memory Opticians,OP_5K4_619__000001_SP97NN,OPT,Station Road,,Tidworth,,,SP9 7NN,Tel: 01980 843440, - ,,,No ratings yet Rate it yourself - /Services/opticians/LeaveReview/DefaultView.aspx?id=OP_5K4_619__000001_SP97NN,0,0,
Ralph Neale (Opticians) Ltd,OP_5L1_14110__000001_SO152DF,OPT,73 Bedford Place,Southampton,Hampshire,,,SO15 2DF,Tel: 023 8022 1749, - ,,,No ratings yet Rate it yourself - /Services/opticians/LeaveReview/DefaultView.aspx?id=OP_5L1_14110__000001_SO152DF,0,0,
A.J Bass BSc FCOptom,OP_5A1_14086__000001_SP61AX,OPT,36 High Street,,Fordingbridge,Hampshire,,SP6 1AX,Tel: 01425 652663, - ,,,No ratings yet Rate it yourself - /Services/opticians/LeaveReview/DefaultView.aspx?id=OP_5A1_14086__000001_SP61AX,0,0,
City Optical Ltd,SO15 1HA__000001_SO151HA,OPT,28 City Industrial Park,Southampton Road,Southampton,Hants,,SO15 1HA,Tel: 02380 631716, - ,,,No ratings yet Rate it yourself - /Services/opticians/LeaveReview/DefaultView.aspx?id=SO15 1HA__000001_SO151HA,0,0,
Boots-Southampton - Above Bar,OP_5L1_14107__000001_SO147DT,OPT,86 Above Bar Street,,,Southampton,Hampshire,SO14 7DT,Tel: 0238 022 3441, - ,,,No ratings yet Rate it yourself - /Services/opticians/LeaveReview/DefaultView.aspx?id=OP_5L1_14107__000001_SO147DT,0,0,
Vision Express,OP_5L1_14115__000001_SO151QD,OPT,Unit Su31,Upper Level,West Quay Shopping Centre,,,SO15 1QD,Tel: 023 8063 5436, - ,,,No ratings yet Rate it yourself - /Services/opticians/LeaveReview/DefaultView.aspx?id=OP_5L1_14115__000001_SO151QD,0,0,
M&S Opticians - West Quay,X7E5B,OPT,,23 Harbour Parade,West Quay,Southampton,Hampshire,SO15 1QB,Tel: 02382 356769, - ,,,No ratings yet Rate it yourself - /Services/opticians/LeaveReview/DefaultView.aspx?id=X7E5B,0,0,
Specsavers,OP_5L1_14113__000002_SO143HE,OPT,,15 Above Bar,,Southampton,,SO14 7DX,Tel: 023 8063 6105, - ,,,No ratings yet Rate it yourself - /Services/opticians/LeaveReview/DefaultView.aspx?id=OP_5L1_14113__000002_SO143HE,0,0,
Boots-Southampton - Above Bar (in Boots UK),OP_5L1_14106__000002_SO147DX,OPT,19-29 Above Bar Street,,,Southampton,Hampshire,SO14 7DX,Tel: 0238 033 1897, - ,,,No ratings yet Rate it yourself - /Services/opticians/LeaveReview/DefaultView.aspx?id=OP_5L1_14106__000002_SO147DX,0,0,
Boots-Southampton - Bitterne Rd,OP_5L1_14104__000002_SO185RR,OPT,391 Bitterne Road,,,Southampton,Hampshire,SO18 5RR,Tel: 0238 044 8443, - ,,,No ratings yet Rate it yourself - /Services/opticians/LeaveReview/DefaultView.aspx?id=OP_5L1_14104__000002_SO185RR,0,0,
Scrivens Opticians,OP_5L1_14105__000003_SO185RR,OPT,417a Bitterne Road,Bitterne,,Southhampton,Hampshire,SO18 5EE,Tel: 023 8042 0513, - ,,,No ratings yet Rate it yourself - /Services/opticians/LeaveReview/DefaultView.aspx?id=OP_5L1_14105__000003_SO185RR,0,0,
M&S Opticians - Hedge End,H8W0C,OPT,,"Toll Bar Way, Hedge End",,Southampton,Hampshire,SO30 2UH,Tel: 01322 918085, - ,,,No ratings yet Rate it yourself - /Services/opticians/LeaveReview/DefaultView.aspx?id=H8W0C,0,0,
Specsavers Opticians,,OPT,Sainsburys,Tollbar Way,Hedge End,Southampton,Hampshire,SO30 2UH,Tel: 01489 232 234, - ,,,N/A - Data not available,,,
Dawkins and Lodge Opticians,OP_5A1_14089__000001_SO456AN,OPT,Unit 4,1-5 The Marsh,Hythe,Southampton,Hampshire,SO45 6AL,Tel: 023 8084 3798, - ,,,No ratings yet Rate it yourself - /Services/opticians/LeaveReview/DefaultView.aspx?id=OP_5A1_14089__000001_SO456AN,0,0,
Scrivens Opticians & Hearing Care,00093__000001_SO456AQ,OPT,52 Pylewell Road,52 Pylewell Road,Hythe,Southampton (Hythe),Hampshire,SO45 6AQ,Tel: 023 8084 2230, - ,,,No ratings yet Rate it yourself - /Services/opticians/LeaveReview/DefaultView.aspx?id=00093__000001_SO456AQ,0,0,
Vision Right (Carol Joy Underwood),01-07383__000001_SO315FB,OPT,17-18 Abbey Hill,Netley Abbey,,Southampton,,SO31 5FB,, - ,,,No ratings yet Rate it yourself - /Services/opticians/LeaveReview/DefaultView.aspx?id=01-07383__000001_SO315FB,0,0,
Rawlings Opticians,OP_5LY_14853__000002_SO304QU,OPT,10 St. Johns Centre,Hedge End,,Southampton,,SO30 4QU,Tel: 01489 788665, - ,,,No ratings yet Rate it yourself - /Services/opticians/LeaveReview/DefaultView.aspx?id=OP_5LY_14853__000002_SO304QU,0,0,
Scrivens Opticians & Hearing Care,OP_5LY_14852__000001_SO304FQ,OPT,7 Lower Northam Road,Hedge End,,Southampton,Hampshire,SO30 4FN,Tel: 01489 782131, - ,,,No ratings yet Rate it yourself - /Services/opticians/LeaveReview/DefaultView.aspx?id=OP_5LY_14852__000001_SO304FQ,0,0,
Tesco Opticians,SO31 8GN__000002_SO318GN,OPT,Hamble Lane,Bursledon,,Southampton,,SO31 8GN,Tel: 0345 6013479, - ,,,No ratings yet Rate it yourself - /Services/opticians/LeaveReview/DefaultView.aspx?id=SO31 8GN__000002_SO318GN,0,0,
PBS Optical,OPT_BH241TW_1,OPT,,Cornerways Cottage,,Ringwood,,BH24 1TW,, - ,,,No ratings yet Rate it yourself - /Services/opticians/LeaveReview/DefaultView.aspx?id=OPT_BH241TW_1,0,0,
Kelly Eyecare,OP_5A1_14085__000002_SO427RB,OPT,43 Brookley Road,,Brockenhurst,Hampshire,,SO42 7RB,Tel: 01590 623297, - ,,,No ratings yet Rate it yourself - /Services/opticians/LeaveReview/DefaultView.aspx?id=OP_5A1_14085__000002_SO427RB,0,0,
Specsavers,BH24 1AT__000001_BH241AT,OPT,2 The Furlong Centre,,Ringwood,Hants,,BH24 1AT,Tel: 01425 484480, - ,,,No ratings yet Rate it yourself - /Services/opticians/LeaveReview/DefaultView.aspx?id=BH24 1AT__000001_BH241AT,0,0,
Eye See Eye,OP_5A1_14098__000001_BH241DG,OPT,17-19 Christchurch Road,Friday's Cross,Ringwood,,,BH24 1DG,Tel: 01425 477922, - ,,,No ratings yet Rate it yourself - /Services/opticians/LeaveReview/DefaultView.aspx?id=OP_5A1_14098__000001_BH241DG,0,0,
Kelly Eyecare,OP_5A1_14099__000001_BH241AB,OPT,17 High Street,,Ringwood,Hampshire,,BH24 1AB,Tel: 01425 478545, - ,,,No ratings yet Rate it yourself - /Services/opticians/LeaveReview/DefaultView.aspx?id=OP_5A1_14099__000001_BH241AB,0,0,
Scrivens Opticians,OP_5A1_14100__000001_BH241AD,OPT,49 High Street,,Ringwood,Hampshire,,BH24 1AD,Tel: 01425 472534, - ,,,No ratings yet Rate it yourself - /Services/opticians/LeaveReview/DefaultView.aspx?id=OP_5A1_14100__000001_BH241AD,0,0,
Ashleigh Sight Care,OP_5E9_14316__000003_SO321AB,OPT,,3 High Street,,Bishops Waltham,Hampshire,SO32 1AB,Tel: 01489 891182, - ,,,No ratings yet Rate it yourself - /Services/opticians/LeaveReview/DefaultView.aspx?id=OP_5E9_14316__000003_SO321AB,0,0,yes
Saxby's,OP_5E9_6269__000001_SO321AR,OPT,Saxby's,2 Houchin Street,Bishops Waltham,Southampton,,SO32 1AR,Tel: 01489 896330, - ,,,No ratings yet Rate it yourself - /Services/opticians/LeaveReview/DefaultView.aspx?id=OP_5E9_6269__000001_SO321AR,0,0,
Peacock & Murphy,OP_5FN_5847__000001_BH216DR,OPT,27b Vicarage Road,,Verwood,Dorset,,BH31 6DR,Tel: 01202 825448, - ,,,No ratings yet Rate it yourself - /Services/opticians/LeaveReview/DefaultView.aspx?id=OP_5FN_5847__000001_BH216DR,0,0,
Rawlings Opticians,OP_5E9_6187__000001_SO249AT,OPT,Bay Tree House,26 West Street,Alresford,Hampshire,,SO24 9AT,Tel: 01962 733269, - ,,,No ratings yet Rate it yourself - /Services/opticians/LeaveReview/DefaultView.aspx?id=OP_5E9_6187__000001_SO249AT,0,0,
Matheson Optometrists,OP_5E9_572__000001_SO249AG,OPT,1-3 West Street,,,Alresford,,SO24 9AG,Tel: 01962 732336, - ,,,No ratings yet Rate it yourself - /Services/opticians/LeaveReview/DefaultView.aspx?id=OP_5E9_572__000001_SO249AG,0,0,
Malik and Collins Limited,OP_5LX_8235__000001_SO319GQ,OPT,4 Shore Road,Warsash,Southampton,Hampshire,,SO31 9GQ,Tel: 01489 576947, - ,,,No ratings yet Rate it yourself - /Services/opticians/LeaveReview/DefaultView.aspx?id=OP_5LX_8235__000001_SO319GQ,0,0,
Rex Wingate & Partners,OP_5LX_732__000001_SO311BB,OPT,60-62 Botley Road,,Park Gate,Hampshire,,SO31 1BB,Tel: 01489 584169, - ,,,No ratings yet Rate it yourself - /Services/opticians/LeaveReview/DefaultView.aspx?id=OP_5LX_732__000001_SO311BB,0,0,
Wingate Rex & Partners,SO3 7BB__000001_SO37BB,OPT,60 Botley Road,Park Gate,Portsmouth,Hants,,SO3 7BB,Tel: 01489 584169, - ,,,No ratings yet Rate it yourself - /Services/opticians/LeaveReview/DefaultView.aspx?id=SO3 7BB__000001_SO37BB,0,0,
20/20 Vision (Super Optical) Ltd,OP_5LX_14829__000001_SO317GE,OPT,20 Bridge Road,,Park Gate,Hampshire,,SO31 7GE,Tel: 01489 573300, - ,,,No ratings yet Rate it yourself - /Services/opticians/LeaveReview/DefaultView.aspx?id=OP_5LX_14829__000001_SO317GE,0,0,
Specsavers Limited,OPT_PO157PD_1,OPT,,Unit 4G Whiteley Shopping Centre,,Fareham,,PO15 7PD,, - ,,,No ratings yet Rate it yourself - /Services/opticians/LeaveReview/DefaultView.aspx?id=OPT_PO157PD_1,0,0,
EyeStyle Centre Opticians Ltd,OP_5LX_4785__000001_SO316DX,OPT,16 Locks Heath Centre,Locks Heath,,Southampton,Hampshire,SO31 6DX,Tel: 01489 589760, - ,,,No ratings yet Rate it yourself - /Services/opticians/LeaveReview/DefaultView.aspx?id=OP_5LX_4785__000001_SO316DX,0,0,
Nicholson Eyecare,OP_5A1_14084__000001_BH238NJ,OPT,1 Runnymeade,Ringwood Road,Bransgore,,,BH23 8NJ,Tel: 01425 673343, - ,,,No ratings yet Rate it yourself - /Services/opticians/LeaveReview/DefaultView.aspx?id=OP_5A1_14084__000001_BH238NJ,0,0,
Sue Wassall Optometrist,OP_5E9_3716__000001_PO175JW,OPT,"Knights Chambers, The Square",Wickham,Fareham,,,PO17 5JW,Tel: 01329 832706, - ,,,No ratings yet Rate it yourself - /Services/opticians/LeaveReview/DefaultView.aspx?id=OP_5E9_3716__000001_PO175JW,0,0,
Scrivens Opticians,OP_5A1_14093__000001_SO419AG,OPT,,100 High Street,,Lymington,Hampshire,SO41 9AP,Tel: 01590 672645, - ,,,No ratings yet Rate it yourself - /Services/opticians/LeaveReview/DefaultView.aspx?id=OP_5A1_14093__000001_SO419AG,0,0,
Vision Express ,OP_5A1_14090__000001_SO419AJ,OPT,95 High Street,,Lymington,Hampshire,,SO41 9AP,Tel: 01590 677722, - ,,,No ratings yet Rate it yourself - /Services/opticians/LeaveReview/DefaultView.aspx?id=OP_5A1_14090__000001_SO419AJ,0,0,
Specsavers,OP_SO419AL_34942,OPT,,71 High Street,,Lymington,,SO41 9AL,, - ,,,No ratings yet Rate it yourself - /Services/opticians/LeaveReview/DefaultView.aspx?id=OP_SO419AL_34942,0,0,
Boots-Lymington,OP_5A1_14091__000001_SO419AF,OPT,35 High Street,,Lymington,Hampshire,,SO41 9AF,Tel: 01590 671655, - ,,,No ratings yet Rate it yourself - /Services/opticians/LeaveReview/DefaultView.aspx?id=OP_5A1_14091__000001_SO419AF,0,0,
S J Hussey Opticians,OP_5K4_12376__000002_SN95AQ,OPT,2 Old Ford Court,,Pewsey,Wiltshire,,SN9 5AQ,Tel: 01672 564617, - ,,,No ratings yet Rate it yourself - /Services/opticians/LeaveReview/DefaultView.aspx?id=OP_5K4_12376__000002_SN95AQ,0,0,
Hassan-Hicks Opticians,OP_5A1_14092__000001_SO419NB,OPT,18 St. Thomas Street,,Lymington,Hampshire,,SO41 9NB,Tel: 01590 675576, - ,,,No ratings yet Rate it yourself - /Services/opticians/LeaveReview/DefaultView.aspx?id=OP_5A1_14092__000001_SO419NB,0,0,