Organisation Name,NACS Code,Organisation Type,Address1,Address2,Address3,Address4,Address5,PostCode,Telephone Number,Opening time,Value  (Opening time),Banding Classification  (Opening time),NHS.UK users rating,Value  (NHS.UK users rating),Banding Classification  (NHS.UK users rating),Car parking (Is there car parking at this organisation?)
Robert Frith Optometrists ,OP_5FX_6962__000002_BA69DZ,OPT,74 High Street,Glastonbury,Somerset,,,BA6 9DZ,Tel: 01458 832212, - ,,,No ratings yet Rate it yourself - /Services/opticians/LeaveReview/DefaultView.aspx?id=OP_5FX_6962__000002_BA69DZ,0,0,
Eye Tech Opticians,OP_5FX_11123__000001_BA160EG,OPT,100 High Street,Street,,Somerset,,BA16 0EG,Tel: 01458 442178, - ,,,No ratings yet Rate it yourself - /Services/opticians/LeaveReview/DefaultView.aspx?id=OP_5FX_11123__000001_BA160EG,0,0,
Specsavers Opticians,OP_5QL_999__000002_BA160EZ,OPT,93 High Street,,,Street,,BA16 0EZ,Tel: 01458 449400, - ,,,No ratings yet Rate it yourself - /Services/opticians/LeaveReview/DefaultView.aspx?id=OP_5QL_999__000002_BA160EZ,0,0,
Boots-Street,OP_5FX_14659__000001_BA160EX,OPT,141A High Street,,,Street,Somerset,BA16 0EX,Tel: 01458 442434, - ,,,No ratings yet Rate it yourself - /Services/opticians/LeaveReview/DefaultView.aspx?id=OP_5FX_14659__000001_BA160EX,0,0,
David & Sandra Millican Opticians,OP_5FX_8575__000001_BA52AQ,OPT,75 High Street,Wells,Somerset,,,BA5 2AQ,Tel: 01749 673991, - ,,,No ratings yet Rate it yourself - /Services/opticians/LeaveReview/DefaultView.aspx?id=OP_5FX_8575__000001_BA52AQ,0,0,
R A Mansfield Opticians,OP_5FX_4104__000001_BA52AG,OPT,65 High Street,Wells,Somerset,,,BA5 2AG,Tel: 01749 672229, - ,,,No ratings yet Rate it yourself - /Services/opticians/LeaveReview/DefaultView.aspx?id=OP_5FX_4104__000001_BA52AG,0,0,
Rogers Optical (trading as Boots Opticians),01-26179,OPT,,66 High Street,,Somerset,,BA5 2AJ,, - ,,,1 rating Rate it yourself - /Services/opticians/LeaveReview/DefaultView.aspx?id=01-26179,,,
Vision Express (UK) Ltd,OPL 1405QL__000001_BA52AE,OPT,43 High Street,,,Wells,,BA5 2AE,Tel: 01749 674111, - ,,,No ratings yet Rate it yourself - /Services/opticians/LeaveReview/DefaultView.aspx?id=OPL 1405QL__000001_BA52AE,0,0,
Specsavers,OP_5FX_9046__000001_BA52SN,OPT,60a High Street,Wells,Somerset,,,BA5 2SN,Tel: 01749 673 694, - ,,,1 rating Rate it yourself - /Services/opticians/LeaveReview/DefaultView.aspx?id=OP_5FX_9046__000001_BA52SN,,,
Christopher Young Optometrists,OP_5FX_2045__000001_BA45AS,OPT,46 High Street,Shepton Mallet,Somerset,,,BA4 5AS,Tel: 01749 345259, - ,,,1 rating Rate it yourself - /Services/opticians/LeaveReview/DefaultView.aspx?id=OP_5FX_2045__000001_BA45AS,,,
Robert Frith Optometrists,OP_5K1_1670__000002_BA77BG,OPT,Fore Street,Castle Cary,Somerset,Somerset,,BA7 7BG,Tel: 01963 351948, - ,,,No ratings yet Rate it yourself - /Services/opticians/LeaveReview/DefaultView.aspx?id=OP_5K1_1670__000002_BA77BG,0,0,
N K Opticians,CO - 3455__000002_BS273NA,OPT,Myrtle House,Bath Street,Cheddar,Somerset,,BS27 3AA,Tel: 01934 743723, - ,,,1 rating Rate it yourself - /Services/opticians/LeaveReview/DefaultView.aspx?id=CO - 3455__000002_BS273NA,,,
Earlam & Christopher,OP_5K1_3350__000001_TA109RH,OPT,38 North Street,Langport,Somerset,Langport,,TA10 9RH,Tel: 01458 250793, - ,,,No ratings yet Rate it yourself - /Services/opticians/LeaveReview/DefaultView.aspx?id=OP_5K1_3350__000001_TA109RH,0,0,
Eye Tech Opticians,OP_5FL_8611__000001_BA32HQ,OPT,6 The Island,Midsomer Norton,Bath,,,BA3 2HQ,Tel: 01761 414136, - ,,,No ratings yet Rate it yourself - /Services/opticians/LeaveReview/DefaultView.aspx?id=OP_5FL_8611__000001_BA32HQ,0,0,
Edwards Opticians Ltd,OP_5FL_14818__000001_BA32HW,OPT,2 Mansbrook House,15 High Street,,Midsomer Norton,,BA3 2HW,Tel: 01761 413212, - ,,,No ratings yet Rate it yourself - /Services/opticians/LeaveReview/DefaultView.aspx?id=OP_5FL_14818__000001_BA32HW,0,0,
Sarah Gibson Optometrist ,OP_5K1_6438__000001_BA99LP,OPT,Commerce House,Market Place,,Wincanton,Somerset,BA9 9LP,Tel: 01963 34333, - ,,,1 rating Rate it yourself - /Services/opticians/LeaveReview/DefaultView.aspx?id=OP_5K1_6438__000001_BA99LP,,,
Scrivens Opticians ,OP_5FL_575__000001_BA32DW,OPT,,26 High Street,Bath,Midsomer Norton,,BA3 2DW,Tel: 01761 414774, - ,,,No ratings yet Rate it yourself - /Services/opticians/LeaveReview/DefaultView.aspx?id=OP_5FL_575__000001_BA32DW,0,0,
L & M Wincanton Limited,OPT_BA99LA_1,OPT,,16 Market Place,,Wincanton,,BA9 9LA,, - ,,,No ratings yet Rate it yourself - /Services/opticians/LeaveReview/DefaultView.aspx?id=OPT_BA99LA_1,0,0,
L & M Wincanton Limited,OPT_BA99LA_2,OPT,,16 Market Place,,Wincanton,,BA9 9LA,, - ,,,No ratings yet Rate it yourself - /Services/opticians/LeaveReview/DefaultView.aspx?id=OPT_BA99LA_2,0,0,
Martock Opticians Ltd,OP_5K1_14660__000002_TA126JL,OPT,North Street,Martock,Somerset,,,TA12 6DH,Tel: 01935 824431, - ,,,2 ratings Rate it yourself - /Services/opticians/LeaveReview/DefaultView.aspx?id=OP_5K1_14660__000002_TA126JL,,,
Brock & Houlford,TP7M0,OPT,Westway Farm,Wick Road,Bishop Sutton,Bristol,,BS39 5XP,Tel: 01275 332882, - ,,,No ratings yet Rate it yourself - /Services/opticians/LeaveReview/DefaultView.aspx?id=TP7M0,0,0,
Lovat Short Optometrists,OP_5FL_14817__000002_BA33PL,OPT,2 The Street,Radstock,,Bath,,BA3 3PL,Tel: 01761 432169, - ,,,No ratings yet Rate it yourself - /Services/opticians/LeaveReview/DefaultView.aspx?id=OP_5FL_14817__000002_BA33PL,0,0,
Orriss & Low,OP_5M8_6588__000001_BS251AQ,OPT,2-4 Corner House,Corner House,Woodborough Road,Winscombe,Somerset,BS25 1AQ,Tel: 01934 843713, - ,,,No ratings yet Rate it yourself - /Services/opticians/LeaveReview/DefaultView.aspx?id=OP_5M8_6588__000001_BS251AQ,0,0,yes
Robert Frith Optometrists Yeovil,OP_5K1_3238__000001_BA201EQ,OPT,Ryburn House,28 Princes Street,,Yeovil,Somerset,BA20 1EQ,Tel: 01935 474333, - ,,,2 ratings Rate it yourself - /Services/opticians/LeaveReview/DefaultView.aspx?id=OP_5K1_3238__000001_BA201EQ,,,
Tesco Opticians,OP_5QL-126__000002_BA201DL,OPT,Queensway Place,Huish,Yeovil,Somerset,,BA20 1DL,Tel: 01935 647438, - ,,,No ratings yet Rate it yourself - /Services/opticians/LeaveReview/DefaultView.aspx?id=OP_5QL-126__000002_BA201DL,0,0,
Boots-Yeovil - Middle St,OP_5K1_2550__000003_BA201LG,OPT,,39-41 Middle Street,,Yeovil,Somerset,BA20 1LG,Tel: 01935 423 490, - ,,,No ratings yet Rate it yourself - /Services/opticians/LeaveReview/DefaultView.aspx?id=OP_5K1_2550__000003_BA201LG,0,0,
Dollond & Aitchison,OP_5K1_113__000002_BA201LG,OPT,39-41 Middle Street,Yeovil,Somerset,,,BA20 1LG,Tel: 01935 423490, - ,,,No ratings yet Rate it yourself - /Services/opticians/LeaveReview/DefaultView.aspx?id=OP_5K1_113__000002_BA201LG,0,0,
Vision Express (UK) Ltd,OP_5K1_12679__000002_BA201LX,OPT,44-46 Middle Street,Yeovil,Somerset,,,BA20 1LX,Tel: 01935 472044, - ,,,No ratings yet Rate it yourself - /Services/opticians/LeaveReview/DefaultView.aspx?id=OP_5K1_12679__000002_BA201LX,0,0,
Specsavers Opticians,OP_5K1_38__000001_BA201LX,OPT,50-52 Middle Street,Yeovil,,Somerset,,BA20 1LX,Tel: 01935 410040, - ,,,1 rating Rate it yourself - /Services/opticians/LeaveReview/DefaultView.aspx?id=OP_5K1_38__000001_BA201LX,,,
East Quay Vision Ltd,00144__000003_TA64GP,OPT,East Quay Medical Centre,East Quay,,Bridgwater,,TA6 4GP,Tel: 01278 440440, - ,,,2 ratings Rate it yourself - /Services/opticians/LeaveReview/DefaultView.aspx?id=00144__000003_TA64GP,,,yes
Boots-Bridgewater,OP_5FW_5633__000002_TA63NG,OPT,34-38 Fore Street,,,Bridgwater,Somerset,TA6 3NG,Tel: 01278 423210, - ,,,No ratings yet Rate it yourself - /Services/opticians/LeaveReview/DefaultView.aspx?id=OP_5FW_5633__000002_TA63NG,0,0,
Paul White Opticians,OP_5FW_14658__000001_TA63LY,OPT,50 St Mary Street,Bridgwater,Somerset,Somerset,,TA6 3LY,Tel: 01278 421225, - ,,,1 rating Rate it yourself - /Services/opticians/LeaveReview/DefaultView.aspx?id=OP_5FW_14658__000001_TA63LY,,,
Scrivens Ltd,OP_5CD_7192__000001_DT93BJ,OPT,44 Cheap Street,,,Sherbourne,Dorset,DT9 3PX,Tel: 01935 812971, - ,,,No ratings yet Rate it yourself - /Services/opticians/LeaveReview/DefaultView.aspx?id=OP_5CD_7192__000001_DT93BJ,0,0,
Specsavers,OP_5FW_11799__000001_TA63BH,OPT,Unit 3 Royal Clarence House,High Street,Bridgwater,Somerset,,TA6 3BH,Tel: 01278 452245, - ,,,1 rating Rate it yourself - /Services/opticians/LeaveReview/DefaultView.aspx?id=OP_5FW_11799__000001_TA63BH,,,
Vision Express UK Ltd,OP_5CD_2784__000001_DT93AX,OPT,57 Cheap Street,,Sherborne,,,DT9 3AX,Tel: 01935 812105, - ,,,No ratings yet Rate it yourself - /Services/opticians/LeaveReview/DefaultView.aspx?id=OP_5CD_2784__000001_DT93AX,0,0,
Matthews Opticians - Sherborne,OP_5CD_2683__000001_DT93NL,OPT,1 Tilton Court,Digby Road,,SHERBORNE,Dorset,DT9 3NL,Tel: 01935 813355, - ,,,No ratings yet Rate it yourself - /Services/opticians/LeaveReview/DefaultView.aspx?id=OP_5CD_2683__000001_DT93NL,0,0,
Brock & Houlford,OP_5FL_10314__000001_BS408PR,OPT,33 High Street,Chew Magna,Bristol,,,BS40 8PR,Tel: 01275 332882, - ,,,No ratings yet Rate it yourself - /Services/opticians/LeaveReview/DefaultView.aspx?id=OP_5FL_10314__000001_BS408PR,0,0,
Home Care Community Opticians (J2NA Ltd),00281__000002_DT93RQ,OPT,Old Yarn Business Centre,Westbury,Sherborne,Dorset,,DT9 3RQ,Tel: 01935 813800, - ,,,No ratings yet Rate it yourself - /Services/opticians/LeaveReview/DefaultView.aspx?id=00281__000002_DT93RQ,0,0,
Turners Optometrists,OP_5FW_386__000001_TA67DR,OPT,Aspen House,67 Wembdon Road,Bridgwater,Somerset,,TA6 7DR,Tel: 01278 422978, - ,,,No ratings yet Rate it yourself - /Services/opticians/LeaveReview/DefaultView.aspx?id=OP_5FW_386__000001_TA67DR,0,0,
Marian Donovan Optometrist,OP_5M8_14820__000001_BS405LD,OPT,Broad Street,,Wrington,North Somerset,,BS40 5LD,Tel: 01934 862933, - ,,,No ratings yet Rate it yourself - /Services/opticians/LeaveReview/DefaultView.aspx?id=OP_5M8_14820__000001_BS405LD,0,0,yes
Specsavers,OP_5QL_71__000001_TA81NX,OPT,3 High Street,,Burnham On Sea,Somerset,,TA8 1NX,Tel: 01278 765460, - ,,,No ratings yet Rate it yourself - /Services/opticians/LeaveReview/DefaultView.aspx?id=OP_5QL_71__000001_TA81NX,0,0,
Eye-Tech Opticians,OP_5FX_13589__000001_BA111AH,OPT,25 Market Place,Frome,,Somerset,,BA11 1AH,Tel: 01373 462573, - ,,,No ratings yet Rate it yourself - /Services/opticians/LeaveReview/DefaultView.aspx?id=OP_5FX_13589__000001_BA111AH,0,0,
A H Meyrick Ltd,OP_5FW_7499__000001_TA81PA,OPT,31 High Street,Burnham-on-Sea,,Somerset,,TA8 1PA,Tel: 01278 782034, - ,,,No ratings yet Rate it yourself - /Services/opticians/LeaveReview/DefaultView.aspx?id=OP_5FW_7499__000001_TA81PA,0,0,
Boots-Frome,OP_5FX_12891__000001_BA111BN,OPT,3 Cheap Street,,,Frome,Somerset,BA11 1BN,Tel: 01373 462031, - ,,,No ratings yet Rate it yourself - /Services/opticians/LeaveReview/DefaultView.aspx?id=OP_5FX_12891__000001_BA111BN,0,0,
D J Bull,OP_5FW_13584__000002_TA81PB,OPT,41 High Street,Burnham On Sea,Somerset,,,TA8 1PB,Tel: 01278 785743, - ,,,No ratings yet Rate it yourself - /Services/opticians/LeaveReview/DefaultView.aspx?id=OP_5FW_13584__000002_TA81PB,0,0,
Specsavers Opticians,OP_5FX_7746__000002_BA111BS,OPT,19 Westway Centre,Frome,,Somerset,,BA11 1BS,Tel: 01373 451180, - ,,,No ratings yet Rate it yourself - /Services/opticians/LeaveReview/DefaultView.aspx?id=OP_5FX_7746__000002_BA111BS,0,0,
O'toid Opticians,01-19886,OPT,,5 The Bridge,,Frome,,BA11 1AR,Tel: 01373 467467, - ,,,No ratings yet Rate it yourself - /Services/opticians/LeaveReview/DefaultView.aspx?id=01-19886,0,0,
Grace Haine Eyecare Ltd,OP_DT102LZ_34883,OPT,,1 Skye House,Ring Street,STALBRIDGE,Dorset,DT10 2LZ,Tel: 01963 362775, - ,,,No ratings yet Rate it yourself - /Services/opticians/LeaveReview/DefaultView.aspx?id=OP_DT102LZ_34883,0,0,yes
Bell & Stenton Ltd,OP_5M8_11852__000001_BS494HJ,OPT,52 High Street,Yatton,North Somerset,,,BS49 4HJ,Tel: 01934 838818, - ,,,No ratings yet Rate it yourself - /Services/opticians/LeaveReview/DefaultView.aspx?id=OP_5M8_11852__000001_BS494HJ,0,0,
Robert Frith Opticians Ltd,OP_5CD_13759__000001_SP84AA,OPT,Fairfield House,36 High Street,,GILLINGHAM,Dorset,SP8 4AA,Tel: 01747 825122, - ,,,1 rating Rate it yourself - /Services/opticians/LeaveReview/DefaultView.aspx?id=OP_5CD_13759__000001_SP84AA,,,
Richard Stent Optometrist,OP_5K1_2332__000001_TA190AH,OPT,Cornhill,Market Square,,Ilminster,,TA19 0AS,Tel: 01460 53921, - ,,,4 ratings Rate it yourself - /Services/opticians/LeaveReview/DefaultView.aspx?id=OP_5K1_2332__000001_TA190AH,,,
Stephen Bryson Opticians,OP_5M8_13183__000001_BS226JD,OPT,184a High Street,Worle,North Somerset,,,BS22 6JD,Tel: 01934 512838, - ,,,No ratings yet Rate it yourself - /Services/opticians/LeaveReview/DefaultView.aspx?id=OP_5M8_13183__000001_BS226JD,0,0,
Bowen Opticians,OP_5M8_8094__000001_BS226HQ,OPT,135 High Street,Worle,North Somerset,,,BS22 6HQ,Tel: 01934 520520, - ,,,No ratings yet Rate it yourself - /Services/opticians/LeaveReview/DefaultView.aspx?id=OP_5M8_8094__000001_BS226HQ,0,0,
Bowen Opticians,OP_5M8_13133__000002_BS233SS,OPT,,135 High Street,Worle,Weston-super-Mare,Avon,BS22 6HQ,Tel: 01934 520520, - ,,,No ratings yet Rate it yourself - /Services/opticians/LeaveReview/DefaultView.aspx?id=OP_5M8_13133__000002_BS233SS,0,0,
Dury & Shaw Ltd,OP_5JG_9432__000002_BS140SX,OPT,5 Asda Centre,Oatlands Avenue,Bristol,,,BS14 0SX,Tel: 01275 839331, - ,,,No ratings yet Rate it yourself - /Services/opticians/LeaveReview/DefaultView.aspx?id=OP_5JG_9432__000002_BS140SX,0,0,
Robert Frith Optometrists,OP_5K1_3632__000002_TA187JY,OPT,4 Market Street,4 Market Street,Somerset,Crewkerne,,TA18 7JY,Tel: 01460 72964, - ,,,1 rating Rate it yourself - /Services/opticians/LeaveReview/DefaultView.aspx?id=OP_5K1_3632__000002_TA187JY,,,
Simon Goldsmith,OP_5JG_9484__000002_BS148PG,OPT,70 Hollway Road,Stockwood,Bristol,,,BS14 8PG,Tel: 01275 838532, - ,,,No ratings yet Rate it yourself - /Services/opticians/LeaveReview/DefaultView.aspx?id=OP_5JG_9484__000002_BS148PG,0,0,
Vision Express,OP_5K1_5143__000001_TA188DA,OPT,23 South Street,Crewkerne,,Somerset,,TA18 8DA,Tel: 01460 72333, - ,,,No ratings yet Rate it yourself - /Services/opticians/LeaveReview/DefaultView.aspx?id=OP_5K1_5143__000001_TA188DA,0,0,
Armstrong & North ,OP_5M8_148__000001_BS231TR,OPT,,55c Oxford Street,,Weston Super Mare,,BS23 1TR,Tel: 01934 626579, - ,,,No ratings yet Rate it yourself - /Services/opticians/LeaveReview/DefaultView.aspx?id=OP_5M8_148__000001_BS231TR,0,0,
Iris Eye Care Optometrists ,GOC CO-3924,OPT,,"Birdwell Clinic, 33 Weston Road",,"Birdwell Clinic, 33 Weston Road",,BS41 9AA,Tel: 01275 393149 (ext. 0789154552), - ,,,No ratings yet Rate it yourself - /Services/opticians/LeaveReview/DefaultView.aspx?id=GOC CO-3924,0,0,yes
Vision Call (Bristol) Ltd,CO- 2321/5FL__000001_BS419LB,OPT,Yanley Court,Long Ashton Business Park,Long Ashton,North Somerset,,BS41 9LB,Tel: 01275 393 507, - ,,,No ratings yet Rate it yourself - /Services/opticians/LeaveReview/DefaultView.aspx?id=CO- 2321/5FL__000001_BS419LB,0,0,
NK Opticians,OP_5M8_6391__000001_BS231QH,OPT,40 Meadow Street,Weston-Super-Mare,North Somerset,,,BS23 1QH,Tel: 01934 628820, - ,,,No ratings yet Rate it yourself - /Services/opticians/LeaveReview/DefaultView.aspx?id=OP_5M8_6391__000001_BS231QH,0,0,
Darlingtons,OP_5M8_14816__000002_BS231QH,OPT,44 Meadow Street,Weston-Super-Mare,North Somerset,,,BS23 1QH,Tel: 01934 631539, - ,,,No ratings yet Rate it yourself - /Services/opticians/LeaveReview/DefaultView.aspx?id=OP_5M8_14816__000002_BS231QH,0,0,
Boots-Weston-Super-Mare,OP_5M8_5109__000002_BS231HD,OPT,37 High Street,,,Weston Super Mare,,BS23 1HD,Tel: 01934 629 852, - ,,,2 ratings Rate it yourself - /Services/opticians/LeaveReview/DefaultView.aspx?id=OP_5M8_5109__000002_BS231HD,,,
Greenslade Opticians,OP_5M8_12325__000001_BS231HD,OPT,51 High Street,Weston-Super-Mare,North Somerset,,,BS23 1HD,Tel: 01934 629755, - ,,,No ratings yet Rate it yourself - /Services/opticians/LeaveReview/DefaultView.aspx?id=OP_5M8_12325__000001_BS231HD,0,0,
Optika,OP_5M8_518__000001_BS231HL,OPT,81 The High Street,,,"Weston-Super-Mare, North Somerset",,BS23 1HE,Tel: 01934 642909, - ,,,No ratings yet Rate it yourself - /Services/opticians/LeaveReview/DefaultView.aspx?id=OP_5M8_518__000001_BS231HL,0,0,
Specsavers Opticians,OP_5M8_8224__000001_BS231HE,OPT,75 High Street,Weston-Super-Mare,North Somerset,,,BS23 1HE,Tel: 01934 642140, - ,,,No ratings yet Rate it yourself - /Services/opticians/LeaveReview/DefaultView.aspx?id=OP_5M8_8224__000001_BS231HE,0,0,
Brignall & Partners,OP_5FL_8625__000001_BS312UA,OPT,36 West View Road,Keynsham,Bristol,,,BS31 2UA,Tel: 0117 986 2147, - ,,,No ratings yet Rate it yourself - /Services/opticians/LeaveReview/DefaultView.aspx?id=OP_5FL_8625__000001_BS312UA,0,0,
Specsavers Opticians,OP_5FL_8988__000001_BS311EG,OPT,12 Temple Street,Keynsham,Bristol,,,BS31 1EG,Tel: 0117 986 6226, - ,,,4 ratings Rate it yourself - /Services/opticians/LeaveReview/DefaultView.aspx?id=OP_5FL_8988__000001_BS311EG,,,
Lee Opticians Limited,OP_5FL_14819__000002_BS311DS,OPT,41 High Street,Keynsham,Bristol,,,BS31 1DS,, - ,,,No ratings yet Rate it yourself - /Services/opticians/LeaveReview/DefaultView.aspx?id=OP_5FL_14819__000002_BS311DS,0,0,
Norville Opticians,OP_5FL_39__000001_BS311EB,OPT,69 High Street,Keynsham,,Bristol,Avon,BS31 1DS,Tel: 0117 9865066, - ,,,No ratings yet Rate it yourself - /Services/opticians/LeaveReview/DefaultView.aspx?id=OP_5FL_39__000001_BS311EB,0,0,
Boots-Keynsham,OP_5FL_1599__000001_BS311DP,OPT,17 High Street,,,Keynsham,Avon,BS31 1DP,Tel: 0117 986 2278 (ext. 2), - ,,,1 rating Rate it yourself - /Services/opticians/LeaveReview/DefaultView.aspx?id=OP_5FL_1599__000001_BS311DP,,,
Bath Opticians,OP_5FL_4068__000002_BA23PN,OPT,Bath Opticians,57 Moorland Road,Oldfield Park,Bath,,BA2 3PJ,Tel: 01225 427353, - ,,,1 rating Rate it yourself - /Services/opticians/LeaveReview/DefaultView.aspx?id=OP_5FL_4068__000002_BA23PN,,,yes
Asda Opticians Ltd ,CO-2058 5QL__000002_TA12AN,OPT,Creechbarrow Road,,Taunton,Somerset,,TA1 2AN,Tel: 01823 448020, - ,,,1 rating Rate it yourself - /Services/opticians/LeaveReview/DefaultView.aspx?id=CO-2058 5QL__000002_TA12AN,,,
Sight Centres Ltd,OP_5M8_7558__000001_BS481RG,OPT,14 Colliers Walk,Nailsea,Bristol,,,BS48 1RG,Tel: 01275 810301, - ,,,No ratings yet Rate it yourself - /Services/opticians/LeaveReview/DefaultView.aspx?id=OP_5M8_7558__000001_BS481RG,0,0,
Boots-Nailsea,OP_5M8_12555__000002_BS481RQ,OPT,1-2 Colliers Walk,Crown Glass Shopping Centre,,Nailsea,Somerset,BS48 1RH,Tel: 01275 856074, - ,,,No ratings yet Rate it yourself - /Services/opticians/LeaveReview/DefaultView.aspx?id=OP_5M8_12555__000002_BS481RQ,0,0,
Specsavers,OP_5M8_14822__000002_BS481RP,OPT,2 Somerset Square,Nailsea,North Somerset,,,BS48 1RP,Tel: 01275 850950, - ,,,No ratings yet Rate it yourself - /Services/opticians/LeaveReview/DefaultView.aspx?id=OP_5M8_14822__000002_BS481RP,0,0,
Sight Centres,OP_5JG_5944__000001_BS42RA,OPT,17 Broad Walk,,Bristol,,,BS4 2RA,Tel: 0117 977 2579, - ,,,No ratings yet Rate it yourself - /Services/opticians/LeaveReview/DefaultView.aspx?id=OP_5JG_5944__000001_BS42RA,0,0,
Lynne Fernandes Optometrists,OP_5M8_14821__000001_BS481AW,OPT,124a High Street,Nailsea,,North Somerset,,BS48 1AH,Tel: 01275 854946, - ,,,2 ratings Rate it yourself - /Services/opticians/LeaveReview/DefaultView.aspx?id=OP_5M8_14821__000001_BS481AW,,,
Armstrong and North Opticians,OP_5FL_2841__000001_BA14BX,OPT,,13 Chelsea Road,Lower Weston,Bath,Avon,BA1 3DU,Tel: 01225 466110, - ,,,1 rating Rate it yourself - /Services/opticians/LeaveReview/DefaultView.aspx?id=OP_5FL_2841__000001_BA14BX,,,
David Phillips Opticians,OP_5JG_7618__000002_BS31JD,OPT,230 North Street,Bedminster,Bristol,,,BS3 1JD,Tel: 0117 963 5477, - ,,,No ratings yet Rate it yourself - /Services/opticians/LeaveReview/DefaultView.aspx?id=OP_5JG_7618__000002_BS31JD,0,0,
David Phillips Opticians,OP_5JG_11857__000001_BS31JJ,OPT,230 North Street,Bedminister,Bristol,,,BS3 1JB,Tel: 0117 966 3417, - ,,,1 rating Rate it yourself - /Services/opticians/LeaveReview/DefaultView.aspx?id=OP_5JG_11857__000001_BS31JJ,,,
Scrivens,OP_5JG_10172__000002_BS34EY,OPT,100 East Street,Bedminster,,Bristol,Avon,BS3 4EY,Tel: 0117 963 7105, - ,,,No ratings yet Rate it yourself - /Services/opticians/LeaveReview/DefaultView.aspx?id=OP_5JG_10172__000002_BS34EY,0,0,
Royal United Hospital,OP_5FL_9076__000001_BA13NG,OPT,Eye Clinic,Combe Park,Bath,,,BA1 3NG,Tel: 01225 428331, - ,,,No ratings yet Rate it yourself - /Services/opticians/LeaveReview/DefaultView.aspx?id=OP_5FL_9076__000001_BA13NG,0,0,
Department of Ophthalmology,OP_5FL_1469__000002_BA13NG,OPT,Royal United Hospital,Combe Park,Bath,,,BA1 3NG,Tel: 01225 824609, - ,,,No ratings yet Rate it yourself - /Services/opticians/LeaveReview/DefaultView.aspx?id=OP_5FL_1469__000002_BA13NG,0,0,
Lynne Fernandes Optometrists,OP_5JG_6422__000002_BS42AL,OPT,182a Wells Road,Knowle,,Bristol,,BS4 2AL,Tel: 0117 977 6330, - ,,,2 ratings Rate it yourself - /Services/opticians/LeaveReview/DefaultView.aspx?id=OP_5JG_6422__000002_BS42AL,,,
Specsavers Opticians,OP_5JG_12494__000001_BS34HH,OPT,9 Imperial Parade,East Street,Bristol,,,BS3 4HH,Tel: 0117 966 4000, - ,,,No ratings yet Rate it yourself - /Services/opticians/LeaveReview/DefaultView.aspx?id=OP_5JG_12494__000001_BS34HH,0,0,
Boots Opticians Ltd,OP_5FL_1146__000002_BA11TA,OPT,1 Marchants Passage,,Bath,,,BA1 1TA,Tel: 01225 465270, - ,,,No ratings yet Rate it yourself - /Services/opticians/LeaveReview/DefaultView.aspx?id=OP_5FL_1146__000002_BA11TA,0,0,
Boots-Bath - Southgate Centre,BA1 1AT_27361,OPT,,"Southgate Centre, 1 Newark Street",,Bath,Avon,BA1 1AT,Tel: 01225 464033, - ,,,2 ratings Rate it yourself - /Services/opticians/LeaveReview/DefaultView.aspx?id=BA1 1AT_27361,,,
Optical Express,BA1 1TG_12345,OPT,56 Southgate Street,,,Bath,Somerset,BA1 1TG,Tel: 0800 023 2020, - ,,,No ratings yet Rate it yourself - /Services/opticians/LeaveReview/DefaultView.aspx?id=BA1 1TG_12345,0,0,
Vision Express (UK) Ltd,OP_5FL_1966__000001_BA11TG,OPT,53 Southgate,,Bath,,,BA1 1TG,Tel: 01225 313422, - ,,,No ratings yet Rate it yourself - /Services/opticians/LeaveReview/DefaultView.aspx?id=OP_5FL_1966__000001_BA11TG,0,0,
Specs Savers,OP_5JG_9205__000001_BS34JY,OPT,East Street,Bedminster,Bristol,,,BS3 4JY,Tel: 0117 9231839, - ,,,No ratings yet Rate it yourself - /Services/opticians/LeaveReview/DefaultView.aspx?id=OP_5JG_9205__000001_BS34JY,0,0,
M&S Opticians,K8J7A,OPT,M&S,16-18 Stall Street,,Bath,Somerset,BA1 1QB,Tel: 01225 437 733, - ,,,No ratings yet Rate it yourself - /Services/opticians/LeaveReview/DefaultView.aspx?id=K8J7A,0,0,
Specsavers Opticians,OP_5FL_8968__000001_BA11EQ,OPT,18 Westgate Street,,Bath,Avon,,BA1 1EQ,Tel: 01225 463 489, - ,,,No ratings yet Rate it yourself - /Services/opticians/LeaveReview/DefaultView.aspx?id=OP_5FL_8968__000001_BA11EQ,0,0,
Batemans Opticians,OP_5FL_4624__000001_BA11LY,OPT,6 Abbey Churchyard,,Bath,,,BA1 1LY,Tel: 01225 464365, - ,,,No ratings yet Rate it yourself - /Services/opticians/LeaveReview/DefaultView.aspx?id=OP_5FL_4624__000001_BA11LY,0,0,
Kathryn Anthony Opticians,OP_5FL_5458__000001_BA11LA,OPT,16 Pierrepont Street,,Bath,,,BA1 1LA,Tel: 01225 464433, - ,,,No ratings yet Rate it yourself - /Services/opticians/LeaveReview/DefaultView.aspx?id=OP_5FL_5458__000001_BA11LA,0,0,
C M Lea (Opticians) Ltd,OP_5JG_4375__000001_BS43PF,OPT,38 Sandy Park Road,Brislington,Bristol,,,BS4 3PF,Tel: 0117 9776202, - ,,,No ratings yet Rate it yourself - /Services/opticians/LeaveReview/DefaultView.aspx?id=OP_5JG_4375__000001_BS43PF,0,0,
Boots-Bath - Upper Borough Walls,OP_5FL_7015__000001_BA11RG,OPT,28 Upper Borough Walls,,,Bath,Avon,BA1 1RG,Tel: 01225 465 861, - ,,,No ratings yet Rate it yourself - /Services/opticians/LeaveReview/DefaultView.aspx?id=OP_5FL_7015__000001_BA11RG,0,0,
Brad Abrahams Optometry ,2008151055,OPT,,Brad Abrahams Optometry,2 Upper Borough Walls,Bath,,BA1 1RG,Tel: 01225 444321, - ,,,1 rating Rate it yourself - /Services/opticians/LeaveReview/DefaultView.aspx?id=2008151055,,,