Organisation Name,NACS Code,Organisation Type,Address1,Address2,Address3,Address4,Address5,PostCode,Telephone Number,Opening time,Value  (Opening time),Banding Classification  (Opening time),NHS.UK users rating,Value  (NHS.UK users rating),Banding Classification  (NHS.UK users rating),Car parking (Is there car parking at this organisation?)
A Stodel Optometrist,OP_5G1_7182__000002_IP223LB,OPT,15 Market Place,,Diss,Norfolk,,IP22 4AB,Tel: 01379 642598, - ,,,No ratings yet Rate it yourself - /Services/opticians/LeaveReview/DefaultView.aspx?id=OP_5G1_7182__000002_IP223LB,0,0,
Adkins Opticians,OP_5G1_7337__000001_IP223JZ,OPT,,2 Market Hill,,Diss,Norfolk,IP22 4JZ,Tel: 01379 650899, - ,,,1 rating Rate it yourself - /Services/opticians/LeaveReview/DefaultView.aspx?id=OP_5G1_7337__000001_IP223JZ,,,
Specsavers Opticians,060409__000001_IP224AD,OPT,9-11 Mere Street,,Diss,Norfolk,,IP22 4AD,Tel: 01379 658490, - ,,,No ratings yet Rate it yourself - /Services/opticians/LeaveReview/DefaultView.aspx?id=060409__000001_IP224AD,0,0,
Scrivens Optical Hearing,OP_5G1_37__000001_IP224AG,OPT,45 Mere Street,,,Diss,Norfolk,IP22 4AG,Tel: 01379 642739, - ,,,No ratings yet Rate it yourself - /Services/opticians/LeaveReview/DefaultView.aspx?id=OP_5G1_37__000001_IP224AG,0,0,
Cecil C Amey Ltd,OP_5G1_8186__000001_IP209AS,OPT,,33b The Thoroughfare,,Harleston,Norfolk,IP20 9AS,Tel: 01379 853504, - ,,,No ratings yet Rate it yourself - /Services/opticians/LeaveReview/DefaultView.aspx?id=OP_5G1_8186__000001_IP209AS,0,0,
Jeffery & Associates,OP_5G1_9719__000001_IP209BE,OPT,10 Old Market Place,,Harleston,,,IP20 9BE,Tel: 01379 853494, - ,,,No ratings yet Rate it yourself - /Services/opticians/LeaveReview/DefaultView.aspx?id=OP_5G1_9719__000001_IP209BE,0,0,
M Shepherd Optometrist ,V7C4R,OPT,,"1 Cooper Court, The Street",Longstratton,Norfolk,,NR15 2XG,Tel: 01508 532 669, - ,,,No ratings yet Rate it yourself - /Services/opticians/LeaveReview/DefaultView.aspx?id=V7C4R,0,0,
Martin Christopher Opticians,OP_5G1_9850__000002_NR172AH,OPT,Church Street,,Attleborough,Norfolk,,NR17 2AH,Tel: 01953 452564, - ,,,No ratings yet Rate it yourself - /Services/opticians/LeaveReview/DefaultView.aspx?id=OP_5G1_9850__000002_NR172AH,0,0,
Cecil C Amey Ltd,OP_5G1_473__000003_NR172AH,OPT,11 Church Street,,Attleborough,,,NR17 2AH,Tel: 01953 453109, - ,,,No ratings yet Rate it yourself - /Services/opticians/LeaveReview/DefaultView.aspx?id=OP_5G1_473__000003_NR172AH,0,0,
Specs Express Ltd,OP_5JV_4236__000001_NR351AW,OPT,8 Market Place,Bungay,Suffolk,,,NR35 1AW,Tel: 01986 896022, - ,,,No ratings yet Rate it yourself - /Services/opticians/LeaveReview/DefaultView.aspx?id=OP_5JV_4236__000001_NR351AW,0,0,
Martin Storey Opticians,TP90M,OPT,,3 Upper Olland Street,,Bungay,,NR35 1BD,, - ,,,No ratings yet Rate it yourself - /Services/opticians/LeaveReview/DefaultView.aspx?id=TP90M,0,0,
Cecil C Amey Ltd,OP_5G1_3108__000002_NR180BB,OPT,,10 Market Place,,Wymondham,Norfolk,NR18 0AQ,Tel: 01953 605181, - ,,,No ratings yet Rate it yourself - /Services/opticians/LeaveReview/DefaultView.aspx?id=OP_5G1_3108__000002_NR180BB,0,0,
R H Jeffery & Associates,OP_5JV_6587__000001_IP198AF,OPT,4-5 Rectory Street,Halesworth,Suffolk,,,IP19 8AF,Tel: 01986 872116, - ,,,No ratings yet Rate it yourself - /Services/opticians/LeaveReview/DefaultView.aspx?id=OP_5JV_6587__000001_IP198AF,0,0,
Abbott & Murdoch Opticians,OP_5G1_13933__000002_NR147JR,OPT,4 The Street,,Poringland,NORWICH,Norfolk,NR14 7JR,Tel: 01508 494670, - ,,,1 rating Rate it yourself - /Services/opticians/LeaveReview/DefaultView.aspx?id=OP_5G1_13933__000002_NR147JR,,,
Country Vision,OP_5JR_13690__000001_IP139AN,OPT,11a Market Hill,,Framlingham,Suffolk,,IP13 9AN,Tel: 01728 621250, - ,,,3 ratings Rate it yourself - /Services/opticians/LeaveReview/DefaultView.aspx?id=OP_5JR_13690__000001_IP139AN,,,
 Cecil C Amey Ltd,OP_5JV_9960__000001_IP198AR,OPT,49 Thoroughfare,,Halesworth,Suffolk,,IP19 8AR,Tel: 01986 872122, - ,,,1 rating Rate it yourself - /Services/opticians/LeaveReview/DefaultView.aspx?id=OP_5JV_9960__000001_IP198AR,,,
Healthcall Optical Services Ltd,OP_5G1_6799__000001_NR46XB,OPT,Suite 5,Cringleford Business Centre,Intwood,,,NR4 6XB,Tel: 01603 455197, - ,,,No ratings yet Rate it yourself - /Services/opticians/LeaveReview/DefaultView.aspx?id=OP_5G1_6799__000001_NR46XB,0,0,
Coe  Costa & Moore,OP_5A2_5284__000001_NR46NW,OPT,Eaton Centre -  Church Lane,Eaton,Norwich,,,NR4 6NW,Tel: 01603 501260, - ,,,2 ratings Rate it yourself - /Services/opticians/LeaveReview/DefaultView.aspx?id=OP_5A2_5284__000001_NR46NW,,,
A S Pennington,OP_5G1_6837__000001_NR146NA,OPT,25 Bridge Street,,Loddon,,,NR14 6NA,Tel: 01508 520783, - ,,,No ratings yet Rate it yourself - /Services/opticians/LeaveReview/DefaultView.aspx?id=OP_5G1_6837__000001_NR146NA,0,0,
Norfolk Ophthalmics Ltd,OPTICIAN_10092013,OPT,MOBILE OPTICIAN,26 Cambridge Street,,Norwich,Norfolk,NR2 2BB,Tel: 01603 469572, - ,,,1 rating Rate it yourself - /Services/opticians/LeaveReview/DefaultView.aspx?id=OPTICIAN_10092013,,,
Scrivens Optical Hearing,OP_5A2_10746__000001_NR13AE,OPT,231 Queens Road,,Norwich,Norfolk,,NR1 3AE,Tel: 0121 456 8700, - ,,,No ratings yet Rate it yourself - /Services/opticians/LeaveReview/DefaultView.aspx?id=OP_5A2_10746__000001_NR13AE,0,0,
Oculus Contact Lens Centre,OP_5A2_7541__000001_NR13LY,OPT,16 All Saints Green,,,Norwich,,NR1 3NA,Tel: 01603 763764, - ,,,No ratings yet Rate it yourself - /Services/opticians/LeaveReview/DefaultView.aspx?id=OP_5A2_7541__000001_NR13LY,0,0,
M&S Opticians,X8B6M,OPT,M&S,Rampant Horse Street,,Norwich,Norfolk,NR2 1QR,Tel: 01603576344, - ,,,No ratings yet Rate it yourself - /Services/opticians/LeaveReview/DefaultView.aspx?id=X8B6M,0,0,
Moss & Leakey Opticians,OP_5A2_14969__000001_NR13JZ,OPT,1 Timberhill,,Norwich,,,NR1 3JZ,Tel: 01603 661001, - ,,,No ratings yet Rate it yourself - /Services/opticians/LeaveReview/DefaultView.aspx?id=OP_5A2_14969__000001_NR13JZ,0,0,
Vision Express,OP_5A2_12637__000002_NR13DD,OPT,71 Castle Mall,White Lion Gate,Norwich,,,NR1 3DD,Tel: 01603 667733, - ,,,1 rating Rate it yourself - /Services/opticians/LeaveReview/DefaultView.aspx?id=OP_5A2_12637__000002_NR13DD,,,
Boots-Norwich - Castle Mall (in Boots UK),OP_5A2_10033__000003_NR13DD,OPT,19 Castle Mall,,,Norwich,Norfolk,NR1 3DD,Tel: 01603 763397, - ,,,4 ratings Rate it yourself - /Services/opticians/LeaveReview/DefaultView.aspx?id=OP_5A2_10033__000003_NR13DD,,,
The Eye Clinic,OP_5A2_14968__000001_NR21QD,OPT,1 Haymarket,,Norwich,,,NR2 1QD,Tel: 0800 783 5555, - ,,,No ratings yet Rate it yourself - /Services/opticians/LeaveReview/DefaultView.aspx?id=OP_5A2_14968__000001_NR21QD,0,0,
Optical Express,NR2 1QD_88888,OPT,1 Haymarket,,,Norwich,Norfolk,NR2 1QD,Tel: 0800 023 2020, - ,,,5 ratings Rate it yourself - /Services/opticians/LeaveReview/DefaultView.aspx?id=NR2 1QD_88888,,,
Beccles Specsavers Ltd,K6T9E,OPT,,Unit 2a The Walk,,Beccles,Suffolk,NR34 9AJ,Tel: 01502 440609, - ,,,No ratings yet Rate it yourself - /Services/opticians/LeaveReview/DefaultView.aspx?id=K6T9E,0,0,
Specsavers Opticians,OP_5A2_6933__000001_NR21PX,OPT,9 White Lion Street,,Norwich,,,NR2 1PX,Tel: 01603 610777, - ,,,No ratings yet Rate it yourself - /Services/opticians/LeaveReview/DefaultView.aspx?id=OP_5A2_6933__000001_NR21PX,0,0,
Peel & Gudgin Opticians,OP_5JT_7588__000001_IP141EF,OPT,11 Station Road West,,Stowmarket,Suffolk,,IP14 1EF,Tel: 01449 612984, - ,,,No ratings yet Rate it yourself - /Services/opticians/LeaveReview/DefaultView.aspx?id=OP_5JT_7588__000001_IP141EF,0,0,
Cecil C Amey Ltd,OP_5A2_3107__000001_NR21QH,OPT,22a Haymarket,,Norwich,Norfolk,,NR2 1QH,Tel: 01603 626324, - ,,,1 rating Rate it yourself - /Services/opticians/LeaveReview/DefaultView.aspx?id=OP_5A2_3107__000001_NR21QH,,,
P G Sergeant Opticians,OP_5JV_4229__000001_NR349TA,OPT,8/10 Blyburgate,Beccles,Suffolk,,,NR34 9TA,Tel: 01502 713227, - ,,,No ratings yet Rate it yourself - /Services/opticians/LeaveReview/DefaultView.aspx?id=OP_5JV_4229__000001_NR349TA,0,0,
F G Brown & Associates Ltd,OP_5JT_9924__000001_IP141BB,OPT,Denmark House,41 Bury Street,,Stowmarket,Suffolk,IP14 1HA,Tel: 01449 612812, - ,,,No ratings yet Rate it yourself - /Services/opticians/LeaveReview/DefaultView.aspx?id=OP_5JT_9924__000001_IP141BB,0,0,yes
Observatory Opticians,OP_CO-3383(2)-5PR__000001_NR349HJ,OPT,1 Smallgate,,,Beccles,Suffolk,NR34 9AB,Tel: 01502 713370, - ,,,1 rating Rate it yourself - /Services/opticians/LeaveReview/DefaultView.aspx?id=OP_CO-3383(2)-5PR__000001_NR349HJ,,,
Scrivens Opticians & Hearing Care,OP_5A2_7706__000001_NR31HU,OPT,87 Upper St Giles Street,87 Upper St Giles Street,Norwich,Norwich,,NR2 1AB,Tel: 01603 629839, - ,,,No ratings yet Rate it yourself - /Services/opticians/LeaveReview/DefaultView.aspx?id=OP_5A2_7706__000001_NR31HU,0,0,
Centenary Opticians,E4C7U,OPT,,3 Bowthorpe Centre,Wendene,Norwich,Norfolk,NR5 9HA,Tel: 01603 945611, - ,,,No ratings yet Rate it yourself - /Services/opticians/LeaveReview/DefaultView.aspx?id=E4C7U,0,0,
Castle Street Optometry,OP_5A2_5649__000001_NR13QD,OPT,4d Castle Street,,,Norwich,,NR2 1PD,Tel: 01603 618101, - ,,,No ratings yet Rate it yourself - /Services/opticians/LeaveReview/DefaultView.aspx?id=OP_5A2_5649__000001_NR13QD,0,0,
Boots-Norwich - Castle St,OP_5A2_7356__000001_NR21PD,OPT,4c Castle Street,,,Norwich,Norfolk,NR2 1PD,Tel: 01603 620 221, - ,,,No ratings yet Rate it yourself - /Services/opticians/LeaveReview/DefaultView.aspx?id=OP_5A2_7356__000001_NR21PD,0,0,
Dipple & Conway (Norwich) Ltd,OP_5JT_10113__000001_IP141AD,OPT,,19 Castle Street,Norwich,Norfolk,,NR2 1PB,Tel: 01603 626750, - ,,,1 rating Rate it yourself - /Services/opticians/LeaveReview/DefaultView.aspx?id=OP_5JT_10113__000001_IP141AD,,,
Dipple & Conway Opticians,OP_5A2_10167__000002_NR21PB,OPT,19 Castle Street,,Norwich,.,,NR2 1PB,Tel: 01603 626750, - ,,,No ratings yet Rate it yourself - /Services/opticians/LeaveReview/DefaultView.aspx?id=OP_5A2_10167__000002_NR21PB,0,0,
Specsavers,OP_5JT_14932__000002_IP141AH,OPT,11 Ipswich Street,,Stowmarket,Suffolk,,IP14 1AH,Tel: 01449 618280, - ,,,No ratings yet Rate it yourself - /Services/opticians/LeaveReview/DefaultView.aspx?id=OP_5JT_14932__000002_IP141AH,0,0,
Martin Storey Opticians,OPT_NR349AY__000001_NR349AY,OPT,82 Northgate,,Beccles,Suffolk,,NR34 9AY,Tel: 01502 471915, - ,,,No ratings yet Rate it yourself - /Services/opticians/LeaveReview/DefaultView.aspx?id=OPT_NR349AY__000001_NR349AY,0,0,
Asda Opticians,OPT_IP14 1DE,OPT,,MEADOW CENTRE,WILKS WAY,STOWMARKET,,IP14 1DE,Tel: 01449 763083, - ,,,2 ratings Rate it yourself - /Services/opticians/LeaveReview/DefaultView.aspx?id=OPT_IP14 1DE,,,
Paxon & Thomas (Norwich) Ltd,OP_5A2_469__000001_NR13DH,OPT,20 Castle Meadow,,,Norwich,,NR1 3DH,Tel: 01603 624500, - ,,,No ratings yet Rate it yourself - /Services/opticians/LeaveReview/DefaultView.aspx?id=OP_5A2_469__000001_NR13DH,0,0,
D R Grey (Norwich) Ltd,OP_5A2_11851__000001_NR21QF,OPT,Wensum House,10A Wensum Street,,Norwich,Norfolk,NR3 1HR,Tel: 01603 623696, - ,,,No ratings yet Rate it yourself - /Services/opticians/LeaveReview/DefaultView.aspx?id=OP_5A2_11851__000001_NR21QF,0,0,no
Coleman Opticians,OP_5A2_11259__000002_NR33DH,OPT,7-11 St. Augustine's Street,,Norwich,Norfolk,,NR3 3DH,Tel: 01603 624564, - ,,,9 ratings Rate it yourself - /Services/opticians/LeaveReview/DefaultView.aspx?id=OP_5A2_11259__000002_NR33DH,,,
Scrivens Opticians & Hearing Care,OP_5A2_3172__000001_NR14AP,OPT,195 Plumstead Road,195 Plumstead Road,Norwich,Norwich,,NR1 4AB,Tel: 01603 432804, - ,,,No ratings yet Rate it yourself - /Services/opticians/LeaveReview/DefaultView.aspx?id=OP_5A2_3172__000001_NR14AP,0,0,
Needham Market Opticians,OP-01-9208-5PT__000001_IP68DG,OPT,102 High Street,,Needham Market,Suffolk,,IP6 8DG,Tel: 01449 723180, - ,,,No ratings yet Rate it yourself - /Services/opticians/LeaveReview/DefaultView.aspx?id=OP-01-9208-5PT__000001_IP68DG,0,0,
Mobile Eye Clinic,OP_NR32RB_30101,OPT,,115 Copenhagen Way,,Norwich,Norfolk,NR3 2RB,Tel: 01603 402794, - ,,,No ratings yet Rate it yourself - /Services/opticians/LeaveReview/DefaultView.aspx?id=OP_NR32RB_30101,0,0,
R H Jeffery & Associates,OP_5JR_9720__000002_IP171DD,OPT,16 High Street,,Saxmundham,Suffolk,,IP17 1DD,Tel: 01728 602830, - ,,,No ratings yet Rate it yourself - /Services/opticians/LeaveReview/DefaultView.aspx?id=OP_5JR_9720__000002_IP171DD,0,0,
Scotts Opticians,OP_5G1_3800__000001_IP242DT,OPT,Red Cross Building,Guildhall Street,Thetford,Norfolk,,IP24 2DT,Tel: 01842 764831, - ,,,No ratings yet Rate it yourself - /Services/opticians/LeaveReview/DefaultView.aspx?id=OP_5G1_3800__000001_IP242DT,0,0,
Boots-Thetford,OP_5G1_11564__000003_IP242AP,OPT,26-28 King Street,,,Thetford,Norfolk,IP24 2AP,Tel: 01842 753356, - ,,,No ratings yet Rate it yourself - /Services/opticians/LeaveReview/DefaultView.aspx?id=OP_5G1_11564__000003_IP242AP,0,0,
Specsavers Opticians,PREMISES_IP242BG__000001_IP242BG,OPT,20 Riverside Walk,,Thetford,Norfolk,,IP24 2BG,Tel: 01842 826565, - ,,,No ratings yet Rate it yourself - /Services/opticians/LeaveReview/DefaultView.aspx?id=PREMISES_IP242BG__000001_IP242BG,0,0,
"Coe, Costa & Moore",OP_5JL_11428__000001_NR66XW,OPT,111 Cromer Road,,Norwich,Norfolk,,NR6 6XW,Tel: 01603 484181, - ,,,No ratings yet Rate it yourself - /Services/opticians/LeaveReview/DefaultView.aspx?id=OP_5JL_11428__000001_NR66XW,0,0,
Paxon & Thomas (Brundall) Ltd,OP_5JL_5192__000002_NR135LP,OPT,116 The Street,Brundall,Norwich,,,NR13 5LP,Tel: 01603 713287, - ,,,No ratings yet Rate it yourself - /Services/opticians/LeaveReview/DefaultView.aspx?id=OP_5JL_5192__000002_NR135LP,0,0,
Cecil C Amey Ltd,OP_5G1_10131__000001_IP256AB,OPT,,13 High Street,,Watton,Norfolk,IP25 6AB,Tel: 01953 881535, - ,,,No ratings yet Rate it yourself - /Services/opticians/LeaveReview/DefaultView.aspx?id=OP_5G1_10131__000001_IP256AB,0,0,
Spectacles at Home,OP_NR136PN_88758,OPT,The Surgery,2 Newman Road,Rackheath,Norwich,Norfolk,NR13 6PN,Tel: 01603 720934, - ,,,No ratings yet Rate it yourself - /Services/opticians/LeaveReview/DefaultView.aspx?id=OP_NR136PN_88758,0,0,
Marshall & Lilley,OP_5JR_3018__000001_IP164EW,OPT,26 High Street,Marshall and Lilley,26 High Street,LEISTON,Suffolk,IP16 4EW,Tel: 01728833114, - ,,,2 ratings Rate it yourself - /Services/opticians/LeaveReview/DefaultView.aspx?id=OP_5JR_3018__000001_IP164EW,,,
Tesco Opticians,NF00001__000002_NR191WB,OPT,Kingston Road,,Dereham,Norfolk,,NR19 1WB,Tel: 0345 601 3479, - ,,,No ratings yet Rate it yourself - /Services/opticians/LeaveReview/DefaultView.aspx?id=NF00001__000002_NR191WB,0,0,
Observatory Opticians,OL_CO-3383_5PR__000001_IP186DJ,OPT,53 High Street,,,Southwold,Suffolk,IP18 6DJ,Tel: 01502 723291, - ,,,No ratings yet Rate it yourself - /Services/opticians/LeaveReview/DefaultView.aspx?id=OL_CO-3383_5PR__000001_IP186DJ,0,0,
Eyepractice Limited,OP_5JR_1253__000002_IP121AH,OPT,77 Thoroughfare,,,Woodbridge,Suffolk,IP12 1AH,Tel: 01394 382718, - ,,,No ratings yet Rate it yourself - /Services/opticians/LeaveReview/DefaultView.aspx?id=OP_5JR_1253__000002_IP121AH,0,0,no
Burrows & Sunaway,OP_5JR_14932__000001_IP121AQ,OPT,16 The Thoroughfare,,Woodbridge,Suffolk,,IP12 1AQ,Tel: 01394 383211, - ,,,1 rating Rate it yourself - /Services/opticians/LeaveReview/DefaultView.aspx?id=OP_5JR_14932__000001_IP121AQ,,,
ASDA Opticians,OP_5JQ_14008__000002_IP15PD,OPT,Asda Stores Ltd,Goddard Road,,Ipswich,,IP1 5PD,Tel: 01473 464723, - ,,,No ratings yet Rate it yourself - /Services/opticians/LeaveReview/DefaultView.aspx?id=OP_5JQ_14008__000002_IP15PD,0,0,
Steven Dewberry Opticians,OP_5JR_3328__000001_IP121BX,OPT,Quay Street,,Woodbridge,Suffolk,,IP12 1BX,Tel: 01394 385130, - ,,,No ratings yet Rate it yourself - /Services/opticians/LeaveReview/DefaultView.aspx?id=OP_5JR_3328__000001_IP121BX,0,0,
Cecil C Amey Ltd,OP_5G1_3105__000001_NR191DJ,OPT,,3 Church Street,,Dereham,Norfolk,NR19 1DJ,Tel: 01362 692851, - ,,,1 rating Rate it yourself - /Services/opticians/LeaveReview/DefaultView.aspx?id=OP_5G1_3105__000001_NR191DJ,,,
East Dereham Specsavers,00123__000003_NR192AP,OPT,31 Market Place,,Easr Dereham,Norfolk,,NR19 2AP,Tel: 01362 852830, - ,,,3 ratings Rate it yourself - /Services/opticians/LeaveReview/DefaultView.aspx?id=00123__000003_NR192AP,,,
Moss & Leakey Opticians,OP_5G1_13919__000002_NR192AP,OPT,29 Market Place,,Dereham,,,NR19 2AP,Tel: 01362 699798, - ,,,No ratings yet Rate it yourself - /Services/opticians/LeaveReview/DefaultView.aspx?id=OP_5G1_13919__000002_NR192AP,0,0,
Peel & Gudgin Opticians,OP_5JW_11956__000001_IP331LS,OPT,Abbey House,30 Angel Hill,Bury St. Edmunds,,,IP33 1LS,Tel: 01284 754541, - ,,,No ratings yet Rate it yourself - /Services/opticians/LeaveReview/DefaultView.aspx?id=OP_5JW_11956__000001_IP331LS,0,0,
Boots-Bury St Edmunds - Brentgovel St,OP_5JW_4595__000001_IP331EB,OPT,5 Brentgovel Street,,Bury St. Edmunds,Suffolk,,IP33 1EB,Tel: 01284 768328, - ,,,No ratings yet Rate it yourself - /Services/opticians/LeaveReview/DefaultView.aspx?id=OP_5JW_4595__000001_IP331EB,0,0,
Scrivens Ltd,OP_5JW_13102__000001_IP331LW,OPT,43 Abbeygate Street,,,Bury St Edmunds,Suffolk,IP33 1LW,Tel: 01284 702061, - ,,,No ratings yet Rate it yourself - /Services/opticians/LeaveReview/DefaultView.aspx?id=OP_5JW_13102__000001_IP331LW,0,0,
Specsavers Opticians,OP_5JW_11921__000002_IP331BE,OPT,,10 Buttermarket,Bury St. Edmunds,Suffolk,,IP33 1DB,Tel: 01284 702240, - ,,,No ratings yet Rate it yourself - /Services/opticians/LeaveReview/DefaultView.aspx?id=OP_5JW_11921__000002_IP331BE,0,0,
Vision Express,OP_5JW_14192__000001_IP331DD,OPT,12-13 Buttermarket,,Bury St Edmunds,Suffolk,,IP33 1DP,Tel: 01284 750776, - ,,,No ratings yet Rate it yourself - /Services/opticians/LeaveReview/DefaultView.aspx?id=OP_5JW_14192__000001_IP331DD,0,0,
Scotts Opticians,OP_5JW_1353__000001_IP331BJ,OPT,,58 Abbeygate Street,,Bury St. Edmunds,Suffolk,IP33 1LB,Tel: 01284 754616, - ,,,No ratings yet Rate it yourself - /Services/opticians/LeaveReview/DefaultView.aspx?id=OP_5JW_1353__000001_IP331BJ,0,0,
Boots-Bury St Edmunds - Cornhill,OP_5JW_1093__000002_IP331BT,OPT,11-13 Cornhill,,,Bury St Edmunds,Suffolk,IP33 1BX,Tel: 01284 703013, - ,,,1 rating Rate it yourself - /Services/opticians/LeaveReview/DefaultView.aspx?id=OP_5JW_1093__000002_IP331BT,,,
A.S Pennington,OP_5JL_4228__000001_NR133QX,OPT,1 Calthorpe Cottages,The Green,Acle,Norfolk,,NR13 3QX,Tel: 01493 750212, - ,,,No ratings yet Rate it yourself - /Services/opticians/LeaveReview/DefaultView.aspx?id=OP_5JL_4228__000001_NR133QX,0,0,
Wigram and Ware (Bury) Ltd,OP_5JW_7581__000001_IP331BS,OPT,4 Central Walk,,Bury St. Edmunds,Suffolk,,IP33 1BS,Tel: 01284 753821, - ,,,No ratings yet Rate it yourself - /Services/opticians/LeaveReview/DefaultView.aspx?id=OP_5JW_7581__000001_IP331BS,0,0,
Eyecare Opticians,OP_5JQ_2629__000001_IP14HA,OPT,341 Norwich Road,,Ipswich,Suffolk,,IP1 4HA,Tel: 01473 747000, - ,,,No ratings yet Rate it yourself - /Services/opticians/LeaveReview/DefaultView.aspx?id=OP_5JQ_2629__000001_IP14HA,0,0,
R H Jeffery & Associates,OP_5JQ_4554__000001_IP13QU,OPT,28 Anglesea Road,,Ipswich,Suffolk,,IP1 3PP,Tel: 01473 210672, - ,,,No ratings yet Rate it yourself - /Services/opticians/LeaveReview/DefaultView.aspx?id=OP_5JQ_4554__000001_IP13QU,0,0,
Primesight Opticians,OP_5JQ_14007__000002_IP44EL,OPT,432 Woodbridge Road,,Ipswich,Suffolk,,IP4 4EL,Tel: 01473 724158, - ,,,No ratings yet Rate it yourself - /Services/opticians/LeaveReview/DefaultView.aspx?id=OP_5JQ_14007__000002_IP44EL,0,0,
Kite Opticians,OP_5JQ_3066__000001_IP13LU,OPT,38 Berners Street,,,Ipswich,Suffolk,IP1 3LU,Tel: 01473 255250, - ,,,No ratings yet Rate it yourself - /Services/opticians/LeaveReview/DefaultView.aspx?id=OP_5JQ_3066__000001_IP13LU,0,0,
Templemans Opticians (Home Visits),5P1/OPH1__000002_SS67QA,OPT,,25 Easton Road,Sutton Heath,Woodbridge,,IP12 3TD,Tel: 01268 777729, - ,,,1 rating Rate it yourself - /Services/opticians/LeaveReview/DefaultView.aspx?id=5P1/OPH1__000002_SS67QA,,,
Tesco Opticians Ipswich,CO-1998_24092015,OPT,,"42 London Road, Copdock Interchange",,Ipswich,,IP1 2HB,, - ,,,No ratings yet Rate it yourself - /Services/opticians/LeaveReview/DefaultView.aspx?id=CO-1998_24092015,0,0,
Vision Express,OP_5JQ_13694__000001_IP13BB,OPT,3 Tower Ramparts,Tavern Street,Ipswich,,,IP1 3DH,Tel: 01473 281199, - ,,,No ratings yet Rate it yourself - /Services/opticians/LeaveReview/DefaultView.aspx?id=OP_5JQ_13694__000001_IP13BB,0,0,
A J Rawling,OP_5JQ_13693__000001_IP13DB,OPT,14 Northgate Street,,Ipswich,Suffolk,,IP1 3DB,Tel: 01473 252026, - ,,,1 rating Rate it yourself - /Services/opticians/LeaveReview/DefaultView.aspx?id=OP_5JQ_13693__000001_IP13DB,,,no
Boots-Ipswich - Tavern St,OP_5JQ_8836__000002_IP13AA,OPT,5 Tavern Street,,,Ipswich,Suffolk,IP1 3AA,Tel: 01473 258256, - ,,,1 rating Rate it yourself - /Services/opticians/LeaveReview/DefaultView.aspx?id=OP_5JQ_8836__000002_IP13AA,,,
Eyedeal Opticians,OL_22/5/2006_5PR__000001_IP41EJ,OPT,20 Carr Street,,Ipswich,Suffolk,,IP4 1EJ,Tel: 01473 251702, - ,,,No ratings yet Rate it yourself - /Services/opticians/LeaveReview/DefaultView.aspx?id=OL_22/5/2006_5PR__000001_IP41EJ,0,0,
Specsavers Opticians,OP_5JQ_6836__000001_IP13AW,OPT,46a Tavern Street,,Ipswich,Suffolk,,IP1 3AW,Tel: 01473 210333, - ,,,4 ratings Rate it yourself - /Services/opticians/LeaveReview/DefaultView.aspx?id=OP_5JQ_6836__000001_IP13AW,,,
Armstrong & North Ltd,01-17721,OPT,,36 Carr Street,,Ipswich,,IP4 1EN,Tel: 01473 226009, - ,,,No ratings yet Rate it yourself - /Services/opticians/LeaveReview/DefaultView.aspx?id=01-17721,0,0,
Boots-Ipswich - Upper Brook St,OP_5JQ_10211__000001_IP41EE,OPT,16 Upper Brook Street,,,Ipswich,Suffolk,IP4 1EE,Tel: 01473 252 359, - ,,,No ratings yet Rate it yourself - /Services/opticians/LeaveReview/DefaultView.aspx?id=OP_5JQ_10211__000001_IP41EE,0,0,
Optical Express,IP1 1SW_11111,OPT,Clydesdale House (3rd floor),,,Ipswich,Suffolk,IP1 1SW,Tel: 0800 023 2020, - ,,,No ratings yet Rate it yourself - /Services/opticians/LeaveReview/DefaultView.aspx?id=IP1 1SW_11111,0,0,
Observatory Opticians,OP_5JQ_3639__000001_IP11SS,OPT,Observatory the Opticians,8 Queen Street,,Ipswich,Suffolk,IP1 1SS,Tel: 01473 252595, - ,,,3 ratings Rate it yourself - /Services/opticians/LeaveReview/DefaultView.aspx?id=OP_5JQ_3639__000001_IP11SS,,,
Yates & Reeves,OP_5JM_11850__000001_NR128DA,OPT,"5-6 The Old Mill, Norwich Road",Hoveton,Norwich,Norfolk,,NR12 8DA,Tel: 01603 783965, - ,,,No ratings yet Rate it yourself - /Services/opticians/LeaveReview/DefaultView.aspx?id=OP_5JM_11850__000001_NR128DA,0,0,
H E Kersey,OP_5JQ_4378__000001_IP41BA,OPT,22 Tacket Street,,Ipswich,Suffolk,,IP4 1BA,Tel: 01473 406567, - ,,,No ratings yet Rate it yourself - /Services/opticians/LeaveReview/DefaultView.aspx?id=OP_5JQ_4378__000001_IP41BA,0,0,
Cecil Amey Ltd,041120191051,OPT,,"Ward House, Norwich Road",,Wroxham,Norfolk,NR12 8UR,Tel: 01603 783965, - ,,,2 ratings Rate it yourself - /Services/opticians/LeaveReview/DefaultView.aspx?id=041120191051,,,
Helen Ashby Opticians,OP_5JW_886__000001_IP270AA,OPT,9 Market Hill,,Brandon,Suffolk,,IP27 0AA,Tel: 01842 815055, - ,,,No ratings yet Rate it yourself - /Services/opticians/LeaveReview/DefaultView.aspx?id=OP_5JW_886__000001_IP270AA,0,0,
Clear Vision Opticians Ltd,OP_5JV_7592__000001_NR322AA,OPT,2 Bevan Street East,Lowestoft,Suffolk,,,NR32 2AA,Tel: 01502 515143, - ,,,No ratings yet Rate it yourself - /Services/opticians/LeaveReview/DefaultView.aspx?id=OP_5JV_7592__000001_NR322AA,0,0,
A S Pennington Opticians,OP_5JV_4227__000001_NR321HB,OPT,129 Bevan Street East,Lowestoft,Suffolk,,,NR32 2AQ,Tel: 01502 574079, - ,,,3 ratings Rate it yourself - /Services/opticians/LeaveReview/DefaultView.aspx?id=OP_5JV_4227__000001_NR321HB,,,
Boots-Lowestoft,OP_5JV_8003__000001_NR321EP,OPT,46 London Road North,,,Lowestoft,Suffolk,NR32 1EP,Tel: 01502 573511, - ,,,2 ratings Rate it yourself - /Services/opticians/LeaveReview/DefaultView.aspx?id=OP_5JV_8003__000001_NR321EP,,,