Organisation Name,NACS Code,Organisation Type,Address1,Address2,Address3,Address4,Address5,PostCode,Telephone Number,Opening time,Value  (Opening time),Banding Classification  (Opening time),NHS.UK users rating,Value  (NHS.UK users rating),Banding Classification  (NHS.UK users rating),Car parking (Is there car parking at this organisation?)
Denham Opticians,OLCO34465QD__000001_UB95HB,OPT,4 The Broadway East,North Orbital Road,Denham Green,Buckinghamshire,,UB9 5HB,Tel: 01895 832122, - ,,,No ratings yet Rate it yourself - /Services/opticians/LeaveReview/DefaultView.aspx?id=OLCO34465QD__000001_UB95HB,0,0,
S H Harrold (1937) Ltd,OP_5AT_8013__000001_UB81JX,OPT,130-131 High Street,Uxbridge,Middlesex,,,UB8 1JX,Tel: 01895 234017, - ,,,No ratings yet Rate it yourself - /Services/opticians/LeaveReview/DefaultView.aspx?id=OP_5AT_8013__000001_UB81JX,0,0,
Vision Express (UK) Ltd,OP_5AT_6652__000001_UB81LN,OPT,58 High Street,Uxbridge,Middlesex,,,UB8 1LN,Tel: 01895 231261, - ,,,No ratings yet Rate it yourself - /Services/opticians/LeaveReview/DefaultView.aspx?id=OP_5AT_6652__000001_UB81LN,0,0,
Specsavers Opticians,OP_5AT_1913__000002_UB81LN,OPT,,56 High Street,Uxbridge,Middlesex,,UB8 1JP,Tel: 01895 256010, - ,,,No ratings yet Rate it yourself - /Services/opticians/LeaveReview/DefaultView.aspx?id=OP_5AT_1913__000002_UB81LN,0,0,
Boots-Uxbridge - Market Sq,OP_5AT_6660__000001_UB81LH,OPT,30 Market Square,,,Uxbridge,Middlesex,UB8 1LH,Tel: 01895 254 885, - ,,,1 rating Rate it yourself - /Services/opticians/LeaveReview/DefaultView.aspx?id=OP_5AT_6660__000001_UB81LH,,,
Mills Optometrists,OP_5AT_2743__000001_UB81AB,OPT,16 Windsor Street,Uxbridge,Middlesex,,,UB8 1AB,Tel: 01895 231694, - ,,,1 rating Rate it yourself - /Services/opticians/LeaveReview/DefaultView.aspx?id=OP_5AT_2743__000001_UB81AB,,,
Opticial Express,OP_12345_UB8 1JN,OPT,The Market House,High St,,Uxbridge,Middlesex,UB8 1JN,Tel: 0800 023 2020, - ,,,No ratings yet Rate it yourself - /Services/opticians/LeaveReview/DefaultView.aspx?id=OP_12345_UB8 1JN,0,0,
C R Turner,OP_5AT_9290__000002_UB81JN,OPT,11 High Street,Uxbridge,Middlesex,,,UB8 1JN,Tel: 01895 259110, - ,,,No ratings yet Rate it yourself - /Services/opticians/LeaveReview/DefaultView.aspx?id=OP_5AT_9290__000002_UB81JN,0,0,
Boots-Uxbridge   - Chimes Centre,OP_5AT_14006__000002_UB81GA,OPT,Unit 3,The Chimes Shopping Centre,,Uxbridge,,UB8 1GA,Tel: 01895 814557, - ,,,1 rating Rate it yourself - /Services/opticians/LeaveReview/DefaultView.aspx?id=OP_5AT_14006__000002_UB81GA,,,
Optical Express,OP_5AT_3746__000001_UB81AQ,OPT,Market House,29 High Street,Uxbridge,,,UB8 1AQ,Tel: 01895 253 779, - ,,,No ratings yet Rate it yourself - /Services/opticians/LeaveReview/DefaultView.aspx?id=OP_5AT_3746__000001_UB81AQ,0,0,
AVK I-Care,D-13231,OPT,,15a Swakeleys Road,,Ickenham,,UB10 8DF,Tel: 01895347121, - ,,,No ratings yet Rate it yourself - /Services/opticians/LeaveReview/DefaultView.aspx?id=D-13231,0,0,
Eyewise Opticians,OP_5AT_10924__000003_UB109PG,OPT,374 Long Lane,Hillingdon,Uxbridge,,,UB10 9PG,Tel: 01895 234563, - ,,,No ratings yet Rate it yourself - /Services/opticians/LeaveReview/DefaultView.aspx?id=OP_5AT_10924__000003_UB109PG,0,0,
Harefield Opticians,OP_5AT_12107__000001_UB96BX,OPT,33 High Street,Harefield,Middlesex,UXBRIDGE,Middlesex,UB9 6BX,Tel: 01895 823 237, - ,,,54 ratings Rate it yourself - /Services/opticians/LeaveReview/DefaultView.aspx?id=OP_5AT_12107__000001_UB96BX,,,
Chilton Watson Ltd,OP_5G4_1559__000001_SL98ES,OPT,3 Station Road,,,Gerrards Cross,Buckinghamshire,SL9 8ES,Tel: 01753 886306, - ,,,No ratings yet Rate it yourself - /Services/opticians/LeaveReview/DefaultView.aspx?id=OP_5G4_1559__000001_SL98ES,0,0,
Specsavers Opticians,TP9A1,OPT,,46/48 Packhorse Road,,Gerrards Cross,Buckinghamshire,SL9 8EF,Tel: 01753 278030, - ,,,No ratings yet Rate it yourself - /Services/opticians/LeaveReview/DefaultView.aspx?id=TP9A1,0,0,
Boots-Gerrards Cross,OLCO27635G4__000002_SL98EF,OPT,52 Packhorse Road,,,Gerrards Cross,Buckinghamshire,SL9 8EF,Tel: 01753 279763, - ,,,No ratings yet Rate it yourself - /Services/opticians/LeaveReview/DefaultView.aspx?id=OLCO27635G4__000002_SL98EF,0,0,
Boots-Ruislip,OP_5AT_676__000001_HA47AU,OPT,33 High Street,,,Ruislip,Middlesex,HA4 7AU,Tel: 01895 634 234, - ,,,1 rating Rate it yourself - /Services/opticians/LeaveReview/DefaultView.aspx?id=OP_5AT_676__000001_HA47AU,,,
Vision Express (UK) Ltd,OP_5AT_6219__000002_HA48LS,OPT,112 High Street,Ruislip,Middlesex,,,HA4 8LS,Tel: 01895 677461, - ,,,No ratings yet Rate it yourself - /Services/opticians/LeaveReview/DefaultView.aspx?id=OP_5AT_6219__000002_HA48LS,0,0,
Specsavers Opticians,OP_5AT_14107__000001_HA48LL,OPT,134 High Street,,Ruislip,Middlesex,,HA4 8LL,Tel: 01895 679750, - ,,,No ratings yet Rate it yourself - /Services/opticians/LeaveReview/DefaultView.aspx?id=OP_5AT_14107__000001_HA48LL,0,0,
Eye Design Opticians,OP_5AT_8112__000001_HA48LJ,OPT,170 High Street,Ruislip,Middlesex,,,HA4 8LJ,Tel: 01895 621135, - ,,,No ratings yet Rate it yourself - /Services/opticians/LeaveReview/DefaultView.aspx?id=OP_5AT_8112__000001_HA48LJ,0,0,
Kaleyes Opticians,OP_5AT_8491__000001_UB100LR,OPT,7 Marlborough Parade,Uxbridge Road,Hillingdon,Middlesex,,UB10 0LR,Tel: 01895 232113, - ,,,No ratings yet Rate it yourself - /Services/opticians/LeaveReview/DefaultView.aspx?id=OP_5AT_8491__000001_UB100LR,0,0,
Heaton Caffin Optometrists,OP_SL99QQ_46731,OPT,33 St Peter's Court,,,Chalfont St Peter,Buckinghamshire,SL9 9QQ,Tel: 01753 886806, - ,,,No ratings yet Rate it yourself - /Services/opticians/LeaveReview/DefaultView.aspx?id=OP_SL99QQ_46731,0,0,
Olivers Opticians Ltd,OP_5G4_2237__000001_SL99EA,OPT,2 Market Place,,,Chalfont St Peter,Buckinghamshire,SL9 9EA,Tel: 01753 890822, - ,,,No ratings yet Rate it yourself - /Services/opticians/LeaveReview/DefaultView.aspx?id=OP_5G4_2237__000001_SL99EA,0,0,
Mansons Eyecare,OP_5AT_10107__000001_UB77BE,OPT,166 High Street,Yiewsley,West Drayton,Middlesex,,UB7 7BE,Tel: 01895 435411, - ,,,2 ratings Rate it yourself - /Services/opticians/LeaveReview/DefaultView.aspx?id=OP_5AT_10107__000001_UB77BE,,,
Opticiancall (Home Visiting Opticians),OP_HA61HJ_85747,OPT,,24 Knoll Crescent,,Northwood,Middlesex,HA6 1HJ,Tel: 0800 999 3937, - ,,,No ratings yet Rate it yourself - /Services/opticians/LeaveReview/DefaultView.aspx?id=OP_HA61HJ_85747,0,0,
First Contact Opticians,OP_5AT_3927__000001_HA51RJ,OPT,126 Field End Road,Eastcote,Pinner,Middlesex,,HA5 1RJ,Tel: 020 8866 4911, - ,,,1 rating Rate it yourself - /Services/opticians/LeaveReview/DefaultView.aspx?id=OP_5AT_3927__000001_HA51RJ,,,
West Drayton Specsavers,CO-5537,OPT,,40 High Street,,West Drayton,,UB7 7DW,Tel: 01895 446 531, - ,,,4 ratings Rate it yourself - /Services/opticians/LeaveReview/DefaultView.aspx?id=CO-5537,,,
Leith Opticians,OP_5AT_4339__000002_HA51QR,OPT,175 Field End Road,Eastcote,Pinner,Middlesex,,HA5 1QR,Tel: 020 8868 2277, - ,,,No ratings yet Rate it yourself - /Services/opticians/LeaveReview/DefaultView.aspx?id=OP_5AT_4339__000002_HA51QR,0,0,
Lamertons,OP_5AT_12378__000001_HA63AD,OPT,65 Green Lane,Northwood,Middlesex,,,HA6 3AD,Tel: 01923 822066, - ,,,No ratings yet Rate it yourself - /Services/opticians/LeaveReview/DefaultView.aspx?id=OP_5AT_12378__000001_HA63AD,0,0,
S H Harrold,OP_5AT_6308__000001_HA61LU,OPT,85 Joel Street,Ryefield Parade,Northwood Hills,Middlesex,,HA6 1LU,Tel: 01923 823027, - ,,,1 rating Rate it yourself - /Services/opticians/LeaveReview/DefaultView.aspx?id=OP_5AT_6308__000001_HA61LU,,,
Crispe Opticians,OP_5AT_12413__000002_HA51QZ,OPT,207 Field End Road,Eastcote,Pinner,Middlesex,,HA5 1QZ,Tel: 020 8866 3998, - ,,,No ratings yet Rate it yourself - /Services/opticians/LeaveReview/DefaultView.aspx?id=OP_5AT_12413__000002_HA51QZ,0,0,
S H Harrold Ltd,OP_5AT_8917__000001_UB77LR,OPT,69 Station Road,West Drayton,Middlesex,,,UB7 7LR,Tel: 01895 442140, - ,,,No ratings yet Rate it yourself - /Services/opticians/LeaveReview/DefaultView.aspx?id=OP_5AT_8917__000001_UB77LR,0,0,
DomEyeCare Ltd,1609141104,OPT,,70 Lowlands Road,,Pinner,,HA5 1TU,Tel: 0208 868 8475, - ,,,No ratings yet Rate it yourself - /Services/opticians/LeaveReview/DefaultView.aspx?id=1609141104,0,0,
Heaton Caffin Opticians,OP_5GV_3059__000002_WD32DN,OPT,121 Uxbridge Road,Rickmansworth,Hertfordshire,,,WD3 7DN,Tel: 01923 774939, - ,,,No ratings yet Rate it yourself - /Services/opticians/LeaveReview/DefaultView.aspx?id=OP_5GV_3059__000002_WD32DN,0,0,
Hayes Eye Clinic,OP_5AT_9391__000002_UB40RS,OPT,814a Uxbridge Road,,Middlesex,Hayes,,UB4 0RS,Tel: 020 8561 1625, - ,,,13 ratings Rate it yourself - /Services/opticians/LeaveReview/DefaultView.aspx?id=OP_5AT_9391__000002_UB40RS,,,
Windsor House,OP_5GV_8379__000001_WD31BX,OPT,13 Church Street,,Rickmansworth,,,WD3 1BX,Tel: 01923 771404, - ,,,No ratings yet Rate it yourself - /Services/opticians/LeaveReview/DefaultView.aspx?id=OP_5GV_8379__000001_WD31BX,0,0,
Boots-Rickmansworth,WD3 1AN_39472,OPT,,103 High Street,,Rickmansworth,Hertfordshire,WD3 1AN,Tel: 01923 777603, - ,,,No ratings yet Rate it yourself - /Services/opticians/LeaveReview/DefaultView.aspx?id=WD3 1AN_39472,0,0,
Thomas H Collison Ltd,OP_5DM_12922__000002_SL38HJ,OPT,4 Harrow Market,Langley,Slough,LANGLEY,,SL3 8HJ,Tel: 01753 541170, - ,,,No ratings yet Rate it yourself - /Services/opticians/LeaveReview/DefaultView.aspx?id=OP_5DM_12922__000002_SL38HJ,0,0,
Eyesey Eyecare,5K6- 3034__000006_HA53JF,OPT,,50 Bridge Street,,Pinner,Middlesex,HA5 3JF,Tel: 020 8429 0101, - ,,,No ratings yet Rate it yourself - /Services/opticians/LeaveReview/DefaultView.aspx?id=5K6- 3034__000006_HA53JF,0,0,
Boots-Pinner,OP_5K6_12949__000002_HA53JF,OPT,28 Bridge Stree,,,Pinner,Middlesex,HA5 3JF,Tel: 020 8866 5106, - ,,,No ratings yet Rate it yourself - /Services/opticians/LeaveReview/DefaultView.aspx?id=OP_5K6_12949__000002_HA53JF,0,0,
Specsavers Opticians,TP9FY,OPT,,36 Bridge Street,,Pinner,,HA5 3JF,, - ,,,No ratings yet Rate it yourself - /Services/opticians/LeaveReview/DefaultView.aspx?id=TP9FY,0,0,
G&G Pinner Optometrists,OP_5K6_14929__000001_HA53JD,OPT,3 Red Lion Parade,Bridge Street,Pinner,Pinner,Middlesex,HA5 3JD,Tel: 020 8866 2620, - ,,,No ratings yet Rate it yourself - /Services/opticians/LeaveReview/DefaultView.aspx?id=OP_5K6_14929__000001_HA53JD,0,0,yes
Insight Opticians (Seemera Ltd t/a),OP_5K6_2521__000001_HA53JE,OPT,6 Bridge Street,Pinner,Middlesex,,,HA5 3JE,Tel: 020 8866 5399, - ,,,No ratings yet Rate it yourself - /Services/opticians/LeaveReview/DefaultView.aspx?id=OP_5K6_2521__000001_HA53JE,0,0,
Icare Opticians,TP8VL,OPT,,6 Barters Walk,,Pinner,,HA5 5LU,, - ,,,No ratings yet Rate it yourself - /Services/opticians/LeaveReview/DefaultView.aspx?id=TP8VL,0,0,
New Vision,OP_5K6_4098__000001_HA29SE,OPT,431 Alexandra Avenue,,Harrow,,,HA2 9SE,Tel: 0208 429 3641, - ,,,6 ratings Rate it yourself - /Services/opticians/LeaveReview/DefaultView.aspx?id=OP_5K6_4098__000001_HA29SE,,,
Barnett Opticians,OP_5K6_14961__000001_HA55EN,OPT,367 Rayners Lane,,,Pinner,Middlesex,HA5 5EN,Tel: 020 8868 3003, - ,,,No ratings yet Rate it yourself - /Services/opticians/LeaveReview/DefaultView.aspx?id=OP_5K6_14961__000001_HA55EN,0,0,
Specsavers - Hayes Sainsburys,A9U5G,OPT,Sainsburys,Lombardy Retail Park,Coldharbour Lane,Hayes,,UB3 3EX,Tel: 0208 756 4989, - ,,,1 rating Rate it yourself - /Services/opticians/LeaveReview/DefaultView.aspx?id=A9U5G,,,
Specsavers Opticians,A9U5G,OPT,,Sainsbury's Lombardy Retail Park,Coldharbour Lane,Hayes,,UB3 3EX,Tel: 02087564989, - ,,,No ratings yet Rate it yourself - /Services/opticians/LeaveReview/DefaultView.aspx?id=A9U5G,0,0,
Specsavers Opticians,OP 5AT 6653__000001_UB32AB,OPT,"Unit 01, 5-19 Botwell Lane",,Hayes,Middlesex,,UB3 2AB,Tel: 0208 756 4980, - ,,,No ratings yet Rate it yourself - /Services/opticians/LeaveReview/DefaultView.aspx?id=OP 5AT 6653__000001_UB32AB,0,0,
Crockford Mills,OP_5AT_2104__000001_UB32HW,OPT,9 East Avenue,,Hayes,,,UB3 2HW,Tel: 0208 573 0822, - ,,,2 ratings Rate it yourself - /Services/opticians/LeaveReview/DefaultView.aspx?id=OP_5AT_2104__000001_UB32HW,,,
S H Harrold (1937) Ltd,OP_5AT_3078__000003_UB34DD,OPT,48 Station Road,Hayes,Middlesex,,,UB3 4DD,Tel: 0208 573 4400, - ,,,1 rating Rate it yourself - /Services/opticians/LeaveReview/DefaultView.aspx?id=OP_5AT_3078__000003_UB34DD,,,
Mandeville Opticians,140920161008,OPT,,6 Mandeville Road,,Northolt,Middlesex,UB5 5BJ,Tel: 020 8841 2626, - ,,,No ratings yet Rate it yourself - /Services/opticians/LeaveReview/DefaultView.aspx?id=140920161008,0,0,
Boots Opticians,31/08/20171140,OPT,,49 Station Road,,Middlesex,,UB3 4BE,, - ,,,No ratings yet Rate it yourself - /Services/opticians/LeaveReview/DefaultView.aspx?id=31/08/20171140,0,0,
Asda Opticians,OPT_UB3 4AZ,OPT,,Unit 3 Westlands Estate,,"Hayes, Middlesex",,UB3 4AZ,Tel: 0203 7701908, - ,,,No ratings yet Rate it yourself - /Services/opticians/LeaveReview/DefaultView.aspx?id=OPT_UB3 4AZ,0,0,
Mansons Eyecare,OP_5AT_11107__000001_UB49NS,OPT,"14 Jollys Lane, Willow District Centre",Yeading,Hayes,Middlesex,,UB4 9NS,Tel: 0208 845 5757, - ,,,1 rating Rate it yourself - /Services/opticians/LeaveReview/DefaultView.aspx?id=OP_5AT_11107__000001_UB49NS,,,
Hatch End Eyecare,01-22088,OPT,Hatch End Eyecare,394 Uxbridge Road,,Pinner,,HA5 4HP,Tel: 020 8428 0025, - ,,,2 ratings Rate it yourself - /Services/opticians/LeaveReview/DefaultView.aspx?id=01-22088,,,yes
The Eyecare Studio (Lucrative Business Ltd T/A),OP_5K6_9376__000001_HA54JR,OPT,439 Uxbridge Road,Pinner,Middlesex,,,HA5 4JR,Tel: 020 8421 2277, - ,,,No ratings yet Rate it yourself - /Services/opticians/LeaveReview/DefaultView.aspx?id=OP_5K6_9376__000001_HA54JR,0,0,
Hillier Opticians ,OP_5K6_7317__000001_HA26ED,OPT,19 Broadwalk,Pinner Road,Harrow,,,HA2 6ED,Tel: 020 8863 1541, - ,,,No ratings yet Rate it yourself - /Services/opticians/LeaveReview/DefaultView.aspx?id=OP_5K6_7317__000001_HA26ED,0,0,
Day Lewis Opticians ,OP_5K6_2305__000002_HA55LU,OPT,6 Barters Walk,,Pinner,,,HA5 4LU,Tel: 0208 868 2597, - ,,,No ratings yet Rate it yourself - /Services/opticians/LeaveReview/DefaultView.aspx?id=OP_5K6_2305__000002_HA55LU,0,0,
Rai Optometrists Ltd,OP_5K6_6218__000002_HA27SY,OPT,8 Broadway Parade,Pinner Road,Harrow,,,HA2 7SY,Tel: 020 8427 9202, - ,,,No ratings yet Rate it yourself - /Services/opticians/LeaveReview/DefaultView.aspx?id=OP_5K6_6218__000002_HA27SY,0,0,
Vision Express,OP_5G2_8065__000002_GU470FD,OPT,Tesco Express,Brunel Way,Wellington Street,Slough,,SL1 1XW,Tel: 01753 306 605, - ,,,No ratings yet Rate it yourself - /Services/opticians/LeaveReview/DefaultView.aspx?id=OP_5G2_8065__000002_GU470FD,0,0,
Spectacle Express,OP_5DM_4198__000001_SL11LD,OPT,1 Observatory Centre,,Slough,,,SL1 1LE,Tel: 01753 517417, - ,,,1 rating Rate it yourself - /Services/opticians/LeaveReview/DefaultView.aspx?id=OP_5DM_4198__000001_SL11LD,,,
Mr R K Shah,01-13945,OPT,,58 Southfield Park,,Harrow,,HA2 6HE,Tel: 07956172861, - ,,,No ratings yet Rate it yourself - /Services/opticians/LeaveReview/DefaultView.aspx?id=01-13945,0,0,
Chorleywood Eye Centre,CO-5238,OPT,,47c Lower Road,,Chorleywood,,WD3 5LQ,Tel: 019238286434, - ,,,3 ratings Rate it yourself - /Services/opticians/LeaveReview/DefaultView.aspx?id=CO-5238,,,
Vision Express (UK) Ltd,OP_5DM_12118__000001_SL11DD,OPT,33-35 Curzon Mall,Queensmere,Slough,,,SL1 1DD,Tel: 01753 693777, - ,,,No ratings yet Rate it yourself - /Services/opticians/LeaveReview/DefaultView.aspx?id=OP_5DM_12118__000001_SL11DD,0,0,
Specsavers Opticians,OP_5DM_660__000001_SL11DB,OPT,194-196 High Street,,Slough,,,SL1 1JS,Tel: 01753 502700, - ,,,No ratings yet Rate it yourself - /Services/opticians/LeaveReview/DefaultView.aspx?id=OP_5DM_660__000001_SL11DB,0,0,
Specsavers (South Harrow Visionplus Ltd),OP5K6__000002_HA28EE,OPT,308 Northolt Road,South Harrow,Harrow,Middlesex,,HA2 8EE,Tel: 020 8869 0301, - ,,,3 ratings Rate it yourself - /Services/opticians/LeaveReview/DefaultView.aspx?id=OP5K6__000002_HA28EE,,,
Parker & Hammond Opticians ,OP_5K6_9349__000001_HA28EE,OPT,302 Northolt Road,,South Harrow,,,HA2 8EE,Tel: 020 8422 1269, - ,,,No ratings yet Rate it yourself - /Services/opticians/LeaveReview/DefaultView.aspx?id=OP_5K6_9349__000001_HA28EE,0,0,
Home Health Clinic,HOMEHEALTHCLINIC1,OPT,,"2 Thorndyke Court, Westfield Park",,Pinner,Middlesex,HA5 4JG,Tel: 020 8428 4068, - ,,,No ratings yet Rate it yourself - /Services/opticians/LeaveReview/DefaultView.aspx?id=HOMEHEALTHCLINIC1,0,0,
J E Landaw,OP_5GV_4631__000001_WD35NL,OPT,5 New Parade,Chorleywood,Rickmansworth,Hertfordshire,,WD3 5NJ,Tel: 01923 283494, - ,,,No ratings yet Rate it yourself - /Services/opticians/LeaveReview/DefaultView.aspx?id=OP_5GV_4631__000001_WD35NL,0,0,
The Eye Centre,OP_SL11PQ_34410,OPT,,1 Church Street,,Slough,,SL1 1PQ,Tel: 01753 691692, - ,,,No ratings yet Rate it yourself - /Services/opticians/LeaveReview/DefaultView.aspx?id=OP_SL11PQ_34410,0,0,
Adams Opticians,OP_5GV_12388__000001_WD197AD,OPT,1 St andrews Road,,Watford,,,WD19 7AD,Tel: 020 8428 5152, - ,,,No ratings yet Rate it yourself - /Services/opticians/LeaveReview/DefaultView.aspx?id=OP_5GV_12388__000001_WD197AD,0,0,
Family Eyecare Ltd,OP_5K6_627__000002_HA28DU,OPT,246 Northolt Road,,Harrow,,,HA2 8DU,Tel: 020 8423 5818, - ,,,1 rating Rate it yourself - /Services/opticians/LeaveReview/DefaultView.aspx?id=OP_5K6_627__000002_HA28DU,,,
Thomas H Collison Ltd,OP_5DM_4323__000001_SL11EL,OPT,60 High Street,,Slough,Slough,,SL1 1EL,Tel: 01753 524392, - ,,,No ratings yet Rate it yourself - /Services/opticians/LeaveReview/DefaultView.aspx?id=OP_5DM_4323__000001_SL11EL,0,0,
Realeyes - The Eye Clinic,OPT_SL14XP_1,OPT,,165 Farnham Road,,Slough,,SL1 4XP,Tel: 01753 915060, - ,,,No ratings yet Rate it yourself - /Services/opticians/LeaveReview/DefaultView.aspx?id=OPT_SL14XP_1,0,0,
Valli Opticians Stockport,E1D9Q,OPT,,15 Great Underbank,,Stockport,Greater Manchester,SL1 1LF,Tel: 01614740974, - ,,,No ratings yet Rate it yourself - /Services/opticians/LeaveReview/DefaultView.aspx?id=E1D9Q,0,0,
Tesco Opticians,OLCO-19985HX__000002_UB25LN,OPT,Bulls Bridge Industrial Estate,Hayes Road,,Southall,,UB2 5LN,Tel: 0345 601 3479, - ,,,No ratings yet Rate it yourself - /Services/opticians/LeaveReview/DefaultView.aspx?id=OLCO-19985HX__000002_UB25LN,0,0,
Costco Wholesale UK Ltd,CO-1833-20,OPT,,Western International Park,Hayes Road,Hayes,,UB2 5XJ,Tel: 0208 571 8675, - ,,,No ratings yet Rate it yourself - /Services/opticians/LeaveReview/DefaultView.aspx?id=CO-1833-20,0,0,
OLDFIELDS OPTICIANS,01-20756_UB54RR_0714,OPT,OLDFIELDS OPTICIANS,27A OLDFIELDS CIRCUS,,NORTHOLT,,UB5 4RR,Tel: 02084224466, - ,,,No ratings yet Rate it yourself - /Services/opticians/LeaveReview/DefaultView.aspx?id=01-20756_UB54RR_0714,0,0,yes
Ultimate Eye Care,OP_5HX_1706__000002_UB11JY,OPT,,49 The Broadway,,Southall,,UB1 1JY,Tel: 020 8574 4158, - ,,,No ratings yet Rate it yourself - /Services/opticians/LeaveReview/DefaultView.aspx?id=OP_5HX_1706__000002_UB11JY,0,0,
Optical World,OP_5HX_11991__000001_UB11JR,OPT,11 The Broadway,Southall,Middlesex,,,UB1 1JR,Tel: 020 8893 5759, - ,,,No ratings yet Rate it yourself - /Services/opticians/LeaveReview/DefaultView.aspx?id=OP_5HX_11991__000001_UB11JR,0,0,
Medical Eye Centre,OP_5HX_2081__000001_UB69QD,OPT,9 Ruislip Road,Greenford,Middlesex,,,UB6 9QD,Tel: 020 8578 3721, - ,,,No ratings yet Rate it yourself - /Services/opticians/LeaveReview/DefaultView.aspx?id=OP_5HX_2081__000001_UB69QD,0,0,
Boots-Greenford,OP_5HX_665__000002_UB69PN,OPT,35 The Broadway,,,Greenford,Middlesex,UB6 9PN,Tel: 0208 578 1234, - ,,,No ratings yet Rate it yourself - /Services/opticians/LeaveReview/DefaultView.aspx?id=OP_5HX_665__000002_UB69PN,0,0,
Specsavers Opticians,OP_5HX_14720__000001_UB69PU,OPT,20 The Broadway,Greenford,Middlesex,,,UB6 9PU,Tel: 020 8832 8940, - ,,,No ratings yet Rate it yourself - /Services/opticians/LeaveReview/DefaultView.aspx?id=OP_5HX_14720__000001_UB69PU,0,0,
Vision Express (Harrrow),OP_5K6_11425__000003_HA11HS,OPT,Unit 6 St.George's Shopping Centre,St Anns Road,Harrow,,,HA1 1HS,Tel: 020 8427 3311, - ,,,1 rating Rate it yourself - /Services/opticians/LeaveReview/DefaultView.aspx?id=OP_5K6_11425__000003_HA11HS,,,
King Opticians,OP_5HX___000002_UB24DG,OPT,31-33 King Street,,Southall,Middx,,UB2 4DG,Tel: 0208 574 6927, - ,,,7 ratings Rate it yourself - /Services/opticians/LeaveReview/DefaultView.aspx?id=OP_5HX___000002_UB24DG,,,
St Ann's Optical Centre,OP_5K6_10180__000001_HA11LE,OPT,58 Greenhill Way,Harrow,Middlesex,,,HA1 1LE,Tel: 020 8863 5575, - ,,,1 rating Rate it yourself - /Services/opticians/LeaveReview/DefaultView.aspx?id=OP_5K6_10180__000001_HA11LE,,,
Boots Opticians,OP_5K6_12060__000002_HA11HS,OPT,30 St. Anns Road,,,Harrow,,HA1 1LA,Tel: 0208 427 4113, - ,,,98 ratings Rate it yourself - /Services/opticians/LeaveReview/DefaultView.aspx?id=OP_5K6_12060__000002_HA11HS,,,
Boots-Harrow - St Anns Rd,OP_5K6_1130__000001_HA11LA,OPT,30 St Anns Road,,,Harrow,Middlesex,HA1 1LA,Tel: 0208 427 4113, - ,,,2 ratings Rate it yourself - /Services/opticians/LeaveReview/DefaultView.aspx?id=OP_5K6_1130__000001_HA11LA,,,
Boots-Greenford,UB6 0UW_19217,OPT,,1000 Greenford Road,,Greenford,Middlesex,UB6 0UW,Tel: 0208 575 2152, - ,,,No ratings yet Rate it yourself - /Services/opticians/LeaveReview/DefaultView.aspx?id=UB6 0UW_19217,0,0,
Specsavers Opticians (Harrow Visionplus Ltd),OP_5K6_13138__000002_HA12TA,OPT,289 Station Road,,Harrow,,,HA1 2TA,Tel: 020 8424 0244, - ,,,5 ratings Rate it yourself - /Services/opticians/LeaveReview/DefaultView.aspx?id=OP_5K6_13138__000002_HA12TA,,,
J B Richards,OP_5GV_155__000001_WD18EH,OPT,20 Vicarage Road,,,Watford,Hertfordshire,WD18 0EH,Tel: 01923 227858, - ,,,No ratings yet Rate it yourself - /Services/opticians/LeaveReview/DefaultView.aspx?id=OP_5GV_155__000001_WD18EH,0,0,
Adams Opticians (Harrow Weald),OP_5K6_9378__000002_HA36EL,OPT,411 High Road,Harrow Weald,Harrow,,,HA3 6EL,Tel: 0208 427 3201, - ,,,No ratings yet Rate it yourself - /Services/opticians/LeaveReview/DefaultView.aspx?id=OP_5K6_9378__000002_HA36EL,0,0,
Visionsavers Opticians,OP_5K6_14943__000001_HA35DQ,OPT,53 High Street,Wealdstone,Harrow,,,HA3 5DQ,Tel: 020 8861 6006, - ,,,No ratings yet Rate it yourself - /Services/opticians/LeaveReview/DefaultView.aspx?id=OP_5K6_14943__000001_HA35DQ,0,0,
Michael Blackstone Optometrists,OP_5G4_13333__000001_HP91QQ,OPT,18 The Highway,Station Road,,Beaconsfield,Buckinghamshire,HP9 1QQ,Tel: 01494 673782, - ,,,No ratings yet Rate it yourself - /Services/opticians/LeaveReview/DefaultView.aspx?id=OP_5G4_13333__000001_HP91QQ,0,0,
Brush & Fowler Opticians,OP_5K6_3376__000001_HA12JN,OPT,3 Manor Parade,Sheepcote Road,Harrow,,,HA1 2JN,Tel: 0208 427 0279, - ,,,No ratings yet Rate it yourself - /Services/opticians/LeaveReview/DefaultView.aspx?id=OP_5K6_3376__000001_HA12JN,0,0,
Visioncare Eye -Clinic ,OP_5K6_543__000002_HA37AF,OPT,Visioncare Medical Eye Centre,62-64 High Street,Wealdstone,Harrow,Middlesex,HA3 7AF,Tel: 020 8863 5333, - ,,,No ratings yet Rate it yourself - /Services/opticians/LeaveReview/DefaultView.aspx?id=OP_5K6_543__000002_HA37AF,0,0,
Cranford Opticians,OP_5HY_13896__000002_TW59TY,OPT,742 Bath Road,Cranford,,Hounslow,Middlesex,TW5 9TY,Tel: 020 8759 9395, - ,,,27 ratings Rate it yourself - /Services/opticians/LeaveReview/DefaultView.aspx?id=OP_5HY_13896__000002_TW59TY,,,Data not available
Boots-Beaconsfield,OP_5G4_13334__000001_HP91HH,OPT,25 Gregories Road,,,Beaconsfield,Buckinghamshire,HP9 1HH,Tel: 01494 673627, - ,,,No ratings yet Rate it yourself - /Services/opticians/LeaveReview/DefaultView.aspx?id=OP_5G4_13334__000001_HP91HH,0,0,
S H Harrold (1937) Ltd,OP_5G4_3077__000001_HP91HQ,OPT,26 Gregories Road,,Beaconsfield,,,HP9 1HQ,Tel: 01494 672193, - ,,,No ratings yet Rate it yourself - /Services/opticians/LeaveReview/DefaultView.aspx?id=OP_5G4_3077__000001_HP91HQ,0,0,