Organisation Name,NACS Code,Organisation Type,Address1,Address2,Address3,Address4,Address5,PostCode,Telephone Number,Opening time,Value  (Opening time),Banding Classification  (Opening time),NHS.UK users rating,Value  (NHS.UK users rating),Banding Classification  (NHS.UK users rating),Car parking (Is there car parking at this organisation?)
"O'Brien,Wrench & Lowcock Opticians",OP_5KW_912__000001_GL205PP,OPT,Theocsbury House,18-20 Barton Street,,Tewkesbury,Gloucestershire,GL20 5PP,Tel: 01684 850212, - ,,,1 rating Rate it yourself - /Services/opticians/LeaveReview/DefaultView.aspx?id=OP_5KW_912__000001_GL205PP,,,yes
Scrivens,OP_5KW_5468__000003_GL205LQ,OPT,"131, High Street",,,Tewkesbury,Gloucestershire,GL20 5JR,Tel: 01684 299904, - ,,,No ratings yet Rate it yourself - /Services/opticians/LeaveReview/DefaultView.aspx?id=OP_5KW_5468__000003_GL205LQ,0,0,
Boots Opticians,TP4GR,OPT,,99-100 High Street,,Tewkesbury,,GL20 5JZ,, - ,,,No ratings yet Rate it yourself - /Services/opticians/LeaveReview/DefaultView.aspx?id=TP4GR,0,0,
Zeiss Opticians,OP_5KW_1158__000002_GL205JZ,OPT,108 High Street,,Tewkesbury,Gloucestershire,,GL20 5JZ,Tel: 01684 292201, - ,,,No ratings yet Rate it yourself - /Services/opticians/LeaveReview/DefaultView.aspx?id=OP_5KW_1158__000002_GL205JZ,0,0,
Specsavers Opticians,OP_5KW_6582__000002_GL205LQ,OPT,Unit 3,Bishops Walk,Tewkesbury,Gloucestershire,,GL20 5LQ,Tel: 01684 273027, - ,,,No ratings yet Rate it yourself - /Services/opticians/LeaveReview/DefaultView.aspx?id=OP_5KW_6582__000002_GL205LQ,0,0,
Specsavers Cheltenham North West,111003012017,OPT,,Sainsburys Superstore,,Cheltenham,,GL51 9RR,, - ,,,No ratings yet Rate it yourself - /Services/opticians/LeaveReview/DefaultView.aspx?id=111003012017,0,0,
Scrivens,OP_5KW_10764__000001_GL517RY,OPT,"60, Edinburgh Place",Coronation Square,,Cheltenham,Gloucestershire,GL51 7SA,Tel: 01242 235220, - ,,,No ratings yet Rate it yourself - /Services/opticians/LeaveReview/DefaultView.aspx?id=OP_5KW_10764__000001_GL517RY,0,0,
John Weygang Optometrists,D4R1G,OPT,,"31 Morley Avenue, Churchdown",,Gloucester,,GL3 2BL,Tel: 01452 855484, - ,,,No ratings yet Rate it yourself - /Services/opticians/LeaveReview/DefaultView.aspx?id=D4R1G,0,0,
"Tesco’s Opticians, Cheltenham ",OP_GL518JQ_30717,OPT,,Colletts Drive,,Cheltenham,,GL51 8JQ,Tel: 0345 601 3479, - ,,,No ratings yet Rate it yourself - /Services/opticians/LeaveReview/DefaultView.aspx?id=OP_GL518JQ_30717,0,0,
Guilford & Carter Optometrists,OP_5KW_3199__000002_GL524LR,OPT,21 Church Road,Bishop's Cleeve,Cheltenham,Gloucestershire,Gloucestershire,GL52 8LR,Tel: 01242 675964, - ,,,2 ratings Rate it yourself - /Services/opticians/LeaveReview/DefaultView.aspx?id=OP_5KW_3199__000002_GL524LR,,,yes
Maddox Eyecare,01-21036,OPT,,St Paul’s Medical Centre,,Cheltenham,,GL50 4DP,Tel: 01242 282059, - ,,,1 rating Rate it yourself - /Services/opticians/LeaveReview/DefaultView.aspx?id=01-21036,,,yes
Specsavers Opticians,OP_5KW_128__000002_GL503HF,OPT,206. High Street,,,Cheltenham,,GL50 3HF,Tel: 01242 224314, - ,,,No ratings yet Rate it yourself - /Services/opticians/LeaveReview/DefaultView.aspx?id=OP_5KW_128__000002_GL503HF,0,0,
Keith Holland & Associates,OP_5KW_3508__000002_GL503DT,OPT,27 St. Georges Road,,,Cheltenham,,GL50 3DT,Tel: 01242 233500, - ,,,No ratings yet Rate it yourself - /Services/opticians/LeaveReview/DefaultView.aspx?id=OP_5KW_3508__000002_GL503DT,0,0,no
David Clulow,OP_5KW_11848__000001_GL501EN,OPT,213 High Street,,Cheltenham,Gloucestershire,,GL50 3HH,Tel: 01242 250005, - ,,,No ratings yet Rate it yourself - /Services/opticians/LeaveReview/DefaultView.aspx?id=OP_5KW_11848__000001_GL501EN,0,0,
Optical Express,5KW20008__000001_GL501DG,OPT,,43-45 Promenade,,Cheltenham,Gloucestershire,GL50 1PY,Tel: 0800 0232020, - ,,,No ratings yet Rate it yourself - /Services/opticians/LeaveReview/DefaultView.aspx?id=5KW20008__000001_GL501DG,0,0,
Boots-Cheltenham - High St,OP_5KW_8341__000002_GL501DB,OPT,197-199 High Street,,,Cheltenham,Gloucestershire,GL50 1DB,Tel: 01242 580730, - ,,,No ratings yet Rate it yourself - /Services/opticians/LeaveReview/DefaultView.aspx?id=OP_5KW_8341__000002_GL501DB,0,0,
Vision Express ,OP_5KW_12700__000001_GL501DQ,OPT,188 High Street,,Cheltenham,Gloucestershire,,GL50 1EP,Tel: 01242 238777, - ,,,No ratings yet Rate it yourself - /Services/opticians/LeaveReview/DefaultView.aspx?id=OP_5KW_12700__000001_GL501DQ,0,0,
Harper and Cooper Opticians,CO-5293,OPT,,4 Ormond Place,,Cheltenham  ,,GL50 1JD,, - ,,,3 ratings Rate it yourself - /Services/opticians/LeaveReview/DefaultView.aspx?id=CO-5293,,,
Cheltenham Medical Eye Centre,OP_5KW_1077__000003_GL501HE,OPT,11 Regent Street,,Cheltenham,Gloucestershire,,GL50 1HE,Tel: 01242 221442, - ,,,1 rating Rate it yourself - /Services/opticians/LeaveReview/DefaultView.aspx?id=OP_5KW_1077__000003_GL501HE,,,
Boots-Cheltenham - Regent Arcade,OP_5KW_3677__000001_GL501JZ,OPT,"Unit 40, Regent Arcade",Regent Street,Cheltenham,Gloucestershire,,GL50 1JZ,Tel: 01242 577811, - ,,,No ratings yet Rate it yourself - /Services/opticians/LeaveReview/DefaultView.aspx?id=OP_5KW_3677__000001_GL501JZ,0,0,
Ellis and Killpartrick,OP_5KW_12083__000002_GL501JZ,OPT,Regent Arcade,Regent Street,Cheltenham,Gloucestershire,,GL50 1JZ,Tel: 01242 228686, - ,,,No ratings yet Rate it yourself - /Services/opticians/LeaveReview/DefaultView.aspx?id=OP_5KW_12083__000002_GL501JZ,0,0,
Chapman  Opticians,OP_5KW_11399__000003_GL501JZ,OPT,12 Regent Arcade,Regent Street,Cheltenham,Gloucestershire,,GL50 1JZ,Tel: 01242 584358, - ,,,No ratings yet Rate it yourself - /Services/opticians/LeaveReview/DefaultView.aspx?id=OP_5KW_11399__000003_GL501JZ,0,0,
Smith & Swepson Opticians,OP_5KW_915__000001_GL501QB,OPT,,2 Imperial Square,,Cheltenham,Gloucestershire,GL50 1QB,Tel: 01242 243800, - ,,,No ratings yet Rate it yourself - /Services/opticians/LeaveReview/DefaultView.aspx?id=OP_5KW_915__000001_GL501QB,0,0,
Kodak Lens Optician Outlet,TP817,OPT,,Unit 2 Morrison Centre,,Cheltenham,,GL51 3BW,, - ,,,No ratings yet Rate it yourself - /Services/opticians/LeaveReview/DefaultView.aspx?id=TP817,0,0,
Independent Eyecare Centre,OP_5KW_12701__000002_GL537NG,OPT,144 Bath Road,,Cheltenham,Gloucestershire,,GL53 7NG,Tel: 01242 222802, - ,,,No ratings yet Rate it yourself - /Services/opticians/LeaveReview/DefaultView.aspx?id=OP_5KW_12701__000002_GL537NG,0,0,
Cheltenham General Hospital,OP_5KW_1846__000001_GL537AN,OPT,Department Of Optometry,Sandford Road,Cheltenham,Gloucestershire,,GL53 7AN,Tel: 08454 223 203, - ,,,No ratings yet Rate it yourself - /Services/opticians/LeaveReview/DefaultView.aspx?id=OP_5KW_1846__000001_GL537AN,0,0,
Gloucester Royal Hospital,OP_5KX_3397__000003_GL13NN,OPT,Great Western Road,,Gloucester,Gloucestershire,,GL1 3NN,Tel: 08454 222222, - ,,,2 ratings Rate it yourself - /Services/opticians/LeaveReview/DefaultView.aspx?id=OP_5KX_3397__000003_GL13NN,,,
John Weygang Optometrists,OP_5KX_3798__000001_GL33TL,OPT,39 Hucclecote Road,Hucclecote,Gloucester,Gloucestershire,,GL3 3TL,Tel: 01452 619100, - ,,,1 rating Rate it yourself - /Services/opticians/LeaveReview/DefaultView.aspx?id=OP_5KX_3798__000001_GL33TL,,,
The Vision Centre,TP1L0,OPT,,50 Northgate Street,,Gloucester,,GL1 1SQ,Tel: 0145 2410494, - ,,,No ratings yet Rate it yourself - /Services/opticians/LeaveReview/DefaultView.aspx?id=TP1L0,0,0,
John Weygang & Partners,OP_5KX_8694__000001_GL11DP,OPT,26 Clarence Street,26 Clarence Street,Gloucester,Gloucester,,GL1 1DP,Tel: 01452 522118, - ,,,No ratings yet Rate it yourself - /Services/opticians/LeaveReview/DefaultView.aspx?id=OP_5KX_8694__000001_GL11DP,0,0,
Asda Stores Ltd,TP1JR,OPT,,Bruton Way,,Gloucester,,GL1 1DS,Tel: 01452 833012, - ,,,No ratings yet Rate it yourself - /Services/opticians/LeaveReview/DefaultView.aspx?id=TP1JR,0,0,
Boots Opticians - Gloucester (7 Eastgate Street),OP_5KX_10567__000001_GL11NS,OPT,7 Eastgate Street,,,Gloucester,Gloucestershire,GL1 1NS,Tel: 01452 524 175, - ,,,No ratings yet Rate it yourself - /Services/opticians/LeaveReview/DefaultView.aspx?id=OP_5KX_10567__000001_GL11NS,0,0,
Norville Opticians Gloucester,OP_5KX_1218__000001_GL11PN,OPT,65 Eastgate Street,,Gloucester,Gloucestershire,,GL1 1PN,Tel: 01452 522033, - ,,,2 ratings Rate it yourself - /Services/opticians/LeaveReview/DefaultView.aspx?id=OP_5KX_1218__000001_GL11PN,,,
Boots Opticians - Gloucester (38-46 Eastgate Street),GL1 1PU_18173,OPT,,38-46 Eastgate Street,,Gloucester,Gloucestershire,GL1 1PU,Tel: 01452 419429, - ,,,1 rating Rate it yourself - /Services/opticians/LeaveReview/DefaultView.aspx?id=GL1 1PU_18173,,,
Vision Care for Homeless People ,W3O7X,OPT,Gloucester City Mission,72 Eastgate Street,,Gloucester,Gloucestershire,GL1 1QN,Tel: 07468 492341, - ,,,No ratings yet Rate it yourself - /Services/opticians/LeaveReview/DefaultView.aspx?id=W3O7X,0,0,
Specsavers Opticians,OP_5KX_13099__000003_GL11XH,OPT,4-6 Bell Walk,Eastgate Shopping Centre,Gloucester,Gloucestershire,,GL1 1XH,Tel: 01452 505163, - ,,,No ratings yet Rate it yourself - /Services/opticians/LeaveReview/DefaultView.aspx?id=OP_5KX_13099__000003_GL11XH,0,0,
Vision Express,5KX  8928__000004_GL11XH,OPT,,Eastgate Centre,,Gloucester,Gloucestershire,GL1 1XH,Tel: 01452 421122, - ,,,2 ratings Rate it yourself - /Services/opticians/LeaveReview/DefaultView.aspx?id=5KX  8928__000004_GL11XH,,,
"Tesco Opticians, Gloucester",OP_GL34AA_30175,OPT,,"Gloucester Business Park, Delta Way",,Gloucester,,GL3 4AA,Tel: 0345 601 3479, - ,,,No ratings yet Rate it yourself - /Services/opticians/LeaveReview/DefaultView.aspx?id=OP_GL34AA_30175,0,0,
John Weygang Optometrists,OP_5KX_1556__000001_GL45UA,OPT,4 Abbeymead Avenue,Abbeymead,Gloucester,Gloucestershire,,GL4 5UA,Tel: 01452 306807, - ,,,1 rating Rate it yourself - /Services/opticians/LeaveReview/DefaultView.aspx?id=OP_5KX_1556__000001_GL45UA,,,
Upton Vision,P0N0A,OPT,,6 Old Street,,Worcester,,WR8 0HA,, - ,,,No ratings yet Rate it yourself - /Services/opticians/LeaveReview/DefaultView.aspx?id=P0N0A,0,0,
Cotswold Eye Care Centre,OP_5KW_6379__000002_GL545LJ,OPT,High Street,,Winchcombe,Gloucestershire,Gloucestershire,GL54 5LJ,Tel: 01242 604654, - ,,,1 rating Rate it yourself - /Services/opticians/LeaveReview/DefaultView.aspx?id=OP_5KW_6379__000002_GL545LJ,,,
John Weygang Optometrist - Quedgeley,,OPT,,100 Bristol Road,,Quedgeley,,GL2 4NA,Tel: 01452 721108, - ,,,N/A - Data not available,,,
"Tesco Opticians, Quedgeley",OP_GL24PF_30174,OPT,,Bristol Road,,Quedgeley,,GL2 4PF,Tel: 0345 677 9567, - ,,,No ratings yet Rate it yourself - /Services/opticians/LeaveReview/DefaultView.aspx?id=OP_GL24PF_30174,0,0,
Ashton & Daniels,OP_5KX_8207__000001_GL181AH,OPT,,35 Broad Street,Newent,Gloucestershire,,GL18 1AQ,Tel: 01531 820677, - ,,,No ratings yet Rate it yourself - /Services/opticians/LeaveReview/DefaultView.aspx?id=OP_5KX_8207__000001_GL181AH,0,0,
Signet Armorlite Europe Limited (Kodak Lens Designer Outlet),OP_GL22DE_30173,OPT,,"Davy Way, Waterwells Business Park",,Quedgeley,Gloucestershire,GL2 2DE,Tel: 01452 887470, - ,,,No ratings yet Rate it yourself - /Services/opticians/LeaveReview/DefaultView.aspx?id=OP_GL22DE_30173,0,0,
Pershore Eyecare Centre,CO - 5410,OPT,,16 Bridge Street,,Pershore,Worcestershire,WR10 1AT,Tel: 01386 555675, - ,,,No ratings yet Rate it yourself - /Services/opticians/LeaveReview/DefaultView.aspx?id=CO - 5410,0,0,
Peter J Smith,00000061__000002_WR101BG,OPT,14 High Street,,,Pershore,Worcestershire,WR10 1BG,Tel: 01386 553922, - ,,,No ratings yet Rate it yourself - /Services/opticians/LeaveReview/DefaultView.aspx?id=00000061__000002_WR101BG,0,0,
Miller J.S & D,OP_5CN_8563__000002_HR81DS,OPT,27 High Street,Ledbury,Herefordshire,,,HR8 1DS,Tel: 01531 632290, - ,,,No ratings yet Rate it yourself - /Services/opticians/LeaveReview/DefaultView.aspx?id=OP_5CN_8563__000002_HR81DS,0,0,
Hayward & Miller Independent Eyecare,O9J2F,OPT,,27 High Street,,Ledbury,,HR8 1DS,Tel: 01531632290, - ,,,No ratings yet Rate it yourself - /Services/opticians/LeaveReview/DefaultView.aspx?id=O9J2F,0,0,
Matteo M,OP_5CN_4129__000001_HR82DX,OPT,6 New Street,Ledbury,Herefordshire,,,HR8 2DX,Tel: 01531 634440, - ,,,No ratings yet Rate it yourself - /Services/opticians/LeaveReview/DefaultView.aspx?id=OP_5CN_4129__000001_HR82DX,0,0,
Waller & Waller Opticians Ltd,OP_5CN_11086__000002_HR82DX,OPT,20 New Street,Ledbury,Herefordshire,,,HR8 2DX,Tel: 01531 632044, - ,,,No ratings yet Rate it yourself - /Services/opticians/LeaveReview/DefaultView.aspx?id=OP_5CN_11086__000002_HR82DX,0,0,
Boots-Ledbury,OP_5CN_HR8 1BN__000002_HR81BN,OPT,9 The Homend,,Ledbury,Ledbury,Herefordshire,HR8 1BN,Tel: 01531 635126, - ,,,No ratings yet Rate it yourself - /Services/opticians/LeaveReview/DefaultView.aspx?id=OP_5CN_HR8 1BN__000002_HR81BN,0,0,
Ledbury Specsavers,TP889,OPT,,3 The Homend,,Ledbury,,HR8 1BN,, - ,,,1 rating Rate it yourself - /Services/opticians/LeaveReview/DefaultView.aspx?id=TP889,,,
Barnards Green Opticians,OP_5MT_4306__000002_WR143LT,OPT,113 Barnards Green Road,,Malvern,,,WR14 3LT,Tel: 01684 892586, - ,,,5 ratings Rate it yourself - /Services/opticians/LeaveReview/DefaultView.aspx?id=OP_5MT_4306__000002_WR143LT,,,
J & D Miller,0000005__000001_WR142AZ,OPT,38 Church Street,,Malvern,Worcesteer,,WR14 2AZ,Tel: 01684 564766, - ,,,No ratings yet Rate it yourself - /Services/opticians/LeaveReview/DefaultView.aspx?id=0000005__000001_WR142AZ,0,0,
Value Vision Opticians,OP_5MT_9208__000001_WR142XH,OPT,3 Church Walk,,Malvern,,,WR14 2XH,Tel: 01684 563779, - ,,,No ratings yet Rate it yourself - /Services/opticians/LeaveReview/DefaultView.aspx?id=OP_5MT_9208__000001_WR142XH,0,0,
G L & K R Holland,OP_5MT_6448__000001_WR142HL,OPT,16 Graham Road,,,Malvern,Worcestershire,WR14 2HL,Tel: 01684 573942, - ,,,No ratings yet Rate it yourself - /Services/opticians/LeaveReview/DefaultView.aspx?id=OP_5MT_6448__000001_WR142HL,0,0,
Waller & Waller,OP_5MT_1952__000001_WR144QH,OPT,Lambert House,Edith Walk,Malvern,,,WR14 4QH,Tel: 01684 892727, - ,,,No ratings yet Rate it yourself - /Services/opticians/LeaveReview/DefaultView.aspx?id=OP_5MT_1952__000001_WR144QH,0,0,
Specsavers Malvern Retail Park,TP8L2,OPT,,"Unit 13, Roman Way",,Malvern,Worcestershire,WR14 1PZ,Tel: 01684 567465, - ,,,No ratings yet Rate it yourself - /Services/opticians/LeaveReview/DefaultView.aspx?id=TP8L2,0,0,
Specsavers Opticians,00000062__000002_WR114SQ,OPT,24 Bridge Street,,,Evesham,Worcestershire,WR11 4RR,Tel: 01386 423301, - ,,,397 ratings Rate it yourself - /Services/opticians/LeaveReview/DefaultView.aspx?id=00000062__000002_WR114SQ,,,
Boots-Evesham,OP_5MT_10560__000002_WR114RR,OPT,22 Bridge Street,,,Evesham,Worcestershire,WR11 4RR,Tel: 01386 446 176, - ,,,No ratings yet Rate it yourself - /Services/opticians/LeaveReview/DefaultView.aspx?id=OP_5MT_10560__000002_WR114RR,0,0,
S.J Tromans,OP_5MT_4788__000001_WR141AA,OPT,255 Worcester Road,,Malvern,,,WR14 1AA,Tel: 01684 565145, - ,,,No ratings yet Rate it yourself - /Services/opticians/LeaveReview/DefaultView.aspx?id=OP_5MT_4788__000001_WR141AA,0,0,
Osbornes of Evesham,00000060__000001_WR114PA,OPT,Cross Keys House,1-3 Swan Lane,,Evesham,Worcestershire,WR11 4PA,Tel: 01386 47997, - ,,,No ratings yet Rate it yourself - /Services/opticians/LeaveReview/DefaultView.aspx?id=00000060__000001_WR114PA,0,0,
Boots-Stroud,OP_5KY_11005__000001_GL51AU,OPT,9-10 High Street,,Stroud,Gloucestershire,,GL5 1AU,Tel: 01453 764699, - ,,,No ratings yet Rate it yourself - /Services/opticians/LeaveReview/DefaultView.aspx?id=OP_5KY_11005__000001_GL51AU,0,0,
Specsavers Opticians,OP_5KY_2376__000001_GL53DE,OPT,22 King Street,,Stroud,Gloucestershire,,GL5 3DE,Tel: 01453 766601, - ,,,1 rating Rate it yourself - /Services/opticians/LeaveReview/DefaultView.aspx?id=OP_5KY_2376__000001_GL53DE,,,
Chris Cheshire Opticians,0000001__000001_WR127AA,OPT,17 The Green,High Street,,Broadway,Worcestershire,WR12 7AA,Tel: 01386 859109, - ,,,No ratings yet Rate it yourself - /Services/opticians/LeaveReview/DefaultView.aspx?id=0000001__000001_WR127AA,0,0,
Stroud Vision Centre,OP_5KY_9164__000001_GL53DX,OPT,3 George Street,,Stroud,Gloucestershire,,GL5 3DX,Tel: 01453 764103, - ,,,No ratings yet Rate it yourself - /Services/opticians/LeaveReview/DefaultView.aspx?id=OP_5KY_9164__000001_GL53DX,0,0,
Bailey Opticians,OP_5KY_3374__000001_GL102NG,OPT,15 High Street,Bailey Opticians,15 High Street,Stonehouse,Gloucestershire,GL10 2NG,Tel: 01453 823399, - ,,,No ratings yet Rate it yourself - /Services/opticians/LeaveReview/DefaultView.aspx?id=OP_5KY_3374__000001_GL102NG,0,0,
Ashton & Daniels,OP_5KX_8206__000001_GL142SU,OPT,63 High Street,,Cinderford,Gloucestershire,,GL14 2SU,Tel: 01594 823666, - ,,,No ratings yet Rate it yourself - /Services/opticians/LeaveReview/DefaultView.aspx?id=OP_5KX_8206__000001_GL142SU,0,0,
Geoffrey Roberts,OP_5MT_14399__000001_WR25AJ,OPT,38 St Johns,,Worcester,Worcestershire,,WR2 5AJ,Tel: 01905 423217, - ,,,No ratings yet Rate it yourself - /Services/opticians/LeaveReview/DefaultView.aspx?id=OP_5MT_14399__000001_WR25AJ,0,0,
David Kear Opticians,OP_5KX_7702__000001_GL142NL,OPT,David Kear Opticians,1 Woodside Street,,Cinderford,Gloucestershire,GL14 2NL,Tel: 01594 823690, - ,,,1 rating Rate it yourself - /Services/opticians/LeaveReview/DefaultView.aspx?id=OP_5KX_7702__000001_GL142NL,,,
Stephen John Opticians,OP_5MT_7555__000001_WR12AQ,OPT,2 Charles Street,,,Worcester,Warwickshire,WR1 2AQ,Tel: 01905 745454, - ,,,No ratings yet Rate it yourself - /Services/opticians/LeaveReview/DefaultView.aspx?id=OP_5MT_7555__000001_WR12AQ,0,0,
Specsavers Opticians,OP_5MT_2071__000001_WR13LY,OPT,Specsavers,9-13 Pump Street,,Worcester,Worcestershire,WR1 2QX,Tel: 01905 729 779, - ,,,No ratings yet Rate it yourself - /Services/opticians/LeaveReview/DefaultView.aspx?id=OP_5MT_2071__000001_WR13LY,0,0,
Boots-Worcester - High St (in Boots UK),OP_5MT_7617__000001_WR13LD,OPT,72-74 High Street,,,Worcester,Worcestershire,WR1 2EU,Tel: 01905 25613, - ,,,1 rating Rate it yourself - /Services/opticians/LeaveReview/DefaultView.aspx?id=OP_5MT_7617__000001_WR13LD,,,
Dominic Tunnell Opticians ,OP_5MT_3702__000001_WR12DH,OPT,6 Mealcheapen Street,6 Mealcheapen Street,Worcester,Worcester,,WR1 2DH,Tel: 01905 613020, - ,,,No ratings yet Rate it yourself - /Services/opticians/LeaveReview/DefaultView.aspx?id=OP_5MT_3702__000001_WR12DH,0,0,
Actons Opticians,OP_5MT_8086__000002_WR12DR,OPT,10 Cornmarket,,Worcester,,,WR1 2DR,Tel: 01905 22156, - ,,,No ratings yet Rate it yourself - /Services/opticians/LeaveReview/DefaultView.aspx?id=OP_5MT_8086__000002_WR12DR,0,0,
Mr DK Stephens t/a Brauchli Opticians,0000000__000001_WR49RW,OPT,7 St Swithens Street,,Worcester,Worcestershire,,WR1 2PY,Tel: 01905 26193, - ,,,1 rating Rate it yourself - /Services/opticians/LeaveReview/DefaultView.aspx?id=0000000__000001_WR49RW,,,
Specs Express,OP_5MT_8820__000001_WR12PS,OPT,10 St. Swithins Street,,Worcester,,,WR1 2PS,Tel: 01905 613037, - ,,,No ratings yet Rate it yourself - /Services/opticians/LeaveReview/DefaultView.aspx?id=OP_5MT_8820__000001_WR12PS,0,0,
Opticial Express,OP_12345_WR1 3LH,OPT,,6/9 Broad Street,,Worcester,,WR1 3LH,, - ,,,No ratings yet Rate it yourself - /Services/opticians/LeaveReview/DefaultView.aspx?id=OP_12345_WR1 3LH,0,0,
Vision Express (UK) Ltd,OP_5MT_12893__000001_WR13LE,OPT,1-2 Friary Walk,,Worcester,,,WR1 3LE,Tel: 01905 616699, - ,,,No ratings yet Rate it yourself - /Services/opticians/LeaveReview/DefaultView.aspx?id=OP_5MT_12893__000001_WR13LE,0,0,
Ashton & Daniels,OP_5CN_11245__000001_HR97AN,OPT,3 Cantilupe Court,Ross-on-Wye,Herefordshire,,,HR9 7AN,Tel: 01989 562173, - ,,,1 rating Rate it yourself - /Services/opticians/LeaveReview/DefaultView.aspx?id=OP_5CN_11245__000001_HR97AN,,,
Nic Sproson - The Optician,OP_5MT_8842__000001_WR11JA,OPT,52 Barbourne Road,,,Worcester,Worcestershire,WR1 1JA,Tel: 01905 27327, - ,,,No ratings yet Rate it yourself - /Services/opticians/LeaveReview/DefaultView.aspx?id=OP_5MT_8842__000001_WR11JA,0,0,
Specsavers,OP_5CN_13517__000001_HR95BU,OPT,13 Gloucester Road,Ross On Wye,Herefordshire,,,HR9 5BU,Tel: 01989 564460, - ,,,No ratings yet Rate it yourself - /Services/opticians/LeaveReview/DefaultView.aspx?id=OP_5CN_13517__000001_HR95BU,0,0,
Finch Optical,L5C9G,OPT,,7 Old Market,,Nailsworth,Gloucestershire,GL6 0DU,Tel: 01453 834339, - ,,,No ratings yet Rate it yourself - /Services/opticians/LeaveReview/DefaultView.aspx?id=L5C9G,0,0,
Scotts Opticians,OP_5CN_9336__000002_HR95AD,OPT,Ross-on-Wye Community Hospital,Alton Street,Ross-on-Wye,,,HR9 5AD,Tel: 01989 567244, - ,,,No ratings yet Rate it yourself - /Services/opticians/LeaveReview/DefaultView.aspx?id=OP_5CN_9336__000002_HR95AD,0,0,
Greys Opticians,5KY 20001__000002_GL556AT,OPT,,"Drury House, The Square",High Street,Chipping Campden,Gloucestershire,GL55 6AL,Tel: 01386 848884, - ,,,No ratings yet Rate it yourself - /Services/opticians/LeaveReview/DefaultView.aspx?id=5KY 20001__000002_GL556AT,0,0,
R J Holmes Opticians ,OP_5KY_1317__000001_GL71QA,OPT,6 Castle Street,,Cirencester,Gloucestershire,,GL7 1QA,Tel: 01285 650136, - ,,,No ratings yet Rate it yourself - /Services/opticians/LeaveReview/DefaultView.aspx?id=OP_5KY_1317__000001_GL71QA,0,0,
Specsavers Opticians,5KY 20003__000003_GL71JH,OPT,"30, Cricklade Street",,Cirencester,Gloucestershire,,GL7 1JH,Tel: 01285 648610, - ,,,No ratings yet Rate it yourself - /Services/opticians/LeaveReview/DefaultView.aspx?id=5KY 20003__000003_GL71JH,0,0,
Haine & Smith Opticians,OP_5KY_2823__000002_GL71JH,OPT,,6c Cricklade Street,,Cirencester,Gloucestershire,GL7 1JH,Tel: 01285 651161, - ,,,No ratings yet Rate it yourself - /Services/opticians/LeaveReview/DefaultView.aspx?id=OP_5KY_2823__000002_GL71JH,0,0,
Boots-Cirencester,OP_5KY_1665__000001_GL71JH,OPT,42 Cricklade Street,,Cirencester,Gloucestershire,,GL7 1JH,Tel: 01285 654579, - ,,,No ratings yet Rate it yourself - /Services/opticians/LeaveReview/DefaultView.aspx?id=OP_5KY_1665__000001_GL71JH,0,0,
Leightons Opticians & Hearing Care,OP_5KY_11919__000001_GL72PP,OPT,,Merchants House,39-41 Dyer Street,Cirencester,Gloucestershire,GL7 2PP,Tel: 01285 651 344, - ,,,No ratings yet Rate it yourself - /Services/opticians/LeaveReview/DefaultView.aspx?id=OP_5KY_11919__000001_GL72PP,0,0,
Philip Kersey & Partners,OP_5KY_7259__000003_GL72PF,OPT,56 Dyer Street,,Cirencester,Gloucestershire,,GL7 2PF,Tel: 01285 641999, - ,,,1 rating Rate it yourself - /Services/opticians/LeaveReview/DefaultView.aspx?id=OP_5KY_7259__000003_GL72PF,,,
The Opticians,5KY 20005__000001_GL541AA,OPT,Sheep Street,Sheep Street,Stow On The Wold,Gloucestershire,,GL54 1AA,Tel: 01451 830554, - ,,,1 rating Rate it yourself - /Services/opticians/LeaveReview/DefaultView.aspx?id=5KY 20005__000001_GL541AA,,,
"Tesco’s Opticians, Cirencester",OP_GL71NP_30718,OPT,,"Kings Meadow, Cricklade Road",,Cirencester,,GL7 1NP,Tel: 0345 601 3479, - ,,,No ratings yet Rate it yourself - /Services/opticians/LeaveReview/DefaultView.aspx?id=OP_GL71NP_30718,0,0,
Kevin Tait Opticians,OP_5KY_3831__000001_GL560AS,OPT,3 High Street,,Moreton-In-Marsh,Gloucestershire,,GL56 0AH,Tel: 01608 650621, - ,,,5 ratings Rate it yourself - /Services/opticians/LeaveReview/DefaultView.aspx?id=OP_5KY_3831__000001_GL560AS,,,
Armstrong and North Opticians,OP_5KY_2433__000002_GL114AA,OPT,24a Parsonage Street,,Dursley,Gloucestershire,,GL11 4AA,Tel: 01453 545816, - ,,,No ratings yet Rate it yourself - /Services/opticians/LeaveReview/DefaultView.aspx?id=OP_5KY_2433__000002_GL114AA,0,0,
Haine & Smith Opticians,OP_5KY_10964__000001_GL88JG,OPT,,5 Church Street,Tetbury,Gloucestershire,,GL8 8JG,Tel: 01666 503610, - ,,,No ratings yet Rate it yourself - /Services/opticians/LeaveReview/DefaultView.aspx?id=OP_5KY_10964__000001_GL88JG,0,0,
Poole Optometry,OP_5KY_10708__000002_GL88JG,OPT,2 Church Street,,Tetbury,Gloucestershire,,GL8 8JG,Tel: 01666 502913, - ,,,No ratings yet Rate it yourself - /Services/opticians/LeaveReview/DefaultView.aspx?id=OP_5KY_10708__000002_GL88JG,0,0,