Organisation Name,NACS Code,Organisation Type,Address1,Address2,Address3,Address4,Address5,PostCode,Telephone Number,Opening time,Value  (Opening time),Banding Classification  (Opening time),NHS.UK users rating,Value  (NHS.UK users rating),Banding Classification  (NHS.UK users rating),Car parking (Is there car parking at this organisation?)
Leightons Eye Windsor,OP_SL41DE_34402,OPT,,45 Peascod Street,,Windsor,Berkshire,SL4 1DE,Tel: 01753 336124, - ,,,No ratings yet Rate it yourself - /Services/opticians/LeaveReview/DefaultView.aspx?id=OP_SL41DE_34402,0,0,
Specsavers Optician,OP_SL41DE_46578,OPT,Specsavers Optician,59 Peascod Street,,Windsor,Berkshire,SL4 1DE,Tel: 01753 410970, - ,,,No ratings yet Rate it yourself - /Services/opticians/LeaveReview/DefaultView.aspx?id=OP_SL41DE_46578,0,0,
Vision Express,OP_5QG_12112__000001_SL41TF,OPT,16 King Edward Court,Windsor,,Berkshire,,SL4 1TF,Tel: 01753 850550, - ,,,No ratings yet Rate it yourself - /Services/opticians/LeaveReview/DefaultView.aspx?id=OP_5QG_12112__000001_SL41TF,0,0,yes
Boots-Windsor - Peascod St,TP4QA,OPT,119 Peascod Street,,,Windsor,Berkshire,SL4 1DW,Tel: 01753 867041, - ,,,No ratings yet Rate it yourself - /Services/opticians/LeaveReview/DefaultView.aspx?id=TP4QA,0,0,
Asda Opticians,OP_5DM_286__000001_SL19LA,OPT,,Asda Slough Superstore,Telford Drive,Slough,,SL1 9LA,Tel: 01753 894020, - ,,,1 rating Rate it yourself - /Services/opticians/LeaveReview/DefaultView.aspx?id=OP_5DM_286__000001_SL19LA,,,
Valli Opticians Stockport,E1D9Q,OPT,,15 Great Underbank,,Stockport,Greater Manchester,SL1 1LF,Tel: 01614740974, - ,,,No ratings yet Rate it yourself - /Services/opticians/LeaveReview/DefaultView.aspx?id=E1D9Q,0,0,
Thomas H Collison Ltd,OP_5DM_4323__000001_SL11EL,OPT,60 High Street,,Slough,Slough,,SL1 1EL,Tel: 01753 524392, - ,,,No ratings yet Rate it yourself - /Services/opticians/LeaveReview/DefaultView.aspx?id=OP_5DM_4323__000001_SL11EL,0,0,
The Eye Centre,OP_SL11PQ_34410,OPT,,1 Church Street,,Slough,,SL1 1PQ,Tel: 01753 691692, - ,,,No ratings yet Rate it yourself - /Services/opticians/LeaveReview/DefaultView.aspx?id=OP_SL11PQ_34410,0,0,
Vision Express (UK) Ltd,OP_5DM_12118__000001_SL11DD,OPT,33-35 Curzon Mall,Queensmere,Slough,,,SL1 1DD,Tel: 01753 693777, - ,,,No ratings yet Rate it yourself - /Services/opticians/LeaveReview/DefaultView.aspx?id=OP_5DM_12118__000001_SL11DD,0,0,
Specsavers Opticians,OP_5DM_660__000001_SL11DB,OPT,194-196 High Street,,Slough,,,SL1 1JS,Tel: 01753 502700, - ,,,No ratings yet Rate it yourself - /Services/opticians/LeaveReview/DefaultView.aspx?id=OP_5DM_660__000001_SL11DB,0,0,
Spectacle Express,OP_5DM_4198__000001_SL11LD,OPT,1 Observatory Centre,,Slough,,,SL1 1LE,Tel: 01753 517417, - ,,,1 rating Rate it yourself - /Services/opticians/LeaveReview/DefaultView.aspx?id=OP_5DM_4198__000001_SL11LD,,,
Vision Express,OP_5G2_8065__000002_GU470FD,OPT,Tesco Express,Brunel Way,Wellington Street,Slough,,SL1 1XW,Tel: 01753 306 605, - ,,,No ratings yet Rate it yourself - /Services/opticians/LeaveReview/DefaultView.aspx?id=OP_5G2_8065__000002_GU470FD,0,0,
Realeyes - The Eye Clinic,OPT_SL14XP_1,OPT,,165 Farnham Road,,Slough,,SL1 4XP,Tel: 01753 915060, - ,,,No ratings yet Rate it yourself - /Services/opticians/LeaveReview/DefaultView.aspx?id=OPT_SL14XP_1,0,0,
Realeyes Limited,OP_SL17JP_46732,OPT,,32 High Street,,Burnham,Buckinghamshire,SL1 7JP,Tel: 01628 559000, - ,,,No ratings yet Rate it yourself - /Services/opticians/LeaveReview/DefaultView.aspx?id=OP_SL17JP_46732,0,0,
Walker & Campbell,OP_5G4_1382__000001_SL17JX,OPT,47 High Street,,Burnham,,,SL1 7JX,Tel: 01628 663055, - ,,,1 rating Rate it yourself - /Services/opticians/LeaveReview/DefaultView.aspx?id=OP_5G4_1382__000001_SL17JX,,,
Complete Community Care NW London Limited,COMPLETE COMMUNITYCARENWLONDONLIMITED1,OPT,,Unit 8 Shepherd's Court,111 High Street,Burnham,Buckinghamshire,SL1 7JZ,Tel: 01895 521 461, - ,,,No ratings yet Rate it yourself - /Services/opticians/LeaveReview/DefaultView.aspx?id=COMPLETE COMMUNITYCARENWLONDONLIMITED1,0,0,
Vision Express,TP79L,OPT,,47 High Street,Nicholson Centre,Maidenhead,Berkshire,SL6 1QB,Tel: 01628 781180, - ,,,No ratings yet Rate it yourself - /Services/opticians/LeaveReview/DefaultView.aspx?id=TP79L,0,0,
Boots-Maidenhead - High St (in Boots UK),OP_5G3_2047__000004_SL61PY,OPT,54-58 High Street,,,Maidenhead,Berkshire,SL6 1PY,Tel: 01628 782880, - ,,,2 ratings Rate it yourself - /Services/opticians/LeaveReview/DefaultView.aspx?id=OP_5G3_2047__000004_SL61PY,,,
Boots-Maidenhead - High St,OP_5G3_564__000003_SL61PY,OPT,,54/58 High Street,Maidenhead,Maidenhead,,SL6 1PY,Tel: 01628 674545, - ,,,1 rating Rate it yourself - /Services/opticians/LeaveReview/DefaultView.aspx?id=OP_5G3_564__000003_SL61PY,,,
Optico Opticians,OP_5G3_5994__000002_SL61PY,OPT,Optico Opticians,80 High Street,,Maidenhead,Berkshire,SL6 1PY,Tel: 01628 770607, - ,,,No ratings yet Rate it yourself - /Services/opticians/LeaveReview/DefaultView.aspx?id=OP_5G3_5994__000002_SL61PY,0,0,
Insight Opticians,OP_SL61EF_34403,OPT,,91A High Street,,Maidenhead,,SL6 1JX,Tel: 01628 671908, - ,,,No ratings yet Rate it yourself - /Services/opticians/LeaveReview/DefaultView.aspx?id=OP_SL61EF_34403,0,0,
Scrivens Opticians,OP_5G3_13127__000001_SL61JX,OPT,Scrivens Opticians,79 High Street,,Maidenhead,,SL6 1JX,Tel: 01628 624632, - ,,,No ratings yet Rate it yourself - /Services/opticians/LeaveReview/DefaultView.aspx?id=OP_5G3_13127__000001_SL61JX,0,0,
Specsavers Opticians,OP_5G3_7069__000002_SL61JX,OPT,85 High Street,Maidenhead,Berkshire,,,SL6 1JX,Tel: 01628 777 220, - ,,,No ratings yet Rate it yourself - /Services/opticians/LeaveReview/DefaultView.aspx?id=OP_5G3_7069__000002_SL61JX,0,0,
Thomas H Collison Ltd,OP_5DM_12922__000002_SL38HJ,OPT,4 Harrow Market,Langley,Slough,LANGLEY,,SL3 8HJ,Tel: 01753 541170, - ,,,No ratings yet Rate it yourself - /Services/opticians/LeaveReview/DefaultView.aspx?id=OP_5DM_12922__000002_SL38HJ,0,0,
Englefield Green Opticians,OP_TW200QX_34400,OPT,,44 Victoria Street,,Engelfield Green,,TW20 0QX,Tel: 01784 432818, - ,,,No ratings yet Rate it yourself - /Services/opticians/LeaveReview/DefaultView.aspx?id=OP_TW200QX_34400,0,0,
Boots-Ascot,OP_5G2_12866__000001_RG121LS,OPT,,61 High Street,,Ascot,Berkshire,SL5 7HP,Tel: 01344 622913, - ,,,No ratings yet Rate it yourself - /Services/opticians/LeaveReview/DefaultView.aspx?id=OP_5G2_12866__000001_RG121LS,0,0,
Norman Prince Ascot Opticians,B8A0O,OPT,,1 Hermitage Parade,,Ascot,Berkshire,SL5 7HE,Tel: 01344 625511, - ,,,No ratings yet Rate it yourself - /Services/opticians/LeaveReview/DefaultView.aspx?id=B8A0O,0,0,
Bayfield's Opticians and Audiologists (Sunninghill and Ascot) ,L8T5A ,OPT,,7 High Street,,Ascot,,SL5 9NQ,, - ,,,No ratings yet Rate it yourself - /Services/opticians/LeaveReview/DefaultView.aspx?id=L8T5A,0,0,
Specsavers Egham,TP71E,OPT,,29 The Precinct,,Egham,,TW20 9HN,Tel: 01784 220580, - ,,,No ratings yet Rate it yourself - /Services/opticians/LeaveReview/DefaultView.aspx?id=TP71E,0,0,
Robinson and Lamb Opticians,TP9JP ,OPT,,7 The Precinct,,Egham,,TW20 9HN,, - ,,,No ratings yet Rate it yourself - /Services/opticians/LeaveReview/DefaultView.aspx?id=TP9JP,0,0,
Boots Opticians,TP6A2,OPT,,The Lexicon,19-23 Braccan Walk,Bracknell,Berkshire,RG12 1BE,Tel: 01344 420933, - ,,,No ratings yet Rate it yourself - /Services/opticians/LeaveReview/DefaultView.aspx?id=TP6A2,0,0,
Specsavers Optician,OP_5G2_6225__000001_RG121DE,OPT,18 Princess Square,,Bracknell,,,RG12 1LS,Tel: 01344 303344, - ,,,No ratings yet Rate it yourself - /Services/opticians/LeaveReview/DefaultView.aspx?id=OP_5G2_6225__000001_RG121DE,0,0,
Insight Opticians,OP_5G2_8738__000002_RG121LS,OPT,15b Princess Square,,Bracknell,,,RG12 1LS,Tel: 01344 454965, - ,,,No ratings yet Rate it yourself - /Services/opticians/LeaveReview/DefaultView.aspx?id=OP_5G2_8738__000002_RG121LS,0,0,
The Optical Studio,OPT_GU254DW_1,OPT,,13 Station Approach,,Virginia Water,,GU25 4DW,Tel: 01344 849077, - ,,,No ratings yet Rate it yourself - /Services/opticians/LeaveReview/DefaultView.aspx?id=OPT_GU254DW_1,0,0,
Vision Express,TP8HJ,OPT,The Lexicon,26 Braccan Walk,,Bracknell,Berkshire,RG12 1EN,Tel: 01344 304217, - ,,,No ratings yet Rate it yourself - /Services/opticians/LeaveReview/DefaultView.aspx?id=TP8HJ,0,0,
Boots-Staines - Two Rivers Centre,OP_5L6_3819__000001_TW184DR,OPT,"Unit S3, Two Rivers Retail Park",,,Staines,Middlesex,TW18 4WB,Tel: 01784 455437, - ,,,1 rating Rate it yourself - /Services/opticians/LeaveReview/DefaultView.aspx?id=OP_5L6_3819__000001_TW184DR,,,
Specsavers Opticians,OP_5L6_10293__000001_TW184DS,OPT,Unit 5ud,Two Rivers,Staines,Middlesex,,TW18 4UP,Tel: 01784 493 355, - ,,,No ratings yet Rate it yourself - /Services/opticians/LeaveReview/DefaultView.aspx?id=OP_5L6_10293__000001_TW184DS,0,0,
VISION EXPRESS ,I8V0C,OPT,Unit 5,Elmsleigh  Centre,,Staines,Surrey,TW18 4QB,Tel: 01784 469 109, - ,,,No ratings yet Rate it yourself - /Services/opticians/LeaveReview/DefaultView.aspx?id=I8V0C,0,0,
Bayfields Opticians and Audiologists (Staines),I9X7K,OPT,,Unit 3,The Elmsleigh Centre,Staines,Surrey,TW18 4QB,Tel: 0178 444 9992, - ,,,No ratings yet Rate it yourself - /Services/opticians/LeaveReview/DefaultView.aspx?id=I9X7K,0,0,
Scrivens Opticians,OP_5G5_11089__000001_SL85SY,OPT,,20-24 The Parade,,Bourne End,Buckinghamshire,SL8 5SY,Tel: 01628 525999, - ,,,No ratings yet Rate it yourself - /Services/opticians/LeaveReview/DefaultView.aspx?id=OP_5G5_11089__000001_SL85SY,0,0,
S H Harrold Ltd,OP_5AT_8917__000001_UB77LR,OPT,69 Station Road,West Drayton,Middlesex,,,UB7 7LR,Tel: 01895 442140, - ,,,No ratings yet Rate it yourself - /Services/opticians/LeaveReview/DefaultView.aspx?id=OP_5AT_8917__000001_UB77LR,0,0,
Mansons Eyecare,OP_5AT_10107__000001_UB77BE,OPT,166 High Street,Yiewsley,West Drayton,Middlesex,,UB7 7BE,Tel: 01895 435411, - ,,,2 ratings Rate it yourself - /Services/opticians/LeaveReview/DefaultView.aspx?id=OP_5AT_10107__000001_UB77BE,,,
West Drayton Specsavers,CO-5537,OPT,,40 High Street,,West Drayton,,UB7 7DW,Tel: 01895 446 531, - ,,,4 ratings Rate it yourself - /Services/opticians/LeaveReview/DefaultView.aspx?id=CO-5537,,,
Tesco Opticians,OPT_TW197PZ_1,OPT,,Town Lane,,"Stanwell, Staines",Surrey,TW19 7PZ,Tel: 0345 677 9018, - ,,,No ratings yet Rate it yourself - /Services/opticians/LeaveReview/DefaultView.aspx?id=OPT_TW197PZ_1,0,0,
Boots-Marlow,OP_5G5_10586__000003_SL71AB,OPT,93 High Street,,,Marlow,Buckinghamshire,SL7 1AB,Tel: 01628 483 052, - ,,,No ratings yet Rate it yourself - /Services/opticians/LeaveReview/DefaultView.aspx?id=OP_5G5_10586__000003_SL71AB,0,0,
Leightons Insight,OP_5G5_14309__000002_SL71AB,OPT,,73 High Street,,Marlow,Buckinghamshire,SL7 1AE,Tel: 01628 477998, - ,,,No ratings yet Rate it yourself - /Services/opticians/LeaveReview/DefaultView.aspx?id=OP_5G5_14309__000002_SL71AB,0,0,
David Clulow Marlow,OP_SL71AW_46730,OPT,42 High Street,,,Marlow,Buckinghamshire,SL7 1AW,Tel: 01628 484544, - ,,,1 rating Rate it yourself - /Services/opticians/LeaveReview/DefaultView.aspx?id=OP_SL71AW_46730,,,
Optical Express,OP_5AT_3746__000001_UB81AQ,OPT,Market House,29 High Street,Uxbridge,,,UB8 1AQ,Tel: 01895 253 779, - ,,,No ratings yet Rate it yourself - /Services/opticians/LeaveReview/DefaultView.aspx?id=OP_5AT_3746__000001_UB81AQ,0,0,
Stewart-Robinson Opticians,OP_5G5_11132__000001_SL72LS,OPT,49 West Street,49 West Street,,Marlow,Buckinghamshire,SL7 2LS,Tel: 01628 482906, - ,,,No ratings yet Rate it yourself - /Services/opticians/LeaveReview/DefaultView.aspx?id=OP_5G5_11132__000001_SL72LS,0,0,
Specsavers Opticians,TP9GH,OPT,,15-17 West Street,,Marlow,Buckinghamshire,SL7 2LS,Tel: 01628 957610, - ,,,No ratings yet Rate it yourself - /Services/opticians/LeaveReview/DefaultView.aspx?id=TP9GH,0,0,
Thomas H. Collison Ltd,OP_5L6_10052__000002_TW152UP,OPT,,17-19 Station Road,,Ashford,Middlesex,TW15 2UP,Tel: 01784 258 432, - ,,,No ratings yet Rate it yourself - /Services/opticians/LeaveReview/DefaultView.aspx?id=OP_5L6_10052__000002_TW152UP,0,0,
Mills Optometrists,OP_5AT_2743__000001_UB81AB,OPT,16 Windsor Street,Uxbridge,Middlesex,,,UB8 1AB,Tel: 01895 231694, - ,,,1 rating Rate it yourself - /Services/opticians/LeaveReview/DefaultView.aspx?id=OP_5AT_2743__000001_UB81AB,,,
Vision Express (UK) Ltd,OP_5AT_6652__000001_UB81LN,OPT,58 High Street,Uxbridge,Middlesex,,,UB8 1LN,Tel: 01895 231261, - ,,,No ratings yet Rate it yourself - /Services/opticians/LeaveReview/DefaultView.aspx?id=OP_5AT_6652__000001_UB81LN,0,0,
Village Eye Clinic,TP8GH,OPT,,33 High Street,,Bagshot,Surrey,GU19 5AF,Tel: 01276 785123, - ,,,No ratings yet Rate it yourself - /Services/opticians/LeaveReview/DefaultView.aspx?id=TP8GH,0,0,
Boots-Uxbridge - Market Sq,OP_5AT_6660__000001_UB81LH,OPT,30 Market Square,,,Uxbridge,Middlesex,UB8 1LH,Tel: 01895 254 885, - ,,,1 rating Rate it yourself - /Services/opticians/LeaveReview/DefaultView.aspx?id=OP_5AT_6660__000001_UB81LH,,,
Chilton Watson Ltd,OP_5G4_1559__000001_SL98ES,OPT,3 Station Road,,,Gerrards Cross,Buckinghamshire,SL9 8ES,Tel: 01753 886306, - ,,,No ratings yet Rate it yourself - /Services/opticians/LeaveReview/DefaultView.aspx?id=OP_5G4_1559__000001_SL98ES,0,0,
Specsavers Opticians,TP9A1,OPT,,46/48 Packhorse Road,,Gerrards Cross,Buckinghamshire,SL9 8EF,Tel: 01753 278030, - ,,,No ratings yet Rate it yourself - /Services/opticians/LeaveReview/DefaultView.aspx?id=TP9A1,0,0,
Boots-Gerrards Cross,OLCO27635G4__000002_SL98EF,OPT,52 Packhorse Road,,,Gerrards Cross,Buckinghamshire,SL9 8EF,Tel: 01753 279763, - ,,,No ratings yet Rate it yourself - /Services/opticians/LeaveReview/DefaultView.aspx?id=OLCO27635G4__000002_SL98EF,0,0,
Specsavers Opticians,OP_5AT_1913__000002_UB81LN,OPT,,56 High Street,Uxbridge,Middlesex,,UB8 1JP,Tel: 01895 256010, - ,,,No ratings yet Rate it yourself - /Services/opticians/LeaveReview/DefaultView.aspx?id=OP_5AT_1913__000002_UB81LN,0,0,
Opticial Express,OP_12345_UB8 1JN,OPT,The Market House,High St,,Uxbridge,Middlesex,UB8 1JN,Tel: 0800 023 2020, - ,,,No ratings yet Rate it yourself - /Services/opticians/LeaveReview/DefaultView.aspx?id=OP_12345_UB8 1JN,0,0,
C R Turner,OP_5AT_9290__000002_UB81JN,OPT,11 High Street,Uxbridge,Middlesex,,,UB8 1JN,Tel: 01895 259110, - ,,,No ratings yet Rate it yourself - /Services/opticians/LeaveReview/DefaultView.aspx?id=OP_5AT_9290__000002_UB81JN,0,0,
S H Harrold (1937) Ltd,OP_5AT_8013__000001_UB81JX,OPT,130-131 High Street,Uxbridge,Middlesex,,,UB8 1JX,Tel: 01895 234017, - ,,,No ratings yet Rate it yourself - /Services/opticians/LeaveReview/DefaultView.aspx?id=OP_5AT_8013__000001_UB81JX,0,0,
Boots-Uxbridge   - Chimes Centre,OP_5AT_14006__000002_UB81GA,OPT,Unit 3,The Chimes Shopping Centre,,Uxbridge,,UB8 1GA,Tel: 01895 814557, - ,,,1 rating Rate it yourself - /Services/opticians/LeaveReview/DefaultView.aspx?id=OP_5AT_14006__000002_UB81GA,,,
Norman Prince Opticians,V9S9S,OPT,Norman Prince Opticians,15 Church Parade,,Ashford,,TW15 2TX,Tel: 01784 252106, - ,,,1 rating Rate it yourself - /Services/opticians/LeaveReview/DefaultView.aspx?id=V9S9S,,,
Ashton Opticians,OL124685G5__000001_HP109LS,OPT,1 Acorn House,12-16 Straight Bit,Flackwell Heath,High Wycombe,Buckinghamshire,HP10 9LS,Tel: 01628 530420, - ,,,1 rating Rate it yourself - /Services/opticians/LeaveReview/DefaultView.aspx?id=OL124685G5__000001_HP109LS,,,
T H Collison Ltd,OP_5L6_2450__000003_KT169AL,OPT,,133 Guildford Street,,Chertsey,Surrey,KT16 9AL,Tel: 01932 563 076, - ,,,1 rating Rate it yourself - /Services/opticians/LeaveReview/DefaultView.aspx?id=OP_5L6_2450__000003_KT169AL,,,
 Thomas H. Collison Ltd,OP_5L6_5042__000002_KT169AL,OPT,119c Guildford Street,,Chertsey,Chertsey,,KT16 9AL,Tel: 01932 571832, - ,,,No ratings yet Rate it yourself - /Services/opticians/LeaveReview/DefaultView.aspx?id=OP_5L6_5042__000002_KT169AL,0,0,
Michael Blackstone Optometrists,OP_5G4_13333__000001_HP91QQ,OPT,18 The Highway,Station Road,,Beaconsfield,Buckinghamshire,HP9 1QQ,Tel: 01494 673782, - ,,,No ratings yet Rate it yourself - /Services/opticians/LeaveReview/DefaultView.aspx?id=OP_5G4_13333__000001_HP91QQ,0,0,
Boots-Beaconsfield,OP_5G4_13334__000001_HP91HH,OPT,25 Gregories Road,,,Beaconsfield,Buckinghamshire,HP9 1HH,Tel: 01494 673627, - ,,,No ratings yet Rate it yourself - /Services/opticians/LeaveReview/DefaultView.aspx?id=OP_5G4_13334__000001_HP91HH,0,0,
S H Harrold (1937) Ltd,OP_5G4_3077__000001_HP91HQ,OPT,26 Gregories Road,,Beaconsfield,,,HP9 1HQ,Tel: 01494 672193, - ,,,No ratings yet Rate it yourself - /Services/opticians/LeaveReview/DefaultView.aspx?id=OP_5G4_3077__000001_HP91HQ,0,0,
Leightons Opticians & Hearing Care,OP_RG401XJ_85767,OPT,,15 Peach Street,,Wokingham,Berkshire,RG40 1XJ,Tel: 0118 9786 744, - ,,,No ratings yet Rate it yourself - /Services/opticians/LeaveReview/DefaultView.aspx?id=OP_RG401XJ_85767,0,0,
Kaleyes Opticians,OP_5AT_8491__000001_UB100LR,OPT,7 Marlborough Parade,Uxbridge Road,Hillingdon,Middlesex,,UB10 0LR,Tel: 01895 232113, - ,,,No ratings yet Rate it yourself - /Services/opticians/LeaveReview/DefaultView.aspx?id=OP_5AT_8491__000001_UB100LR,0,0,
Vision Express (UK) Ltd,OP_5DN_10002__000002_RG401XZ,OPT,4 Old Row Court,Rose Street,Wokingham,Berkshire,,RG40 1XZ,Tel: 0118 978 0937, - ,,,No ratings yet Rate it yourself - /Services/opticians/LeaveReview/DefaultView.aspx?id=OP_5DN_10002__000002_RG401XZ,0,0,
Boots-Wokingham,OP_5DN_11548__000001_RG401XS,OPT,41 Market Place,,Wokingham,Wokingham,Berkshire,RG40 1AT,Tel: 01189796392, - ,,,No ratings yet Rate it yourself - /Services/opticians/LeaveReview/DefaultView.aspx?id=OP_5DN_11548__000001_RG401XS,0,0,
the eye people,OP_5DN_5493__000002_RG401XJ,OPT,,the eye people,22 Market Place,Wokingham,Berkshire,RG40 1AP,Tel: 0118 978 9311, - ,,,No ratings yet Rate it yourself - /Services/opticians/LeaveReview/DefaultView.aspx?id=OP_5DN_5493__000002_RG401XJ,0,0,
Vision Express (UK) Ltd,OP_5DN_1223__000001_RG109DN,OPT,7 Church Street,Twyford,Reading,Berkshire,,RG10 9DN,Tel: 0118 934 5566, - ,,,No ratings yet Rate it yourself - /Services/opticians/LeaveReview/DefaultView.aspx?id=OP_5DN_1223__000001_RG109DN,0,0,
Specsavers Opticians,OP_RG401AL_85779,OPT,,18 Market Place,,Wokingham,Berkshire,RG40 1AL,Tel: 0118 978 3525, - ,,,No ratings yet Rate it yourself - /Services/opticians/LeaveReview/DefaultView.aspx?id=OP_RG401AL_85779,0,0,
Denham Opticians,OLCO34465QD__000001_UB95HB,OPT,4 The Broadway East,North Orbital Road,Denham Green,Buckinghamshire,,UB9 5HB,Tel: 01895 832122, - ,,,No ratings yet Rate it yourself - /Services/opticians/LeaveReview/DefaultView.aspx?id=OLCO34465QD__000001_UB95HB,0,0,
Chobham Eye Clinic,Y8Z7R,OPT,,24 High Street,,Chobham,,GU24 8AA,Tel: 01276 932884, - ,,,3 ratings Rate it yourself - /Services/opticians/LeaveReview/DefaultView.aspx?id=Y8Z7R,,,
Olivers Opticians Ltd,OP_5G4_2237__000001_SL99EA,OPT,2 Market Place,,,Chalfont St Peter,Buckinghamshire,SL9 9EA,Tel: 01753 890822, - ,,,No ratings yet Rate it yourself - /Services/opticians/LeaveReview/DefaultView.aspx?id=OP_5G4_2237__000001_SL99EA,0,0,
Heaton Caffin Optometrists,OP_SL99QQ_46731,OPT,33 St Peter's Court,,,Chalfont St Peter,Buckinghamshire,SL9 9QQ,Tel: 01753 886806, - ,,,No ratings yet Rate it yourself - /Services/opticians/LeaveReview/DefaultView.aspx?id=OP_SL99QQ_46731,0,0,
Asda Opticians,OPT_UB3 4AZ,OPT,,Unit 3 Westlands Estate,,"Hayes, Middlesex",,UB3 4AZ,Tel: 0203 7701908, - ,,,No ratings yet Rate it yourself - /Services/opticians/LeaveReview/DefaultView.aspx?id=OPT_UB3 4AZ,0,0,
Bailey Opticians,OP_5HY_5005__000002_TW148BN,OPT,503 Staines Road,Bedfont,Middlesex,,,TW14 8BN,Tel: 020 8890 4918, - ,,,No ratings yet Rate it yourself - /Services/opticians/LeaveReview/DefaultView.aspx?id=OP_5HY_5005__000002_TW148BN,0,0,
Eyewise Opticians,OP_5AT_10924__000003_UB109PG,OPT,374 Long Lane,Hillingdon,Uxbridge,,,UB10 9PG,Tel: 01895 234563, - ,,,No ratings yet Rate it yourself - /Services/opticians/LeaveReview/DefaultView.aspx?id=OP_5AT_10924__000003_UB109PG,0,0,
S H Harrold (1937) Ltd,OP_5AT_3078__000003_UB34DD,OPT,48 Station Road,Hayes,Middlesex,,,UB3 4DD,Tel: 0208 573 4400, - ,,,1 rating Rate it yourself - /Services/opticians/LeaveReview/DefaultView.aspx?id=OP_5AT_3078__000003_UB34DD,,,
Specsavers Opticians,OP 5AT 6653__000001_UB32AB,OPT,"Unit 01, 5-19 Botwell Lane",,Hayes,Middlesex,,UB3 2AB,Tel: 0208 756 4980, - ,,,No ratings yet Rate it yourself - /Services/opticians/LeaveReview/DefaultView.aspx?id=OP 5AT 6653__000001_UB32AB,0,0,
Boots Opticians,31/08/20171140,OPT,,49 Station Road,,Middlesex,,UB3 4BE,, - ,,,No ratings yet Rate it yourself - /Services/opticians/LeaveReview/DefaultView.aspx?id=31/08/20171140,0,0,
Crockford Mills,OP_5AT_2104__000001_UB32HW,OPT,9 East Avenue,,Hayes,,,UB3 2HW,Tel: 0208 573 0822, - ,,,2 ratings Rate it yourself - /Services/opticians/LeaveReview/DefaultView.aspx?id=OP_5AT_2104__000001_UB32HW,,,
Norman Prince Crowthorne Opticians,J7N9X,OPT,,85 Church Street,,Crowthorne,Berkshire,RG45 7AW,Tel: 01344 772062, - ,,,No ratings yet Rate it yourself - /Services/opticians/LeaveReview/DefaultView.aspx?id=J7N9X,0,0,
Cranford Opticians,OP_5HY_13896__000002_TW59TY,OPT,742 Bath Road,Cranford,,Hounslow,Middlesex,TW5 9TY,Tel: 020 8759 9395, - ,,,27 ratings Rate it yourself - /Services/opticians/LeaveReview/DefaultView.aspx?id=OP_5HY_13896__000002_TW59TY,,,Data not available
Leightons Opticians & Hearing Care,OP_5L6_11775__000002_KT152AF,OPT,,76 Station Road,,Addlestone,Surrey,KT15 2AF,Tel: 01932 853 199, - ,,,No ratings yet Rate it yourself - /Services/opticians/LeaveReview/DefaultView.aspx?id=OP_5L6_11775__000002_KT152AF,0,0,
Tesco Opticians ,KT152AS060716,OPT,,117 Station Road,,Addlestone,Surrey,KT15 2AS,Tel: 0345 601 3479, - ,,,No ratings yet Rate it yourself - /Services/opticians/LeaveReview/DefaultView.aspx?id=KT152AS060716,0,0,
Boots Opticians,TP97E,OPT,,2 The Lane,,Addlestone,,KT15 2GN,, - ,,,1 rating Rate it yourself - /Services/opticians/LeaveReview/DefaultView.aspx?id=TP97E,,,
Addlestone Specsavers Limited,T4J9A,OPT,,84 Station Road,Addlestone,Surrey,,KT15 2AD,Tel: 01932505027, - ,,,No ratings yet Rate it yourself - /Services/opticians/LeaveReview/DefaultView.aspx?id=T4J9A,0,0,
Healthcall Optical Services,OP_GU470UR_46762,OPT,,108 Harvard Road,Owlsmoor,Sandhurst,Berkshire,GU47 0UR,Tel: 01962 609011, - ,,,No ratings yet Rate it yourself - /Services/opticians/LeaveReview/DefaultView.aspx?id=OP_GU470UR_46762,0,0,
Hayes Eye Clinic,OP_5AT_9391__000002_UB40RS,OPT,814a Uxbridge Road,,Middlesex,Hayes,,UB4 0RS,Tel: 020 8561 1625, - ,,,13 ratings Rate it yourself - /Services/opticians/LeaveReview/DefaultView.aspx?id=OP_5AT_9391__000002_UB40RS,,,
Feltham Eyecare Centre,TP4TN,OPT,,92 Bedfont Lane,Feltham,London,,TW14 9BP,Tel: 020 88670406, - ,,,No ratings yet Rate it yourself - /Services/opticians/LeaveReview/DefaultView.aspx?id=TP4TN,0,0,
Costco Wholesale UK Ltd,CO-1833-20,OPT,,Western International Park,Hayes Road,Hayes,,UB2 5XJ,Tel: 0208 571 8675, - ,,,No ratings yet Rate it yourself - /Services/opticians/LeaveReview/DefaultView.aspx?id=CO-1833-20,0,0,
McAteers Opticians,OP_5L6_14623__000001_TW179AW,OPT,6 The High Street,,Shepperton,,,TW17 9AW,Tel: 01932 230 303, - ,,,No ratings yet Rate it yourself - /Services/opticians/LeaveReview/DefaultView.aspx?id=OP_5L6_14623__000001_TW179AW,0,0,
Ian Squire Optician,OP_5L6_3873__000001_TW178AR,OPT,11 Station Approach,,Shepperton,,,TW17 8AR,Tel: 01932 226 789, - ,,,No ratings yet Rate it yourself - /Services/opticians/LeaveReview/DefaultView.aspx?id=OP_5L6_3873__000001_TW178AR,0,0,
AVK I-Care,D-13231,OPT,,15a Swakeleys Road,,Ickenham,,UB10 8DF,Tel: 01895347121, - ,,,No ratings yet Rate it yourself - /Services/opticians/LeaveReview/DefaultView.aspx?id=D-13231,0,0,
Ronald Brown Opticians,OP_5HY_12588__000002_TW134BU,OPT,14 Wilton Parade,High Street,,Feltham,Middlesex,TW13 4BU,Tel: 020 8890 6546, - ,,,No ratings yet Rate it yourself - /Services/opticians/LeaveReview/DefaultView.aspx?id=OP_5HY_12588__000002_TW134BU,0,0,