Organisation Name,NACS Code,Organisation Type,Address1,Address2,Address3,Address4,Address5,PostCode,Telephone Number,Opening time,Value  (Opening time),Banding Classification  (Opening time),NHS.UK users rating,Value  (NHS.UK users rating),Banding Classification  (NHS.UK users rating),Car parking (Is there car parking at this organisation?)
Christopher Young Optometrists,OP_5FX_2045__000001_BA45AS,OPT,46 High Street,Shepton Mallet,Somerset,,,BA4 5AS,Tel: 01749 345259, - ,,,1 rating Rate it yourself - /Services/opticians/LeaveReview/DefaultView.aspx?id=OP_5FX_2045__000001_BA45AS,,,
Eye Tech Opticians,OP_5FL_8611__000001_BA32HQ,OPT,6 The Island,Midsomer Norton,Bath,,,BA3 2HQ,Tel: 01761 414136, - ,,,No ratings yet Rate it yourself - /Services/opticians/LeaveReview/DefaultView.aspx?id=OP_5FL_8611__000001_BA32HQ,0,0,
Edwards Opticians Ltd,OP_5FL_14818__000001_BA32HW,OPT,2 Mansbrook House,15 High Street,,Midsomer Norton,,BA3 2HW,Tel: 01761 413212, - ,,,No ratings yet Rate it yourself - /Services/opticians/LeaveReview/DefaultView.aspx?id=OP_5FL_14818__000001_BA32HW,0,0,
Scrivens Opticians ,OP_5FL_575__000001_BA32DW,OPT,,26 High Street,Bath,Midsomer Norton,,BA3 2DW,Tel: 01761 414774, - ,,,No ratings yet Rate it yourself - /Services/opticians/LeaveReview/DefaultView.aspx?id=OP_5FL_575__000001_BA32DW,0,0,
Lovat Short Optometrists,OP_5FL_14817__000002_BA33PL,OPT,2 The Street,Radstock,,Bath,,BA3 3PL,Tel: 01761 432169, - ,,,No ratings yet Rate it yourself - /Services/opticians/LeaveReview/DefaultView.aspx?id=OP_5FL_14817__000002_BA33PL,0,0,
Eye-Tech Opticians,OP_5FX_13589__000001_BA111AH,OPT,25 Market Place,Frome,,Somerset,,BA11 1AH,Tel: 01373 462573, - ,,,No ratings yet Rate it yourself - /Services/opticians/LeaveReview/DefaultView.aspx?id=OP_5FX_13589__000001_BA111AH,0,0,
Boots-Frome,OP_5FX_12891__000001_BA111BN,OPT,3 Cheap Street,,,Frome,Somerset,BA11 1BN,Tel: 01373 462031, - ,,,No ratings yet Rate it yourself - /Services/opticians/LeaveReview/DefaultView.aspx?id=OP_5FX_12891__000001_BA111BN,0,0,
Specsavers Opticians,OP_5FX_7746__000002_BA111BS,OPT,19 Westway Centre,Frome,,Somerset,,BA11 1BS,Tel: 01373 451180, - ,,,No ratings yet Rate it yourself - /Services/opticians/LeaveReview/DefaultView.aspx?id=OP_5FX_7746__000002_BA111BS,0,0,
O'toid Opticians,01-19886,OPT,,5 The Bridge,,Frome,,BA11 1AR,Tel: 01373 467467, - ,,,No ratings yet Rate it yourself - /Services/opticians/LeaveReview/DefaultView.aspx?id=01-19886,0,0,
Robert Frith Optometrists,OP_5K1_1670__000002_BA77BG,OPT,Fore Street,Castle Cary,Somerset,Somerset,,BA7 7BG,Tel: 01963 351948, - ,,,No ratings yet Rate it yourself - /Services/opticians/LeaveReview/DefaultView.aspx?id=OP_5K1_1670__000002_BA77BG,0,0,
Vision Express (UK) Ltd,OPL 1405QL__000001_BA52AE,OPT,43 High Street,,,Wells,,BA5 2AE,Tel: 01749 674111, - ,,,No ratings yet Rate it yourself - /Services/opticians/LeaveReview/DefaultView.aspx?id=OPL 1405QL__000001_BA52AE,0,0,
Specsavers,OP_5FX_9046__000001_BA52SN,OPT,60a High Street,Wells,Somerset,,,BA5 2SN,Tel: 01749 673 694, - ,,,1 rating Rate it yourself - /Services/opticians/LeaveReview/DefaultView.aspx?id=OP_5FX_9046__000001_BA52SN,,,
R A Mansfield Opticians,OP_5FX_4104__000001_BA52AG,OPT,65 High Street,Wells,Somerset,,,BA5 2AG,Tel: 01749 672229, - ,,,No ratings yet Rate it yourself - /Services/opticians/LeaveReview/DefaultView.aspx?id=OP_5FX_4104__000001_BA52AG,0,0,
David & Sandra Millican Opticians,OP_5FX_8575__000001_BA52AQ,OPT,75 High Street,Wells,Somerset,,,BA5 2AQ,Tel: 01749 673991, - ,,,No ratings yet Rate it yourself - /Services/opticians/LeaveReview/DefaultView.aspx?id=OP_5FX_8575__000001_BA52AQ,0,0,
Rogers Optical (trading as Boots Opticians),01-26179,OPT,,66 High Street,,Somerset,,BA5 2AJ,, - ,,,1 rating Rate it yourself - /Services/opticians/LeaveReview/DefaultView.aspx?id=01-26179,,,
Sarah Gibson Optometrist ,OP_5K1_6438__000001_BA99LP,OPT,Commerce House,Market Place,,Wincanton,Somerset,BA9 9LP,Tel: 01963 34333, - ,,,1 rating Rate it yourself - /Services/opticians/LeaveReview/DefaultView.aspx?id=OP_5K1_6438__000001_BA99LP,,,
L & M Wincanton Limited,OPT_BA99LA_1,OPT,,16 Market Place,,Wincanton,,BA9 9LA,, - ,,,No ratings yet Rate it yourself - /Services/opticians/LeaveReview/DefaultView.aspx?id=OPT_BA99LA_1,0,0,
L & M Wincanton Limited,OPT_BA99LA_2,OPT,,16 Market Place,,Wincanton,,BA9 9LA,, - ,,,No ratings yet Rate it yourself - /Services/opticians/LeaveReview/DefaultView.aspx?id=OPT_BA99LA_2,0,0,
Brock & Houlford,TP7M0,OPT,Westway Farm,Wick Road,Bishop Sutton,Bristol,,BS39 5XP,Tel: 01275 332882, - ,,,No ratings yet Rate it yourself - /Services/opticians/LeaveReview/DefaultView.aspx?id=TP7M0,0,0,
Robert Frith Optometrists ,OP_5FX_6962__000002_BA69DZ,OPT,74 High Street,Glastonbury,Somerset,,,BA6 9DZ,Tel: 01458 832212, - ,,,No ratings yet Rate it yourself - /Services/opticians/LeaveReview/DefaultView.aspx?id=OP_5FX_6962__000002_BA69DZ,0,0,
Batemans (Opticians) Ltd,OP_5DH_82__000001_BA129AY,OPT,21 Market Place,,,Warminster,Wiltshire,BA12 9AY,Tel: 01985 213347, - ,,,No ratings yet Rate it yourself - /Services/opticians/LeaveReview/DefaultView.aspx?id=OP_5DH_82__000001_BA129AY,0,0,
Specsavers Opticians,OP_5DH_645__000005_BA129AY,OPT,Unit 2,1 Market Place,Warminster,Wiltshire,,BA12 9AY,Tel: 01985 219 016, - ,,,No ratings yet Rate it yourself - /Services/opticians/LeaveReview/DefaultView.aspx?id=OP_5DH_645__000005_BA129AY,0,0,
Eye Tech Opticians,OP_5FX_11123__000001_BA160EG,OPT,100 High Street,Street,,Somerset,,BA16 0EG,Tel: 01458 442178, - ,,,No ratings yet Rate it yourself - /Services/opticians/LeaveReview/DefaultView.aspx?id=OP_5FX_11123__000001_BA160EG,0,0,
Haine & Smith Opticians,OP_5DH_11016__000001_BA129AN,OPT,,10 Market Place,,Warminster,Wiltshire,BA12 9AN,Tel: 01985 212034, - ,,,No ratings yet Rate it yourself - /Services/opticians/LeaveReview/DefaultView.aspx?id=OP_5DH_11016__000001_BA129AN,0,0,
Boots Opticians Warminster,240417135350,OPT,,51 Market Place,,Warminster,,BA12 9AZ,, - ,,,No ratings yet Rate it yourself - /Services/opticians/LeaveReview/DefaultView.aspx?id=240417135350,0,0,
Specsavers Opticians,OP_5QL_999__000002_BA160EZ,OPT,93 High Street,,,Street,,BA16 0EZ,Tel: 01458 449400, - ,,,No ratings yet Rate it yourself - /Services/opticians/LeaveReview/DefaultView.aspx?id=OP_5QL_999__000002_BA160EZ,0,0,
Boots-Street,OP_5FX_14659__000001_BA160EX,OPT,141A High Street,,,Street,Somerset,BA16 0EX,Tel: 01458 442434, - ,,,No ratings yet Rate it yourself - /Services/opticians/LeaveReview/DefaultView.aspx?id=OP_5FX_14659__000001_BA160EX,0,0,
Bath Opticians,OP_5FL_4068__000002_BA23PN,OPT,Bath Opticians,57 Moorland Road,Oldfield Park,Bath,,BA2 3PJ,Tel: 01225 427353, - ,,,1 rating Rate it yourself - /Services/opticians/LeaveReview/DefaultView.aspx?id=OP_5FL_4068__000002_BA23PN,,,yes
Haine & Smith Opticians,OP_5DH_2366__000005_BA133BN,OPT,,19 High Street,,Westbury,Wiltshire,BA13 3BN,Tel: 01373 822163, - ,,,No ratings yet Rate it yourself - /Services/opticians/LeaveReview/DefaultView.aspx?id=OP_5DH_2366__000005_BA133BN,0,0,
Carter & Harding,OP_5DH_9220__000001_BA133DN,OPT,21 Maristow Street,,Westbury,,,BA13 3DN,Tel: 01373 822084, - ,,,No ratings yet Rate it yourself - /Services/opticians/LeaveReview/DefaultView.aspx?id=OP_5DH_9220__000001_BA133DN,0,0,
Brock & Houlford,OP_5FL_10314__000001_BS408PR,OPT,33 High Street,Chew Magna,Bristol,,,BS40 8PR,Tel: 01275 332882, - ,,,No ratings yet Rate it yourself - /Services/opticians/LeaveReview/DefaultView.aspx?id=OP_5FL_10314__000001_BS408PR,0,0,
Boots Opticians Ltd,OP_5FL_1146__000002_BA11TA,OPT,1 Marchants Passage,,Bath,,,BA1 1TA,Tel: 01225 465270, - ,,,No ratings yet Rate it yourself - /Services/opticians/LeaveReview/DefaultView.aspx?id=OP_5FL_1146__000002_BA11TA,0,0,
Boots-Bath - Southgate Centre,BA1 1AT_27361,OPT,,"Southgate Centre, 1 Newark Street",,Bath,Avon,BA1 1AT,Tel: 01225 464033, - ,,,2 ratings Rate it yourself - /Services/opticians/LeaveReview/DefaultView.aspx?id=BA1 1AT_27361,,,
Optical Express,BA1 1TG_12345,OPT,56 Southgate Street,,,Bath,Somerset,BA1 1TG,Tel: 0800 023 2020, - ,,,No ratings yet Rate it yourself - /Services/opticians/LeaveReview/DefaultView.aspx?id=BA1 1TG_12345,0,0,
Vision Express (UK) Ltd,OP_5FL_1966__000001_BA11TG,OPT,53 Southgate,,Bath,,,BA1 1TG,Tel: 01225 313422, - ,,,No ratings yet Rate it yourself - /Services/opticians/LeaveReview/DefaultView.aspx?id=OP_5FL_1966__000001_BA11TG,0,0,
Armstrong and North Opticians,OP_5FL_2841__000001_BA14BX,OPT,,13 Chelsea Road,Lower Weston,Bath,Avon,BA1 3DU,Tel: 01225 466110, - ,,,1 rating Rate it yourself - /Services/opticians/LeaveReview/DefaultView.aspx?id=OP_5FL_2841__000001_BA14BX,,,
M&S Opticians,K8J7A,OPT,M&S,16-18 Stall Street,,Bath,Somerset,BA1 1QB,Tel: 01225 437 733, - ,,,No ratings yet Rate it yourself - /Services/opticians/LeaveReview/DefaultView.aspx?id=K8J7A,0,0,
Kathryn Anthony Opticians,OP_5FL_5458__000001_BA11LA,OPT,16 Pierrepont Street,,Bath,,,BA1 1LA,Tel: 01225 464433, - ,,,No ratings yet Rate it yourself - /Services/opticians/LeaveReview/DefaultView.aspx?id=OP_5FL_5458__000001_BA11LA,0,0,
Specsavers Opticians,OP_5FL_8968__000001_BA11EQ,OPT,18 Westgate Street,,Bath,Avon,,BA1 1EQ,Tel: 01225 463 489, - ,,,No ratings yet Rate it yourself - /Services/opticians/LeaveReview/DefaultView.aspx?id=OP_5FL_8968__000001_BA11EQ,0,0,
Batemans Opticians,OP_5FL_4624__000001_BA11LY,OPT,6 Abbey Churchyard,,Bath,,,BA1 1LY,Tel: 01225 464365, - ,,,No ratings yet Rate it yourself - /Services/opticians/LeaveReview/DefaultView.aspx?id=OP_5FL_4624__000001_BA11LY,0,0,
Robert Frith Opticians Ltd,OP_5CD_13759__000001_SP84AA,OPT,Fairfield House,36 High Street,,GILLINGHAM,Dorset,SP8 4AA,Tel: 01747 825122, - ,,,1 rating Rate it yourself - /Services/opticians/LeaveReview/DefaultView.aspx?id=OP_5CD_13759__000001_SP84AA,,,
Brad Abrahams Optometry ,2008151055,OPT,,Brad Abrahams Optometry,2 Upper Borough Walls,Bath,,BA1 1RG,Tel: 01225 444321, - ,,,1 rating Rate it yourself - /Services/opticians/LeaveReview/DefaultView.aspx?id=2008151055,,,
Boots-Bath - Upper Borough Walls,OP_5FL_7015__000001_BA11RG,OPT,28 Upper Borough Walls,,,Bath,Avon,BA1 1RG,Tel: 01225 465 861, - ,,,No ratings yet Rate it yourself - /Services/opticians/LeaveReview/DefaultView.aspx?id=OP_5FL_7015__000001_BA11RG,0,0,
Ellis & Killpatrick,OP_5FL_7095__000001_BA11BA,OPT,18 New Bond Street,,,Bath,,BA1 1BA,Tel: 01225 466954, - ,,,No ratings yet Rate it yourself - /Services/opticians/LeaveReview/DefaultView.aspx?id=OP_5FL_7095__000001_BA11BA,0,0,
B A Vousden (Opticians) Ltd,OP_5FL_516__000001_BA15LJ,OPT,20 Milsom Place,Shires Yard,Bath,,,BA1 1BZ,Tel: 01225 464749, - ,,,No ratings yet Rate it yourself - /Services/opticians/LeaveReview/DefaultView.aspx?id=OP_5FL_516__000001_BA15LJ,0,0,
Department of Ophthalmology,OP_5FL_1469__000002_BA13NG,OPT,Royal United Hospital,Combe Park,Bath,,,BA1 3NG,Tel: 01225 824609, - ,,,No ratings yet Rate it yourself - /Services/opticians/LeaveReview/DefaultView.aspx?id=OP_5FL_1469__000002_BA13NG,0,0,
Royal United Hospital,OP_5FL_9076__000001_BA13NG,OPT,Eye Clinic,Combe Park,Bath,,,BA1 3NG,Tel: 01225 428331, - ,,,No ratings yet Rate it yourself - /Services/opticians/LeaveReview/DefaultView.aspx?id=OP_5FL_9076__000001_BA13NG,0,0,
Nixon & Shaw,OP_5DH_9177__000001_BA151LN,OPT,4 Church Street,,Bradford-on-Avon,,,BA15 1LN,Tel: 01225 863632, - ,,,No ratings yet Rate it yourself - /Services/opticians/LeaveReview/DefaultView.aspx?id=OP_5DH_9177__000001_BA151LN,0,0,
Carter & Harding,OP_5DH_4248__000001_BA151LL,OPT,9 The Shambles,,,Bradford-on-Avon,,BA15 1JS,Tel: 01225 865206, - ,,,No ratings yet Rate it yourself - /Services/opticians/LeaveReview/DefaultView.aspx?id=OP_5DH_4248__000001_BA151LL,0,0,
Haine & Smith Opticians,OP_5DH_2822__000004_BA148AT,OPT,,5a The Shires,,Trowbridge,Wiltshire,BA14 8AT,Tel: 01225 776871, - ,,,No ratings yet Rate it yourself - /Services/opticians/LeaveReview/DefaultView.aspx?id=OP_5DH_2822__000004_BA148AT,0,0,
Specsavers Opticians,OP_5DH_9973__000003_BA148AT,OPT,23 The Shires,Trowbridge,Wiltshire,,,BA14 8AT,Tel: 01225 775 434, - ,,,No ratings yet Rate it yourself - /Services/opticians/LeaveReview/DefaultView.aspx?id=OP_5DH_9973__000003_BA148AT,0,0,
Carter & Harding,OP_5DH_11493__000001_BA148HD,OPT,5a Fore Street,,Trowbridge,Wiltshire,,BA14 8HD,Tel: 01225 752143, - ,,,No ratings yet Rate it yourself - /Services/opticians/LeaveReview/DefaultView.aspx?id=OP_5DH_11493__000001_BA148HD,0,0,
Boots-Trowbridge,OP_5DH_36__000001_BA148EW,OPT,28-29 Fore Street,,,Trowbridge,Wiltshire,BA14 8EW,Tel: 01225 719055, - ,,,No ratings yet Rate it yourself - /Services/opticians/LeaveReview/DefaultView.aspx?id=OP_5DH_36__000001_BA148EW,0,0,
R D White Opticians,OP5DH__000003_BA148DE,OPT,38 Roundstone Street,,Trowbridge,Wiltshire,,BA14 8DE,Tel: 01225 753172, - ,,,No ratings yet Rate it yourself - /Services/opticians/LeaveReview/DefaultView.aspx?id=OP5DH__000003_BA148DE,0,0,
N K Opticians,CO - 3455__000002_BS273NA,OPT,Myrtle House,Bath Street,Cheddar,Somerset,,BS27 3AA,Tel: 01934 743723, - ,,,1 rating Rate it yourself - /Services/opticians/LeaveReview/DefaultView.aspx?id=CO - 3455__000002_BS273NA,,,
Specsavers Opticians,OP_5FL_8988__000001_BS311EG,OPT,12 Temple Street,Keynsham,Bristol,,,BS31 1EG,Tel: 0117 986 6226, - ,,,4 ratings Rate it yourself - /Services/opticians/LeaveReview/DefaultView.aspx?id=OP_5FL_8988__000001_BS311EG,,,
Brignall & Partners,OP_5FL_8625__000001_BS312UA,OPT,36 West View Road,Keynsham,Bristol,,,BS31 2UA,Tel: 0117 986 2147, - ,,,No ratings yet Rate it yourself - /Services/opticians/LeaveReview/DefaultView.aspx?id=OP_5FL_8625__000001_BS312UA,0,0,
Lee Opticians Limited,OP_5FL_14819__000002_BS311DS,OPT,41 High Street,Keynsham,Bristol,,,BS31 1DS,, - ,,,No ratings yet Rate it yourself - /Services/opticians/LeaveReview/DefaultView.aspx?id=OP_5FL_14819__000002_BS311DS,0,0,
Norville Opticians,OP_5FL_39__000001_BS311EB,OPT,69 High Street,Keynsham,,Bristol,Avon,BS31 1DS,Tel: 0117 9865066, - ,,,No ratings yet Rate it yourself - /Services/opticians/LeaveReview/DefaultView.aspx?id=OP_5FL_39__000001_BS311EB,0,0,
Simon Goldsmith,OP_5JG_9484__000002_BS148PG,OPT,70 Hollway Road,Stockwood,Bristol,,,BS14 8PG,Tel: 01275 838532, - ,,,No ratings yet Rate it yourself - /Services/opticians/LeaveReview/DefaultView.aspx?id=OP_5JG_9484__000002_BS148PG,0,0,
Boots-Keynsham,OP_5FL_1599__000001_BS311DP,OPT,17 High Street,,,Keynsham,Avon,BS31 1DP,Tel: 0117 986 2278 (ext. 2), - ,,,1 rating Rate it yourself - /Services/opticians/LeaveReview/DefaultView.aspx?id=OP_5FL_1599__000001_BS311DP,,,
Dury & Shaw Ltd,OP_5JG_9432__000002_BS140SX,OPT,5 Asda Centre,Oatlands Avenue,Bristol,,,BS14 0SX,Tel: 01275 839331, - ,,,No ratings yet Rate it yourself - /Services/opticians/LeaveReview/DefaultView.aspx?id=OP_5JG_9432__000002_BS140SX,0,0,
Grace Haine Eyecare Ltd,OP_DT102LZ_34883,OPT,,1 Skye House,Ring Street,STALBRIDGE,Dorset,DT10 2LZ,Tel: 01963 362775, - ,,,No ratings yet Rate it yourself - /Services/opticians/LeaveReview/DefaultView.aspx?id=OP_DT102LZ_34883,0,0,yes
Sight Centres,OP_5JG_5944__000001_BS42RA,OPT,17 Broad Walk,,Bristol,,,BS4 2RA,Tel: 0117 977 2579, - ,,,No ratings yet Rate it yourself - /Services/opticians/LeaveReview/DefaultView.aspx?id=OP_5JG_5944__000001_BS42RA,0,0,
Scrivens Ltd,OP_5CD_7192__000001_DT93BJ,OPT,44 Cheap Street,,,Sherbourne,Dorset,DT9 3PX,Tel: 01935 812971, - ,,,No ratings yet Rate it yourself - /Services/opticians/LeaveReview/DefaultView.aspx?id=OP_5CD_7192__000001_DT93BJ,0,0,
Vision Express UK Ltd,OP_5CD_2784__000001_DT93AX,OPT,57 Cheap Street,,Sherborne,,,DT9 3AX,Tel: 01935 812105, - ,,,No ratings yet Rate it yourself - /Services/opticians/LeaveReview/DefaultView.aspx?id=OP_5CD_2784__000001_DT93AX,0,0,
Marian Donovan Optometrist,OP_5M8_14820__000001_BS405LD,OPT,Broad Street,,Wrington,North Somerset,,BS40 5LD,Tel: 01934 862933, - ,,,No ratings yet Rate it yourself - /Services/opticians/LeaveReview/DefaultView.aspx?id=OP_5M8_14820__000001_BS405LD,0,0,yes
C M Lea (Opticians) Ltd,OP_5JG_4375__000001_BS43PF,OPT,38 Sandy Park Road,Brislington,Bristol,,,BS4 3PF,Tel: 0117 9776202, - ,,,No ratings yet Rate it yourself - /Services/opticians/LeaveReview/DefaultView.aspx?id=OP_5JG_4375__000001_BS43PF,0,0,
Matthews Opticians - Sherborne,OP_5CD_2683__000001_DT93NL,OPT,1 Tilton Court,Digby Road,,SHERBORNE,Dorset,DT9 3NL,Tel: 01935 813355, - ,,,No ratings yet Rate it yourself - /Services/opticians/LeaveReview/DefaultView.aspx?id=OP_5CD_2683__000001_DT93NL,0,0,
Lynne Fernandes Optometrists,OP_5JG_6422__000002_BS42AL,OPT,182a Wells Road,Knowle,,Bristol,,BS4 2AL,Tel: 0117 977 6330, - ,,,2 ratings Rate it yourself - /Services/opticians/LeaveReview/DefaultView.aspx?id=OP_5JG_6422__000002_BS42AL,,,
Goldsmith & Harvey Opticians,OP_5A3_8324__000002_BS307DY,OPT,Asda Store,Craven Way,Longwell Green,Bristol,,BS30 7DY,Tel: 0117 9605809, - ,,,3 ratings Rate it yourself - /Services/opticians/LeaveReview/DefaultView.aspx?id=OP_5A3_8324__000002_BS307DY,,,
Robert Frith Opticians (Wessex) Ltd,OP_5CD_12558__000001_SP78AR,OPT,Wesley House,12 Bell Street,,SHAFTESBURY,Dorset,SP7 8AR,Tel: 01747 854761, - ,,,No ratings yet Rate it yourself - /Services/opticians/LeaveReview/DefaultView.aspx?id=OP_5CD_12558__000001_SP78AR,0,0,
Home Care Community Opticians (J2NA Ltd),00281__000002_DT93RQ,OPT,Old Yarn Business Centre,Westbury,Sherborne,Dorset,,DT9 3RQ,Tel: 01935 813800, - ,,,No ratings yet Rate it yourself - /Services/opticians/LeaveReview/DefaultView.aspx?id=00281__000002_DT93RQ,0,0,
Four Eyes Dispensing Optician,TP0MT,OPT,,63 High Street,Hanham,Bristol,,BS15 3DG,Tel: 0117 9611100, - ,,,No ratings yet Rate it yourself - /Services/opticians/LeaveReview/DefaultView.aspx?id=TP0MT,0,0,
S H Harrold (1937) Ltd,CO-2389__000001_SP78JE,OPT,,49 High Street,,SHAFTESBURY,Dorset,SP7 8JE,Tel: 01747 853553, - ,,,1 rating Rate it yourself - /Services/opticians/LeaveReview/DefaultView.aspx?id=CO-2389__000001_SP78JE,,,
EyeStyle Centre Opticians Ltd,OP_5CD_50__000001_SP78AA,OPT,56 High Street,,Shaftesbury,Shaftesbury,,SP7 8AA,Tel: 01747 851006, - ,,,No ratings yet Rate it yourself - /Services/opticians/LeaveReview/DefaultView.aspx?id=OP_5CD_50__000001_SP78AA,0,0,
Orriss & Low,OP_5M8_6588__000001_BS251AQ,OPT,2-4 Corner House,Corner House,Woodborough Road,Winscombe,Somerset,BS25 1AQ,Tel: 01934 843713, - ,,,No ratings yet Rate it yourself - /Services/opticians/LeaveReview/DefaultView.aspx?id=OP_5M8_6588__000001_BS251AQ,0,0,yes
Scrivens,OP_5JG_10172__000002_BS34EY,OPT,100 East Street,Bedminster,,Bristol,Avon,BS3 4EY,Tel: 0117 963 7105, - ,,,No ratings yet Rate it yourself - /Services/opticians/LeaveReview/DefaultView.aspx?id=OP_5JG_10172__000002_BS34EY,0,0,
Vision Call (Bristol) Ltd,CO- 2321/5FL__000001_BS419LB,OPT,Yanley Court,Long Ashton Business Park,Long Ashton,North Somerset,,BS41 9LB,Tel: 01275 393 507, - ,,,No ratings yet Rate it yourself - /Services/opticians/LeaveReview/DefaultView.aspx?id=CO- 2321/5FL__000001_BS419LB,0,0,
Specsavers Opticians,OP_5JG_12494__000001_BS34HH,OPT,9 Imperial Parade,East Street,Bristol,,,BS3 4HH,Tel: 0117 966 4000, - ,,,No ratings yet Rate it yourself - /Services/opticians/LeaveReview/DefaultView.aspx?id=OP_5JG_12494__000001_BS34HH,0,0,
Specs Savers,OP_5JG_9205__000001_BS34JY,OPT,East Street,Bedminster,Bristol,,,BS3 4JY,Tel: 0117 9231839, - ,,,No ratings yet Rate it yourself - /Services/opticians/LeaveReview/DefaultView.aspx?id=OP_5JG_9205__000001_BS34JY,0,0,
David Phillips Opticians,OP_5JG_7618__000002_BS31JD,OPT,230 North Street,Bedminster,Bristol,,,BS3 1JD,Tel: 0117 963 5477, - ,,,No ratings yet Rate it yourself - /Services/opticians/LeaveReview/DefaultView.aspx?id=OP_5JG_7618__000002_BS31JD,0,0,
David Phillips Opticians,OP_5JG_11857__000001_BS31JJ,OPT,230 North Street,Bedminister,Bristol,,,BS3 1JB,Tel: 0117 966 3417, - ,,,1 rating Rate it yourself - /Services/opticians/LeaveReview/DefaultView.aspx?id=OP_5JG_11857__000001_BS31JJ,,,
Iris Eye Care Optometrists ,GOC CO-3924,OPT,,"Birdwell Clinic, 33 Weston Road",,"Birdwell Clinic, 33 Weston Road",,BS41 9AA,Tel: 01275 393149 (ext. 0789154552), - ,,,No ratings yet Rate it yourself - /Services/opticians/LeaveReview/DefaultView.aspx?id=GOC CO-3924,0,0,yes
Vision Express,OP_5A3_767__000001_BS158PH,OPT,,2-4 Hanham Road,Kingswood,Bristol,,BS15 8PH,Tel: 0117 967 4513, - ,,,No ratings yet Rate it yourself - /Services/opticians/LeaveReview/DefaultView.aspx?id=OP_5A3_767__000001_BS158PH,0,0,
Mike Cees Opticians,OP_BS154EJ_46948,OPT,Kingswood Health Centre,Alma Road,Kingswood,Bristol,,BS15 4EJ,Tel: 0117 3012091, - ,,,No ratings yet Rate it yourself - /Services/opticians/LeaveReview/DefaultView.aspx?id=OP_BS154EJ_46948,0,0,
Specsavers Opticians,OP_5A3_99__000003_BS158LP,OPT,20 Kings Chase Shopping Centre,Regent Street,Kingswood,,,BS15 8LP,Tel: 0117 947 8809, - ,,,No ratings yet Rate it yourself - /Services/opticians/LeaveReview/DefaultView.aspx?id=OP_5A3_99__000003_BS158LP,0,0,
Boots-Kingswood,OP_5A3_537__000001_BS158LQ,OPT,10-11 Kingschase Centre,Regent Street,Kingswood,Bristol,,BS15 8LP,Tel: 0117 960 8379, - ,,,2 ratings Rate it yourself - /Services/opticians/LeaveReview/DefaultView.aspx?id=OP_5A3_537__000001_BS158LQ,,,
MikeCees Opticians,OP_5JF_8838__000001_BS59HH,OPT,122 Church Road,Redfield,Bristol,Bristol,,BS5 9HH,Tel: 0117 9556253, - ,,,No ratings yet Rate it yourself - /Services/opticians/LeaveReview/DefaultView.aspx?id=OP_5JF_8838__000001_BS59HH,0,0,
M W Dunscombe Ltd,OP_5JG_12001__000001_BS14XH,OPT,7 St. Augustines Parade,,Bristol,,,BS1 4XH,Tel: 0117 927 2155, - ,,,No ratings yet Rate it yourself - /Services/opticians/LeaveReview/DefaultView.aspx?id=OP_5JG_12001__000001_BS14XH,0,0,
Bramley Pope,OP_5JG_14825__000001_BS11JX,OPT,35 St. Stephens Street,,Bristol,,,BS1 1JX,Tel: 0117 9300035, - ,,,No ratings yet Rate it yourself - /Services/opticians/LeaveReview/DefaultView.aspx?id=OP_5JG_14825__000001_BS11JX,0,0,
Healthcall Optical Services Ltd,OP_5JF_11771__000002_BS20BH,OPT,6-7 Hide Market,West Street,St. Philips,,,BS2 0BH,Tel: 0117 954 3700, - ,,,No ratings yet Rate it yourself - /Services/opticians/LeaveReview/DefaultView.aspx?id=OP_5JF_11771__000002_BS20BH,0,0,
Specsavers Opticians,OP_5JG_5923__000001_BS12DD,OPT,1 and 7 Union Street,,Bristol,,,BS1 2DD,Tel: 0117 927 2931, - ,,,2 ratings Rate it yourself - /Services/opticians/LeaveReview/DefaultView.aspx?id=OP_5JG_5923__000001_BS12DD,,,
David Clulow Opticians,OP_5JG_4665__000002_BS13XB,OPT,13 Broadmead Gallery,Broadmead,Bristol,,,BS1 3XB,Tel: 0117 925 4954, - ,,,No ratings yet Rate it yourself - /Services/opticians/LeaveReview/DefaultView.aspx?id=OP_5JG_4665__000002_BS13XB,0,0,
Everybody,OP_5JG_138__000002_BS13ED,OPT,2 Castle Gallery,Broadmead,Bristol,,,BS1 3XE,Tel: 0117 929 7677, - ,,,No ratings yet Rate it yourself - /Services/opticians/LeaveReview/DefaultView.aspx?id=OP_5JG_138__000002_BS13ED,0,0,
Robert Frith Optometrists Yeovil,OP_5K1_3238__000001_BA201EQ,OPT,Ryburn House,28 Princes Street,,Yeovil,Somerset,BA20 1EQ,Tel: 01935 474333, - ,,,2 ratings Rate it yourself - /Services/opticians/LeaveReview/DefaultView.aspx?id=OP_5K1_3238__000001_BA201EQ,,,
Specsavers Bristol City Centre,TP15R,OPT,,30-32 Merchant Street,,Bristol,,BS1 3EP,Tel: 0117 922 5288, - ,,,No ratings yet Rate it yourself - /Services/opticians/LeaveReview/DefaultView.aspx?id=TP15R,0,0,
Boots-Bristol - Broadmead (in Boots UK),OP_5JG_704__000003_BS13ED,OPT,59 Broadmead,,Bristol,Bristol,,BS1 3EA,Tel: 0117 927 2418, - ,,,No ratings yet Rate it yourself - /Services/opticians/LeaveReview/DefaultView.aspx?id=OP_5JG_704__000003_BS13ED,0,0,
Boots-Yeovil - Middle St,OP_5K1_2550__000003_BA201LG,OPT,,39-41 Middle Street,,Yeovil,Somerset,BA20 1LG,Tel: 01935 423 490, - ,,,No ratings yet Rate it yourself - /Services/opticians/LeaveReview/DefaultView.aspx?id=OP_5K1_2550__000003_BA201LG,0,0,