Organisation Name,NACS Code,Organisation Type,Address1,Address2,Address3,Address4,Address5,PostCode,Telephone Number,Opening time,Value  (Opening time),Banding Classification  (Opening time),NHS.UK users rating,Value  (NHS.UK users rating),Banding Classification  (NHS.UK users rating),Car parking (Is there car parking at this organisation?)
Troth Opticians,00000051__000003_B459JR,OPT,135 New Road,Rubery,Birmingham,,,B45 9JR,Tel: 0121 453 2146, - ,,,No ratings yet Rate it yourself - /Services/opticians/LeaveReview/DefaultView.aspx?id=00000051__000003_B459JR,0,0,
Williams Optometrists,OP_5MR_9056__000002_B459JW,OPT,161 New Road,Rubery,Birmingham,,,B45 9JW,Tel: 0121 453 2581, - ,,,No ratings yet Rate it yourself - /Services/opticians/LeaveReview/DefaultView.aspx?id=OP_5MR_9056__000002_B459JW,0,0,
Spex4U Limited,OL5PL01__000005_B459JA,OPT,174 New Road,Rubery,,Birmingham,Worcestershire,B45 9JA,Tel: 0121 453 7179, - ,,,1 rating Rate it yourself - /Services/opticians/LeaveReview/DefaultView.aspx?id=OL5PL01__000005_B459JA,,,
Myoptics Eye Clinic,I2T1M,OPT,,14 Curdale Road,Bartley Green,Birmingham,West Midlands,B32 4HB,Tel: 01214754920, - ,,,2 ratings Rate it yourself - /Services/opticians/LeaveReview/DefaultView.aspx?id=I2T1M,,,
Boots-Halesowen,OP_5HT_690__000001_B633AS,OPT,2 Hagley Street,Halesowen,,West Midlands,,B63 3AS,Tel: 0121 550 1610, - ,,,2 ratings Rate it yourself - /Services/opticians/LeaveReview/DefaultView.aspx?id=OP_5HT_690__000001_B633AS,,,
Eye Society Opticians,OP_5HT_3430__000002_B633AW,OPT,,4 Peckingham Street,,Halesowen,West Midlands,B63 3AW,Tel: 0121 585 5347, - ,,,1 rating Rate it yourself - /Services/opticians/LeaveReview/DefaultView.aspx?id=OP_5HT_3430__000002_B633AW,,,
Chapman & Myers Opticians,OP_5HT_437__000001_B634AB,OPT,14 Hagley Mall,The Cornbow Centre,,Halesowen,,B63 4AL,Tel: 0121 585 7065, - ,,,1 rating Rate it yourself - /Services/opticians/LeaveReview/DefaultView.aspx?id=OP_5HT_437__000001_B634AB,,,
Specsavers ,OP_5HT_14938__000002_B634AL,OPT,36 Hagley Mall,The Cornbow Centre,Halesowen,,,B63 4AL,Tel: 0121 504 4940, - ,,,No ratings yet Rate it yourself - /Services/opticians/LeaveReview/DefaultView.aspx?id=OP_5HT_14938__000002_B634AL,0,0,
Scrivens Ltd,OP_5HT_5770__000001_B634AL,OPT,5 Hagley Mall,The Cornbow Centre,,Halesowen,,B63 4AL,Tel: 0121 501 1010, - ,,,No ratings yet Rate it yourself - /Services/opticians/LeaveReview/DefaultView.aspx?id=OP_5HT_5770__000001_B634AL,0,0,
Specs Direct,5M147__000002_B312PA,OPT,871 Bristol Road South,Northfield,Birmingham,,,B31 2PA,Tel: 0121 477 7474, - ,,,No ratings yet Rate it yourself - /Services/opticians/LeaveReview/DefaultView.aspx?id=5M147__000002_B312PA,0,0,
Boots-Northfield,5M1089,OPT,816 Bristol Road South,,Northfield,Birmingham,,B31 2NS,Tel: 0121 475 1072, - ,,,No ratings yet Rate it yourself - /Services/opticians/LeaveReview/DefaultView.aspx?id=5M1089,0,0,
Eyewise ,OP_5M1_2922__000002_B312JU,OPT,892 Bristol Road South,Northfield,Birmingham,,,B31 2NS,Tel: 0121 477 6550, - ,,,No ratings yet Rate it yourself - /Services/opticians/LeaveReview/DefaultView.aspx?id=OP_5M1_2922__000002_B312JU,0,0,
Virdi & Pepall Ltd,5M1105,OPT,,826 Bristol Road South,Northfield,Birmingham,,B31 2NS,Tel: 0121 475 4342, - ,,,5 ratings Rate it yourself - /Services/opticians/LeaveReview/DefaultView.aspx?id=5M1105,,,
Hagley Eyecare Studio,201220160917,OPT,,Unit 42 The Old Woodyard,,Hagley,,DY9 9LQ,, - ,,,2 ratings Rate it yourself - /Services/opticians/LeaveReview/DefaultView.aspx?id=201220160917,,,
Scrivens Ltd,OP_5M1_6295__000001_B312NG,OPT,731 Bristol Road South,Northfield,,Birmingham,West Midlands,B31 2NG,Tel: 0121 475 1152, - ,,,No ratings yet Rate it yourself - /Services/opticians/LeaveReview/DefaultView.aspx?id=OP_5M1_6295__000001_B312NG,0,0,
Specsavers Opticians,OP_5M1_8153__000002_B312NN,OPT,,"Unit 3, 780-792 Bristol Road South",Northfield,Birmingham,,B31 2NN,Tel: 0121 476 4717, - ,,,No ratings yet Rate it yourself - /Services/opticians/LeaveReview/DefaultView.aspx?id=OP_5M1_8153__000002_B312NN,0,0,
Barnt Green Opticians,OP_5MR_7851__000001_B458NF,OPT,12 Hewell Road,Barnt Green,,Birmingham,,B45 8NE,Tel: 0121 445 6015, - ,,,No ratings yet Rate it yourself - /Services/opticians/LeaveReview/DefaultView.aspx?id=OP_5MR_7851__000001_B458NF,0,0,
Pabari Opticians Ltd,OP_5M1_4727__000002_B313JW,OPT,3 Alvechurch Road,West Heath,Birmingham,,,B31 3JW,Tel: 0121 477 5252, - ,,,No ratings yet Rate it yourself - /Services/opticians/LeaveReview/DefaultView.aspx?id=OP_5M1_4727__000002_B313JW,0,0,
Asda Opticians,OPT_B29 5UP,OPT,,BARNSHILL,"51, BARNES HILL",BIRMINGHAM,,B29 5UP,Tel: 0121 296 0659, - ,,,No ratings yet Rate it yourself - /Services/opticians/LeaveReview/DefaultView.aspx?id=OPT_B29 5UP,0,0,
Knights Ophthalmic Opticians,5M154__000001_B295QL,OPT,130 Castle Square,Weoley Castle,Birmingham,,,B29 5QL,Tel: 0121 411 1555, - ,,,1 rating Rate it yourself - /Services/opticians/LeaveReview/DefaultView.aspx?id=5M154__000001_B295QL,,,
Robinson & Sproson,OP_5DR_12006__000001_DY90NW,OPT,143 - 145 Worcester Road,Hagley,West Midlands,Hagley,,DY9 0NW,Tel: 01562 882444, - ,,,No ratings yet Rate it yourself - /Services/opticians/LeaveReview/DefaultView.aspx?id=OP_5DR_12006__000001_DY90NW,0,0,
Scrivens Ltd,OP_5M1_10750__000001_B295QG,OPT,167 Weoley Castle Road,Weoley Castle,,Birmingham,West Midlands,B29 5QH,Tel: 0121 427 1021, - ,,,No ratings yet Rate it yourself - /Services/opticians/LeaveReview/DefaultView.aspx?id=OP_5M1_10750__000001_B295QG,0,0,
C Cacoullis,OP_5HT_10204__000001_B629BB,OPT,68 Halesowen Road,Halesowen,West Midlands,,,B62 9BB,Tel: 0121 422 3356, - ,,,No ratings yet Rate it yourself - /Services/opticians/LeaveReview/DefaultView.aspx?id=OP_5HT_10204__000001_B629BB,0,0,
Dalvinder Singh Sidhu,5PG164,OPT,,29 Halesowen Road,Halesowen,West Midlands,,B62 9AB,Tel: 0121 454 6569, - ,,,No ratings yet Rate it yourself - /Services/opticians/LeaveReview/DefaultView.aspx?id=5PG164,0,0,
Eyecare Opticians Parkside,B61 0AZ,OPT,BHI Parkside Medical Centre,Stourbridge Road,,Bromsgrove,,B61 0AZ,Tel: 01527 888599, - ,,,No ratings yet Rate it yourself - /Services/opticians/LeaveReview/DefaultView.aspx?id=B61 0AZ,0,0,
Chapman Opticians,OP_5MR_8077__000002_B618AQ,OPT,103 High Street,,Bromsgrove,,,B61 8AE,Tel: 01527 836290, - ,,,1 rating Rate it yourself - /Services/opticians/LeaveReview/DefaultView.aspx?id=OP_5MR_8077__000002_B618AQ,,,
Specsavers Opticians,OP_5MR_12187__000001_B618DD,OPT,131 High Street,Bromsgrove,Worcestershire,,,B61 8AE,Tel: 01527 579 815, - ,,,2 ratings Rate it yourself - /Services/opticians/LeaveReview/DefaultView.aspx?id=OP_5MR_12187__000001_B618DD,,,
Boots-Bromsgrove,OP_5MR_276__000002_B618EX,OPT,64 High Street,Bromsgrove,,Worcestershire,Worcestershire,B61 8EX,Tel: 01527 872 583, - ,,,No ratings yet Rate it yourself - /Services/opticians/LeaveReview/DefaultView.aspx?id=OP_5MR_276__000002_B618EX,0,0,
Hamptons Optical Ltd.,00000052__000001_B618DJ,OPT,Crown House,11 Crown Close,Bromsgrove,Worcestershire,,B61 8DJ,, - ,,,No ratings yet Rate it yourself - /Services/opticians/LeaveReview/DefaultView.aspx?id=00000052__000001_B618DJ,0,0,
Robert Hill Opticians,OP_5HT_8972__000001_DY98LB,OPT,39 High Street,Lye,,Stourbridge,West Midlands,DY9 8LF,Tel: 01384 422270, - ,,,3 ratings Rate it yourself - /Services/opticians/LeaveReview/DefaultView.aspx?id=OP_5HT_8972__000001_DY98LB,,,
Sanjeev Singh Sanghera,5MX083,OPT,,39 High Street,Lye,Stourbridge,,DY9 8LF,Tel: 01384 422270, - ,,,No ratings yet Rate it yourself - /Services/opticians/LeaveReview/DefaultView.aspx?id=5MX083,0,0,
Scrivens Ltd,OP_5MG_5453__000001_B680DJ,OPT,496 Hagley Road West,Quinton,Oldbury,Smethwick,West Midlands,B68 0DJ,Tel: 0121 422 3007, - ,,,No ratings yet Rate it yourself - /Services/opticians/LeaveReview/DefaultView.aspx?id=OP_5MG_5453__000001_B680DJ,0,0,
Eye Society,OP_5MH_10164__000002_B645HH,OPT,33 High Street,,Cradley Heath,,,B64 5HL,Tel: 01384 633336, - ,,,No ratings yet Rate it yourself - /Services/opticians/LeaveReview/DefaultView.aspx?id=OP_5MH_10164__000002_B645HH,0,0,
Julian Hill Opticians,OP_5HT_4772__000002_DY81QU,OPT,108 Hagley Road,Oldswinford,Stourbridge,,,DY8 1QU,Tel: 01384 374 232, - ,,,1 rating Rate it yourself - /Services/opticians/LeaveReview/DefaultView.aspx?id=OP_5HT_4772__000002_DY81QU,,,
Arnold Opticians,OP_5MH_10243__000001_B645HG,OPT,17-18 High Street,,Cradley Heath,,,B64 5HG,Tel: 01384 561969, - ,,,No ratings yet Rate it yourself - /Services/opticians/LeaveReview/DefaultView.aspx?id=OP_5MH_10243__000001_B645HG,0,0,
R Meredith,OP_5MH_7811__000001_B645HP,OPT,6 High Street,,Cradley Heath,,,B64 5HP,Tel: 01384 566 770, - ,,,No ratings yet Rate it yourself - /Services/opticians/LeaveReview/DefaultView.aspx?id=OP_5MH_7811__000001_B645HP,0,0,
Eyeland,OP_5MH_13682__000001_B650DT,OPT,4 High Street,,Rowley Regis,,,B65 0DT,Tel: 0121 559 1054, - ,,,No ratings yet Rate it yourself - /Services/opticians/LeaveReview/DefaultView.aspx?id=OP_5MH_13682__000001_B650DT,0,0,
Rileys Opticians,OP_5MH_959__000002_B650DR,OPT,38-39 High Street,,,Rowley Regis,,B65 0DR,Tel: 0121 559 1314, - ,,,No ratings yet Rate it yourself - /Services/opticians/LeaveReview/DefaultView.aspx?id=OP_5MH_959__000002_B650DR,0,0,
Eyes & Vision,OP_5MH_13683__000001_B650HP,OPT,1 Market Place,High Street,Rowley Regis,,,B65 0HP,Tel: 0121 559 5552, - ,,,No ratings yet Rate it yourself - /Services/opticians/LeaveReview/DefaultView.aspx?id=OP_5MH_13683__000001_B650HP,0,0,
Scrivens Ltd,OP_5M1_7540__000001_B303EG,OPT,37 Pershore Road South,Cotteridge,,Birmingham,West Midlands,B30 3EG,Tel: 0121 458 3335, - ,,,No ratings yet Rate it yourself - /Services/opticians/LeaveReview/DefaultView.aspx?id=OP_5M1_7540__000001_B303EG,0,0,
J & D Mason Opticians,5M143__000001_B380SD,OPT,,2 The Green,Kings Norton,Birmingham,,B38 8SD,Tel: 0121 451 3485, - ,,,5 ratings Rate it yourself - /Services/opticians/LeaveReview/DefaultView.aspx?id=5M143__000001_B380SD,,,
JK Opticians,OP_5MG_8449__000001_B650JN,OPT,8 Oldbury Road,,Rowley Regis,Birmingham,,B65 0JN,Tel: 0121 559 6041, - ,,,No ratings yet Rate it yourself - /Services/opticians/LeaveReview/DefaultView.aspx?id=OP_5MG_8449__000001_B650JN,0,0,
Eyecare Mobile Opticians Ltd,5QW049,OPT,,16 Watford Road,Cotteridge,Birmingham,,B30 1JA,Tel: 0800 633 5092, - ,,,No ratings yet Rate it yourself - /Services/opticians/LeaveReview/DefaultView.aspx?id=5QW049,0,0,
J & D Mason Opticians ,OP_5PL_9067__000003_B487LA,OPT,23 The Square,"23 The Square,",Birmingham,Alvechurch,,B48 7LA,Tel: 0121 447 8682, - ,,,1 rating Rate it yourself - /Services/opticians/LeaveReview/DefaultView.aspx?id=OP_5PL_9067__000003_B487LA,,,
Eyeworld Optometrists,5MX053,OPT,,1863 Pershore Road,Cotteridge,Birmingham,,B30 3DJ,Tel: 0121 458 1359, - ,,,No ratings yet Rate it yourself - /Services/opticians/LeaveReview/DefaultView.aspx?id=5MX053,0,0,
D Wright,OP_5MH_3944__000001_B646HU,OPT,178 Halesowen Road,,Cradley Heath,,,B64 6HU,Tel: 01384 568622, - ,,,No ratings yet Rate it yourself - /Services/opticians/LeaveReview/DefaultView.aspx?id=OP_5MH_3944__000001_B646HU,0,0,
Docker & Wilson Ltd,OP_5HT_3049__000001_DY81ED,OPT,84 High Street,,Stourbridge,,,DY8 1ED,Tel: 01384 394300, - ,,,No ratings yet Rate it yourself - /Services/opticians/LeaveReview/DefaultView.aspx?id=OP_5HT_3049__000001_DY81ED,0,0,
Low Vision Centre,5PG173,OPT,,62 Woodville Road,Harborne,Birmingham,,B17 9AT,Tel: 0121 478 5252, - ,,,No ratings yet Rate it yourself - /Services/opticians/LeaveReview/DefaultView.aspx?id=5PG173,0,0,
Specsavers Opticians,OP_5HT_7393__000001_DY81DX,OPT,71 High Street,,Stourbridge,,,DY8 1DX,Tel: 01384 440464, - ,,,No ratings yet Rate it yourself - /Services/opticians/LeaveReview/DefaultView.aspx?id=OP_5HT_7393__000001_DY81DX,0,0,
Boots-Stourbridge,OP_5HT_6791__000001_DY81DT,OPT,119 High Street,,,Stourbridge,West Midlands,DY8 1DT,Tel: 01384 440 594, - ,,,No ratings yet Rate it yourself - /Services/opticians/LeaveReview/DefaultView.aspx?id=OP_5HT_6791__000001_DY81DT,0,0,
The Eye Collective Selly Oak,S6Z1Q,OPT,,14 Selly Oak Shopping Park,Aston Webb,Birmingham,,B29 6SQ,Tel: 0121 472 0211, - ,,,No ratings yet Rate it yourself - /Services/opticians/LeaveReview/DefaultView.aspx?id=S6Z1Q,0,0,
Special Look's Opticians,00299__000002_DY98LP,OPT,84a Pedmore Road,Lye,Stourbridge,West Midlands,,DY9 8LP,Tel: 01384 340 101, - ,,,No ratings yet Rate it yourself - /Services/opticians/LeaveReview/DefaultView.aspx?id=00299__000002_DY98LP,0,0,
Eyewise Opticians,OP_5HT_4692__000001_DY81YD,OPT,,7 Market Street,Stourbridge,West Midlands,,DY8 1AB,Tel: 01384 395333, - ,,,12 ratings Rate it yourself - /Services/opticians/LeaveReview/DefaultView.aspx?id=OP_5HT_4692__000001_DY81YD,,,
Ashtree Eyecare Centre,5M1106,OPT,,1547 Pershore Road,Stirchley,Birmingham,,B30 2JH,Tel: 0121 458 4595, - ,,,No ratings yet Rate it yourself - /Services/opticians/LeaveReview/DefaultView.aspx?id=5M1106,0,0,
P W Optics Ltd,TP8NN,OPT,,Unit 2 Market Street,,Stourbridge,West Midlands,DY8 1YD,Tel: 01384 936020, - ,,,No ratings yet Rate it yourself - /Services/opticians/LeaveReview/DefaultView.aspx?id=TP8NN,0,0,yes
Pabari Opticians,5M1068,OPT,,84 Raddlebarn Road,,Birmingham,,B29 6HH,, - ,,,No ratings yet Rate it yourself - /Services/opticians/LeaveReview/DefaultView.aspx?id=5M1068,0,0,
Maginnis Opticians (Optometrists) Ltd,OP_5M1_7062__000003_B302JR,OPT,1379 Pershore Road,Stirchley,Birmingham,,,B30 2JR,Tel: 0121 458 2920, - ,,,No ratings yet Rate it yourself - /Services/opticians/LeaveReview/DefaultView.aspx?id=OP_5M1_7062__000003_B302JR,0,0,
DUDLEY WOOD OPTICIANS,OPT_DY20BH_1,OPT,,2 Bush Road,,Dudley,,DY2 0BH,Tel: 01384 412 600, - ,,,3 ratings Rate it yourself - /Services/opticians/LeaveReview/DefaultView.aspx?id=OPT_DY20BH_1,,,
Cox Opticians,5M1096,OPT,,57 Raddlebarn Road,Selly Oak,Birmingham,,B29 6HQ,Tel: 0121 472 7888, - ,,,No ratings yet Rate it yourself - /Services/opticians/LeaveReview/DefaultView.aspx?id=5M1096,0,0,
Bainbridge Opticians,5M1032,OPT,,174 High Street,Harborne,Birmingham,,B17 9PP,Tel: 0121 427 8201, - ,,,No ratings yet Rate it yourself - /Services/opticians/LeaveReview/DefaultView.aspx?id=5M1032,0,0,
Harborne VE LTD ,5M155__000001_B179NP,OPT,,144 High Street,Harborne,Birmingham,West Midlands,B17 9NP,Tel: 0121 428 4835, - ,,,2 ratings Rate it yourself - /Services/opticians/LeaveReview/DefaultView.aspx?id=5M155__000001_B179NP,,,
Looks Opticians Ltd,OP_5M1_6928__000001_B179PN,OPT,154 High Street,Harborne,Birmingham,,,B17 9PN,Tel: 0121 427 3535, - ,,,No ratings yet Rate it yourself - /Services/opticians/LeaveReview/DefaultView.aspx?id=OP_5M1_6928__000001_B179PN,0,0,
Specsavers,5M1108,OPT,,136 High Street,Harborne,Birmingham,,B17 9NN,Tel: 0121 426 0810, - ,,,No ratings yet Rate it yourself - /Services/opticians/LeaveReview/DefaultView.aspx?id=5M1108,0,0,
Vision Express (UK) Ltd,OP_5HT_290__000003_DY51SY,OPT,Units U44-U45,The Merry Hill Centre,Brierley Hill,West Midlands,,DY5 1SY,Tel: 01384 481 616, - ,,,No ratings yet Rate it yourself - /Services/opticians/LeaveReview/DefaultView.aspx?id=OP_5HT_290__000003_DY51SY,0,0,
Peter Bainbridge Optometrists,OP_5M1_10531__000001_B179PP,OPT,93 High Street,Harborne,,Birmingham,West Midlands,B17 9NR,Tel: 0121 427 8201, - ,,,3 ratings Rate it yourself - /Services/opticians/LeaveReview/DefaultView.aspx?id=OP_5M1_10531__000001_B179PP,,,
Brittain Opticians Ltd,5MX080,OPT,,97 High Street,Harborne,Birmingham,,B17 9NR,Tel: 0121 427 1007, - ,,,No ratings yet Rate it yourself - /Services/opticians/LeaveReview/DefaultView.aspx?id=5MX080,0,0,
Ocean Optical,OP_5MG_10351__000001_B664BL,OPT,641 Bearwood Road,,Smethwick,BEARWOOD,,B66 4BL,Tel: 0121 429 3711, - ,,,1 rating Rate it yourself - /Services/opticians/LeaveReview/DefaultView.aspx?id=OP_5MG_10351__000001_B664BL,,,
Eyecare Mobile Opticians Ltd,5MX066,OPT,,546 Bearwood Road,Smethwick,Birmingham,,B66 4BT,Tel: 0121 429 7752, - ,,,No ratings yet Rate it yourself - /Services/opticians/LeaveReview/DefaultView.aspx?id=5MX066,0,0,
The Vision Centre,OP_5MG_6643__000001_B664BT,OPT,546 Bearwood Road,,Smethwick,,,B66 4BT,Tel: 0121 420 1705, - ,,,No ratings yet Rate it yourself - /Services/opticians/LeaveReview/DefaultView.aspx?id=OP_5MG_6643__000001_B664BT,0,0,
Scrivens Ltd,OP_5MG_7977__000002_B664BH,OPT,Bearwood Shopping Centre,575 Bearwood Road,,Smethwick,West Midlands,B66 4BH,Tel: 0121 420 1089, - ,,,No ratings yet Rate it yourself - /Services/opticians/LeaveReview/DefaultView.aspx?id=OP_5MG_7977__000002_B664BH,0,0,
Optical Express,OP_5HT_1213__000001_DY51SS,OPT,U83,Upper Mall,Merry Hill Shopping Centre,Brierley Hill,West Midlands,DY5 1SS,Tel: 0800 023 2020, - ,,,3 ratings Rate it yourself - /Services/opticians/LeaveReview/DefaultView.aspx?id=OP_5HT_1213__000001_DY51SS,,,
David Wright Opticians,OP_5HV_3943__000001_DY29PS,OPT,88 Halesowen Road,Netherton,Dudley,West Midlands,,DY2 9PS,Tel: 01384 238084, - ,,,2 ratings Rate it yourself - /Services/opticians/LeaveReview/DefaultView.aspx?id=OP_5HV_3943__000001_DY29PS,,,
Boots Opticians and Hearing Care,OP_5HT_242__000002_DY51SY,OPT,The Merry Hill Centre,Brierley Hill,Dudley,West Midlands,,DY5 1QT,Tel: 01384 74817, - ,,,13 ratings Rate it yourself - /Services/opticians/LeaveReview/DefaultView.aspx?id=OP_5HT_242__000002_DY51SY,,,
Bainbridge Optometrists,5MX049,OPT,,502 Bearwood Road,Smethwick,Birmingham,,B66 4BX,Tel: 0121 429 6006, - ,,,No ratings yet Rate it yourself - /Services/opticians/LeaveReview/DefaultView.aspx?id=5MX049,0,0,
Boots-Brierley Hill - Merry Hill Centre (next to Boots UK),OP_5HT_2764__000001_DY51QX,OPT,Unit 66,Merry Hill Centre,,Brierley Hill,West Midlands,DY5 1QX,Tel: 01384 74817, - ,,,1 rating Rate it yourself - /Services/opticians/LeaveReview/DefaultView.aspx?id=OP_5HT_2764__000001_DY51QX,,,
J & S Bangay,OP_5HT_3598__000001_DY83QG,OPT,60 Bridgnorth Road,Wollaston,,Stourbridge,West Midlands,DY8 3QG,Tel: 01384 396585, - ,,,1 rating Rate it yourself - /Services/opticians/LeaveReview/DefaultView.aspx?id=OP_5HT_3598__000001_DY83QG,,,yes
S W Optics Ltd,5M1148__000002_B152TT,OPT,"University Of Birmingham, University Centre",Edgbaston,Birmingham,,,B15 2TT,Tel: 0121 414 2714, - ,,,4 ratings Rate it yourself - /Services/opticians/LeaveReview/DefaultView.aspx?id=5M1148__000002_B152TT,,,
J S Edmunds,OP_5HT_7829__000001_DY53AU,OPT,101 High Street,,Brierley Hill,,,DY5 3AU,Tel: 01384 77025, - ,,,No ratings yet Rate it yourself - /Services/opticians/LeaveReview/DefaultView.aspx?id=OP_5HT_7829__000001_DY53AU,0,0,
Pickford Opticians,OP_5HT_12084__000001_DY53BU,OPT,177 High Street,,Brierley Hill,,,DY5 3BU,Tel: 01384 77326, - ,,,4 ratings Rate it yourself - /Services/opticians/LeaveReview/DefaultView.aspx?id=OP_5HT_12084__000001_DY53BU,,,
Eyecare Opticians,5112 ,OPT,,"Bank Buildings, Langley High Street",,"Langley, Oldbury",,B69 4SN,Tel: 0121 552 4698, - ,,,No ratings yet Rate it yourself - /Services/opticians/LeaveReview/DefaultView.aspx?id=5112,0,0,
Masters Opticians,OP_5MG_13677__000002_B688JB,OPT,182-184 Vicarage Road,,Oldbury,,,B68 8JB,Tel: 0121 544 6800, - ,,,No ratings yet Rate it yourself - /Services/opticians/LeaveReview/DefaultView.aspx?id=OP_5MG_13677__000002_B688JB,0,0,
Boots-Birmingham - Hagley Rd,5M1099,OPT,,235-237 Hagley Road,Edgbaston,Birmingham,West Midlands,B16 9RR,Tel: 0121 454 3355, - ,,,2 ratings Rate it yourself - /Services/opticians/LeaveReview/DefaultView.aspx?id=5M1099,,,
Peter Ian McLauchlan,5M151__000003_B169HN,OPT,17 Portland Road,Edgbaston,Birmingham,,,B16 9HN,Tel: 0121 454 6307, - ,,,No ratings yet Rate it yourself - /Services/opticians/LeaveReview/DefaultView.aspx?id=5M151__000003_B169HN,0,0,
Vincent Roberts Optometrist,OP_5M1_3786__000001_B146EB,OPT,267 Alcester Road South,Kings Heath,Birmingham,,,B14 6EB,Tel: 0121 441 2843, - ,,,4 ratings Rate it yourself - /Services/opticians/LeaveReview/DefaultView.aspx?id=OP_5M1_3786__000001_B146EB,,,
Penzer Opticians,OP_5M1_5811__000001_B145HG,OPT,1024 Alcester Road South,Maypole,Nr Kings Heath,Birmingham,,B14 5NG,Tel: 0121 430 5538, - ,,,1 rating Rate it yourself - /Services/opticians/LeaveReview/DefaultView.aspx?id=OP_5M1_5811__000001_B145HG,,,yes
Vision Replublic,5M1098,OPT,,1003 Alcester Road South,Maypole,Birmingham,,B14 5JA,Tel: 0121 430 6572, - ,,,No ratings yet Rate it yourself - /Services/opticians/LeaveReview/DefaultView.aspx?id=5M1098,0,0,
Spectrum Opticians,OP_5MG_2442__000001_B664JW,OPT,14 Waterloo Road,,Smethwick,,,B66 4JW,Tel: 0121 565 4505, - ,,,No ratings yet Rate it yourself - /Services/opticians/LeaveReview/DefaultView.aspx?id=OP_5MG_2442__000001_B664JW,0,0,
Boots-Kings Heath - Alcester Rd Sth,OP_5M1_3509__000001_B147JQ,OPT,51A Alcester Rd South,,Kings Heath,Birmingham,West Midlands,B14 7JQ,Tel: 0121 444 2376, - ,,,1 rating Rate it yourself - /Services/opticians/LeaveReview/DefaultView.aspx?id=OP_5M1_3509__000001_B147JQ,,,
Specsavers Opticians,OP_5M1_5794__000001_B147LG,OPT,,132 High Street,Kings Heath,Birmingham,,B14 7LG,Tel: 0121 441 1322, - ,,,No ratings yet Rate it yourself - /Services/opticians/LeaveReview/DefaultView.aspx?id=OP_5M1_5794__000001_B147LG,0,0,
Scrivens Ltd,OP_5M1_5464__000002_B147LG,OPT,124 High Street,Kings Heath,,Birmingham,West Midlands,B14 7LG,Tel: 0121 444 2656, - ,,,No ratings yet Rate it yourself - /Services/opticians/LeaveReview/DefaultView.aspx?id=OP_5M1_5464__000002_B147LG,0,0,
Cape Opticians,OP_5MG_10220__000001_B664SG,OPT,79 Cape Hill,,Smethwick,,,B66 4SG,Tel: 0121 558 0148, - ,,,No ratings yet Rate it yourself - /Services/opticians/LeaveReview/DefaultView.aspx?id=OP_5MG_10220__000001_B664SG,0,0,
Portland Eyecare Services Ltd,5M152__000002_B147EG,OPT,,1 Institute Road,Birmingham,Birmingham,,B14 7EG,Tel: 0121 444 4838, - ,,,No ratings yet Rate it yourself - /Services/opticians/LeaveReview/DefaultView.aspx?id=5M152__000002_B147EG,0,0,
Vineys Opticians,OP_5MG_13681__000001_B663NJ,OPT,277-279 High Street,,Smethwick,,,B66 3NJ,Tel: 0121 558 0790, - ,,,No ratings yet Rate it yourself - /Services/opticians/LeaveReview/DefaultView.aspx?id=OP_5MG_13681__000001_B663NJ,0,0,
Pabari Opticians,00000055__000001_B475DX,OPT,Unit2 Drakes Cross Shopping Parade,,Wythall,Worcestershire,,B47 5HD,Tel: 01564 824482, - ,,,1 rating Rate it yourself - /Services/opticians/LeaveReview/DefaultView.aspx?id=00000055__000001_B475DX,,,
M Kakoullis,OP_5MG_8490__000001_B694DY,OPT,31 Birmingham Street,,Oldbury,,,B69 4DY,Tel: 0121 552 2550, - ,,,No ratings yet Rate it yourself - /Services/opticians/LeaveReview/DefaultView.aspx?id=OP_5MG_8490__000001_B694DY,0,0,
Scrivens Ltd,OP_5MG_12079__000002_B694DT,OPT,9 Birmingham Street,,,Oldbury,West Midlands,B69 4DT,Tel: 0121 552 1189, - ,,,No ratings yet Rate it yourself - /Services/opticians/LeaveReview/DefaultView.aspx?id=OP_5MG_12079__000002_B694DT,0,0,
The Right Vision Ophthalmic Opticians,OP_5PF_1381__000001_B694DS,OPT,34 Birmingham Street,,Oldbury,West Midlands,,B69 4DS,Tel: 0121 544 2323, - ,,,No ratings yet Rate it yourself - /Services/opticians/LeaveReview/DefaultView.aspx?id=OP_5PF_1381__000001_B694DS,0,0,
Portway Opticians,CO-4566,OPT,,51A New Birmingham Road,,Oldbury,,B69 2JQ,Tel: 0121 544 1854, - ,,,2 ratings Rate it yourself - /Services/opticians/LeaveReview/DefaultView.aspx?id=CO-4566,,,
John Hamer Opticians,OP_5HT_3163__000002_DY85PD,OPT,11 Wordsley Green Shopping Centre,Wordsley Green,Stourbridge,,,DY8 5PD,Tel: 01384 401 201, - ,,,No ratings yet Rate it yourself - /Services/opticians/LeaveReview/DefaultView.aspx?id=OP_5HT_3163__000002_DY85PD,0,0,
On Call Opticians - Home Visits for an Eye Test,TAMOPTICIAN0001,OPT,WEST MIDLANDS ONLY SERVICE Registered at,61 Trafalgar Road,,Oldbury,West Midlands,B69 1RE,Tel: 01384 234 779, - ,,,77 ratings Rate it yourself - /Services/opticians/LeaveReview/DefaultView.aspx?id=TAMOPTICIAN0001,,,yes
Express Vision Care,OP_5MG_13680__000002_B661DS,OPT,70 High Street,,Smethwick,,,B66 1DS,Tel: 0121 558 6322, - ,,,No ratings yet Rate it yourself - /Services/opticians/LeaveReview/DefaultView.aspx?id=OP_5MG_13680__000002_B661DS,0,0,