Organisation Name,NACS Code,Organisation Type,Address1,Address2,Address3,Address4,Address5,PostCode,Telephone Number,Opening time,Value  (Opening time),Banding Classification  (Opening time),NHS.UK users rating,Value  (NHS.UK users rating),Banding Classification  (NHS.UK users rating),Car parking (Is there car parking at this organisation?)
Vision Value Opticians Ltd,OP_5JE_11239__000001_S738HS,OPT,77a High Street,Wombwell,Barnsley,South Yorkshire,,S73 8HS,Tel: 01226 752149, - ,,,No ratings yet Rate it yourself - /Services/opticians/LeaveReview/DefaultView.aspx?id=OP_5JE_11239__000001_S738HS,0,0,
Lugton Opticians,OP_5JE_2692__000001_S738DD,OPT,4 Barnsley Road,Wombwell,Barnsley,,,S73 8DD,Tel: 01226 340712, - ,,,No ratings yet Rate it yourself - /Services/opticians/LeaveReview/DefaultView.aspx?id=OP_5JE_2692__000001_S738DD,0,0,
Tesco Opticians,CO-1998 5JE__000002_S703NS,OPT,,Wombwell Lane,,Barnsley,,S70 3NS,Tel: 0345 601 3479, - ,,,No ratings yet Rate it yourself - /Services/opticians/LeaveReview/DefaultView.aspx?id=CO-1998 5JE__000002_S703NS,0,0,
"Auckland, R H ",OP_5JE_3186__000001_S630NG,OPT,111a Houghton Road,Thurnscoe,Rotherham,,,S63 0NG,Tel: 01709 893317, - ,,,No ratings yet Rate it yourself - /Services/opticians/LeaveReview/DefaultView.aspx?id=OP_5JE_3186__000001_S630NG,0,0,
Staples Opticians Ltd,OP_5H8___000001_S637PX,OPT,95 High Street,Wath Upon Dearne,Rotherham,,,S63 7PX,Tel: 01709 873356, - ,,,No ratings yet Rate it yourself - /Services/opticians/LeaveReview/DefaultView.aspx?id=OP_5H8___000001_S637PX,0,0,
Parkhurst Opticians,OP_5JE_7519__000001_S639HG,OPT,4 High Street,Goldthorpe,Rotherham,,,S63 9LR,Tel: 01709 894479, - ,,,1 rating Rate it yourself - /Services/opticians/LeaveReview/DefaultView.aspx?id=OP_5JE_7519__000001_S639HG,,,
"Auckland, R H ",OP_5JE_3181__000002_S639NF,OPT,14-16 Barnsley Road,Goldthorpe,,Rotherham,,S63 9NF,Tel: 01709 891991, - ,,,No ratings yet Rate it yourself - /Services/opticians/LeaveReview/DefaultView.aspx?id=OP_5JE_3181__000002_S639NF,0,0,
Norwood & Perrin,N1Z5N,OPT,,235 Barnsley Road,,Cudworth,South Yorkshire,S72 8JN,Tel: 01226 710576, - ,,,No ratings yet Rate it yourself - /Services/opticians/LeaveReview/DefaultView.aspx?id=N1Z5N,0,0,
J Flynn Opticians Ltd,OL/CO-2893/5JE__000002_S749JT,OPT,26 King Street,Hoyland,Barnsley,South Yorkshire,,S74 9JT,Tel: 01226 360333, - ,,,No ratings yet Rate it yourself - /Services/opticians/LeaveReview/DefaultView.aspx?id=OL/CO-2893/5JE__000002_S749JT,0,0,
Premier Eyecare,CO-2653__000002_S749JU,OPT,5 King Street,Hoyland,Barnsley,South Yorkshire,,S74 9JU,Tel: 01226 742158, - ,,,No ratings yet Rate it yourself - /Services/opticians/LeaveReview/DefaultView.aspx?id=CO-2653__000002_S749JU,0,0,
Tennyson Optical,TP814,OPT,,46 Tennyson Road,Monk Bretton,Barnsley,South Yorkshire,S71 2LP,Tel: 01226 218413, - ,,,No ratings yet Rate it yourself - /Services/opticians/LeaveReview/DefaultView.aspx?id=TP814,0,0,
Harveys Opticans,,OPT,,72 Station Street,,Swinton,,S64 8PZ,, - ,,,N/A - Data not available,,,
"Raison, C A",OP_5JE_1818__000002_S701RU,OPT,46 Cheapside,Barnsley,South Yorkshire,,,S70 1RU,Tel: 01226 731292, - ,,,No ratings yet Rate it yourself - /Services/opticians/LeaveReview/DefaultView.aspx?id=OP_5JE_1818__000002_S701RU,0,0,
Norwood & Perrin Ltd,OP_5JE_8201__000001_S702JP,OPT,10 Eldon Arcade,Barnsley,South Yorkshire,,,S70 2JP,Tel: 01226 206033, - ,,,No ratings yet Rate it yourself - /Services/opticians/LeaveReview/DefaultView.aspx?id=OP_5JE_8201__000001_S702JP,0,0,
Berrys Opticians,OP_5JE_8952__000001_S702YN,OPT,Berrys Opticians,54 Market Street,,Barnsley,,S70 1SN,Tel: 01226 203074, - ,,,1 rating Rate it yourself - /Services/opticians/LeaveReview/DefaultView.aspx?id=OP_5JE_8952__000001_S702YN,,,
A S Parkhurst Opticians Ltd,OP_5EL_4708__000001_S649NU,OPT,1 Lower Dolcliffe Road,1 Lower Dolcliffe Road,,Mexborough,,S64 9NU,Tel: 01709 582315, - ,,,No ratings yet Rate it yourself - /Services/opticians/LeaveReview/DefaultView.aspx?id=OP_5EL_4708__000001_S649NU,0,0,
Asda Opticians,OP_5JE_11306__000001_S711LN,OPT,Old Mill Lane,,Barnsley,South Yorkshire,,S71 1LN,Tel: 01226 704912, - ,,,No ratings yet Rate it yourself - /Services/opticians/LeaveReview/DefaultView.aspx?id=OP_5JE_11306__000001_S711LN,0,0,
Optical Express,OP_5JE_8992__000001_S701SJ,OPT,10-18 Queen Street,,,Barnsley,South Yorkshire,S70 1SJ,Tel: 0800 023 2020, - ,,,No ratings yet Rate it yourself - /Services/opticians/LeaveReview/DefaultView.aspx?id=OP_5JE_8992__000001_S701SJ,0,0,
Barnsley Vision Plus Ltd t/a Specsavers Opticians,OP_5JE_1128__000001_S701SB,OPT,14 Queen Street,,Barnsley,,,S70 1RJ,Tel: 01226 771455, - ,,,No ratings yet Rate it yourself - /Services/opticians/LeaveReview/DefaultView.aspx?id=OP_5JE_1128__000001_S701SB,0,0,
Boots-Barnsley - Queen St,OP_5JE_6108__000002_S702ST,OPT,1 Queen Street,,South Yorkshire,Barnsley,,S70 1RJ,Tel: 01226 730451, - ,,,No ratings yet Rate it yourself - /Services/opticians/LeaveReview/DefaultView.aspx?id=OP_5JE_6108__000002_S702ST,0,0,
Direct Optik International,OP_5JE_11308__000001_S702QP,OPT,31 The Arcade,Barnsley,South Yorkshire,,,S70 2QP,Tel: 01226 770660, - ,,,No ratings yet Rate it yourself - /Services/opticians/LeaveReview/DefaultView.aspx?id=OP_5JE_11308__000001_S702QP,0,0,
Scrivens Ltd,OP_5JE_11305__000001_S701SL,OPT,13 Market Street,,,Barnsley,Yorkshire,S70 1SL,Tel: 01226 295293, - ,,,No ratings yet Rate it yourself - /Services/opticians/LeaveReview/DefaultView.aspx?id=OP_5JE_11305__000001_S701SL,0,0,
iVision Opticians,OP_5JE_1692__000001_S701YA,OPT,6-8 Peel Square,6-8 Peel Square,South Yorkshire,Barnsley,,S70 1YA,Tel: 01226 731271, - ,,,No ratings yet Rate it yourself - /Services/opticians/LeaveReview/DefaultView.aspx?id=OP_5JE_1692__000001_S701YA,0,0,
"Flack, G",01-23478__000001_S701QA,OPT,52 Park Grove,,Barnsley,South Yorkshire,,S70 1QA,Tel: 01226 211147, - ,,,No ratings yet Rate it yourself - /Services/opticians/LeaveReview/DefaultView.aspx?id=01-23478__000001_S701QA,0,0,
"Menezes,  A R",OL/0536796__000001_S705TA,OPT,,124 - 126 Park Grove,,Barnsley,,S70 1QE,Tel: 07806 941904, - ,,,No ratings yet Rate it yourself - /Services/opticians/LeaveReview/DefaultView.aspx?id=OL/0536796__000001_S705TA,0,0,
Mexborough Visionplus Ltd t/a Specsavers Opticians,CO-3077 5EL__000001_S649DG,OPT,16 - 18 York Square,Mexborough,South Yorkshire,England - Uk,,S64 9DG,Tel: 01709 573010, - ,,,No ratings yet Rate it yourself - /Services/opticians/LeaveReview/DefaultView.aspx?id=CO-3077 5EL__000001_S649DG,0,0,
Scrivens Opticians & Hearing Care,OPT_S649AS_1,OPT,,10 High Street,,Mexborough,South Yorkshire,S64 9AS,Tel: 01709 583966, - ,,,No ratings yet Rate it yourself - /Services/opticians/LeaveReview/DefaultView.aspx?id=OPT_S649AS_1,0,0,
South Kirkby Eye-Care Ltd,OPT_WF93AP_1,OPT,,Church View Health Centre,,South Kirkby,,WF9 3AP,Tel: 01977648844, - ,,,No ratings yet Rate it yourself - /Services/opticians/LeaveReview/DefaultView.aspx?id=OPT_WF93AP_1,0,0,
Moorhouse Opticians (Northern) Ltd,OP_5EL_11164__000001_S649QD,OPT,55 Bank Street,,Mexborough,,,S64 9QD,Tel: 01709 582093, - ,,,No ratings yet Rate it yourself - /Services/opticians/LeaveReview/DefaultView.aspx?id=OP_5EL_11164__000001_S649QD,0,0,
M K O Ltd Opticians,OP_5H8_8577__000001_S625AL,OPT,69 Dale Road,Rawmarsh,Rotherham,,,S62 5AL,Tel: 01709 522684, - ,,,No ratings yet Rate it yourself - /Services/opticians/LeaveReview/DefaultView.aspx?id=OP_5H8_8577__000001_S625AL,0,0,
McCormack Opticians,OP_5E7_11182__000001_WF94AS,OPT,73 Kirkby Road,Hemsworth,Pontefract,,,WF9 4AS,Tel: 01977 613310, - ,,,No ratings yet Rate it yourself - /Services/opticians/LeaveReview/DefaultView.aspx?id=OP_5E7_11182__000001_WF94AS,0,0,
Moorhouse Opticians Ltd,OP_5E7_4957__000002_WF94DP,OPT,4 Highfield Road,Hemsworth,Pontefract,,,WF9 4DP,Tel: 01977 611744, - ,,,No ratings yet Rate it yourself - /Services/opticians/LeaveReview/DefaultView.aspx?id=OP_5E7_4957__000002_WF94DP,0,0,
D. Bank Eyecare,OP_5E7_14037__000001_WF92AA,OPT,55 Barnsley Road,55 Barnsley Road,South Elmsall,South Elmsall,,WF9 2QW,Tel: 01977 642244, - ,,,No ratings yet Rate it yourself - /Services/opticians/LeaveReview/DefaultView.aspx?id=OP_5E7_14037__000001_WF92AA,0,0,
Norwood & Perrin Ltd,OP_5JE_11161__000001_S714QT,OPT,T/A Sadler Opticians,102 Midland Road,Royston,,,S71 4QT,Tel: 01226 722238, - ,,,No ratings yet Rate it yourself - /Services/opticians/LeaveReview/DefaultView.aspx?id=OP_5JE_11161__000001_S714QT,0,0,
Aldreds Opticians,15237__000002_WF92RT,OPT,2 Brookside Street,South Elmsall,Nr Pontefract,,,WF9 2RT,Tel: 01977 649598, - ,,,1 rating Rate it yourself - /Services/opticians/LeaveReview/DefaultView.aspx?id=15237__000002_WF92RT,,,
Specsavers Opticians,OPT_WF92SR_1,OPT,,10 Barnsley Road,,South Elmsall,,WF9 2SR,, - ,,,No ratings yet Rate it yourself - /Services/opticians/LeaveReview/DefaultView.aspx?id=OPT_WF92SR_1,0,0,
Lugton Opticians,OP_5EE_13325__000001_S352XE,OPT,15 Station Road,Chapeltown,Sheffield,,,S35 2XE,Tel: 0114 245 4804, - ,,,No ratings yet Rate it yourself - /Services/opticians/LeaveReview/DefaultView.aspx?id=OP_5EE_13325__000001_S352XE,0,0,
Asda Opticians,OPT_S35 2UW,OPT,,1 MARKET STREET,CHAPELTOWN,SHEFFIELD,,S35 2UW,Tel: 0114 240 4220, - ,,,No ratings yet Rate it yourself - /Services/opticians/LeaveReview/DefaultView.aspx?id=OPT_S35 2UW,0,0,
Vision Express,OP_5H8_11809__000001_S651AJ,OPT,"Unit 31, Retail World",Parkgate,Rotherham,,,S60 1TG,Tel: 01709 780886, - ,,,No ratings yet Rate it yourself - /Services/opticians/LeaveReview/DefaultView.aspx?id=OP_5H8_11809__000001_S651AJ,0,0,
Olive Opticians,OP_5EE_9993__000001_S351TD,OPT,15 Ecclesfield Road,Chapeltown,Sheffield,Sheffield,,S35 1TD,Tel: 0114 246 7764, - ,,,10 ratings Rate it yourself - /Services/opticians/LeaveReview/DefaultView.aspx?id=OP_5EE_9993__000001_S351TD,,,
McCormack Opticians,OP_5E7_14749__000001_WF42DG,OPT,Ryecroft Primary Care Centre,Madeley Road,Havercroft,,,WF4 2DG,Tel: 01274 678701, - ,,,No ratings yet Rate it yourself - /Services/opticians/LeaveReview/DefaultView.aspx?id=OP_5E7_14749__000001_WF42DG,0,0,
Asda Wal Mart Opticians ,000001_S653SW__000002_S653SW,OPT,Aldwarke Lane,,,Rotherham,,S65 3SW,Tel: 01709 859420, - ,,,No ratings yet Rate it yourself - /Services/opticians/LeaveReview/DefaultView.aspx?id=000001_S653SW__000002_S653SW,0,0,
Garner Optician,OP_5H8_11212__000001_S651PT,OPT,10 Fitzwilliam Road,Eastwood,Rotherham,,,S65 1PT,Tel: 01709 382826, - ,,,No ratings yet Rate it yourself - /Services/opticians/LeaveReview/DefaultView.aspx?id=OP_5H8_11212__000001_S651PT,0,0,
Clifford Perry & Co Ltd,OP_5H8_1967__000001_S651AP,OPT,1 Effingham Square,,Rotherham,,,S65 1AP,Tel: 01709 379471, - ,,,No ratings yet Rate it yourself - /Services/opticians/LeaveReview/DefaultView.aspx?id=OP_5H8_1967__000001_S651AP,0,0,
Murgatroyd Opticians,OP_5EL_10336__000001_DN122LY,OPT,March Street,Conisbrough,Doncaster,,,DN12 2LY,Tel: 01709 862885, - ,,,No ratings yet Rate it yourself - /Services/opticians/LeaveReview/DefaultView.aspx?id=OP_5EL_10336__000001_DN122LY,0,0,
Scrivens Ltd,OP_5H8_4061__000001_S601QN,OPT,5/9 All Saints Square,,,Rotherham,West Yorkshire,S60 1PW,Tel: 01709 382366, - ,,,No ratings yet Rate it yourself - /Services/opticians/LeaveReview/DefaultView.aspx?id=OP_5H8_4061__000001_S601QN,0,0,
Direct Optik International ,000001_S601ND__000001_S601ND,OPT,7 Riverside Precinct,,Rotherham,,,S60 1ND,Tel: 01709 364131, - ,,,No ratings yet Rate it yourself - /Services/opticians/LeaveReview/DefaultView.aspx?id=000001_S601ND__000001_S601ND,0,0,
Specsavers Opticians,OP_5H8_569__000001_S651AG,OPT,34-36 College Street,,Rotherham,,,S65 1AG,Tel: 01709 511311, - ,,,No ratings yet Rate it yourself - /Services/opticians/LeaveReview/DefaultView.aspx?id=OP_5H8_569__000001_S651AG,0,0,
Rayner Midland Opticians,OP_5H8_5598__000002_S601PD,OPT,2-4 Church Street,,Rotherham,,,S60 1PD,Tel: 01709 363745, - ,,,No ratings yet Rate it yourself - /Services/opticians/LeaveReview/DefaultView.aspx?id=OP_5H8_5598__000002_S601PD,0,0,
"Morton, J R (Wakefield) Ltd",OP_5JE_4681__000001_S755HG,OPT,38 Church Street,Darton,Barnsley,,,S75 5HG,Tel: 01226 385498, - ,,,No ratings yet Rate it yourself - /Services/opticians/LeaveReview/DefaultView.aspx?id=OP_5JE_4681__000001_S755HG,0,0,
O'Brien Fey Opticians ,000001_S602LT__000002_S602LT,OPT,41-43 Wellgate,,Rotherham,,,S60 2LT,Tel: 01709 376771, - ,,,1 rating Rate it yourself - /Services/opticians/LeaveReview/DefaultView.aspx?id=000001_S602LT__000002_S602LT,,,
Boots-Rotherham - Wellgate,OP_5H8_4284__000001_S602LT,OPT,3A Wellgate,,,Rotherham,South Yorkshire,S60 2LT,Tel: 01709 365083, - ,,,No ratings yet Rate it yourself - /Services/opticians/LeaveReview/DefaultView.aspx?id=OP_5H8_4284__000001_S602LT,0,0,
English T,000001_S602LR__000002_S602LR,OPT,34 Wellgate,,Rotherham,,,S60 2LR,Tel: 01709 362626, - ,,,No ratings yet Rate it yourself - /Services/opticians/LeaveReview/DefaultView.aspx?id=000001_S602LR__000002_S602LR,0,0,
M K O Ltd Opticians,OP_5H8_12568__000001_S602LR,OPT,26a Wellgate,,Rotherham,,,S60 2LR,Tel: 01709 364002, - ,,,No ratings yet Rate it yourself - /Services/opticians/LeaveReview/DefaultView.aspx?id=OP_5H8_12568__000001_S602LR,0,0,
A J Hurdley Opticians,OP_5EE_11413__000001_S359WS,OPT,125 High Street,Ecclesfield,Sheffield,,,S35 9UA,Tel: 0114 246 8127, - ,,,4 ratings Rate it yourself - /Services/opticians/LeaveReview/DefaultView.aspx?id=OP_5EE_11413__000001_S359WS,,,
Mobile Opticians Ltd,CO-3422__000001_S603DB,OPT,Moorgate Croft Business Centre,South Grove,,Rotherham,,S60 2DH,Tel: 08000 434261, - ,,,No ratings yet Rate it yourself - /Services/opticians/LeaveReview/DefaultView.aspx?id=CO-3422__000001_S603DB,0,0,
Aldreds Ltd,OP_5E7_5397__000001_WF77HU,OPT,8 Bell Lane,Ackworth,,Pontefract,,WF7 7JA,Tel: 01977 613633, - ,,,No ratings yet Rate it yourself - /Services/opticians/LeaveReview/DefaultView.aspx?id=OP_5E7_5397__000001_WF77HU,0,0,
Harveys Opticians,W3D2V,OPT,,485 Herringthorpe Valley Rd,,Rotherham,South Yorkshire,S65 3AD,Tel: 01709 838833, - ,,,No ratings yet Rate it yourself - /Services/opticians/LeaveReview/DefaultView.aspx?id=W3D2V,0,0,
Vision Express ,OP_5EQ_6166__000001_S91EH,OPT,3 The Arcade,Meadowhall Centre,Sheffield,,,S9 1EH,Tel: 0114 256 8899, - ,,,No ratings yet Rate it yourself - /Services/opticians/LeaveReview/DefaultView.aspx?id=OP_5EQ_6166__000001_S91EH,0,0,
Boots-Sheffield - Meadowhall,OP_5EQ_1870__000002_S91EJ,OPT,44a High Street,,Meadowhall Centre,Sheffield,South Yorkshire,S9 1EN,Tel: 0114 256 9122, - ,,,4 ratings Rate it yourself - /Services/opticians/LeaveReview/DefaultView.aspx?id=OP_5EQ_1870__000002_S91EJ,,,
Vision Express ,OP_5EQ_6541__000002_S91EN,OPT,57 High Street,Meadowhall Centre,Sheffield,,,S9 1EN,Tel: 0114 256 8866, - ,,,No ratings yet Rate it yourself - /Services/opticians/LeaveReview/DefaultView.aspx?id=OP_5EQ_6541__000002_S91EN,0,0,
Opticial Express,OP_12345_S9 1EP,OPT,"30, The Gallery",Meadowhall,,Sheffield,South Yorkshire,S9 1EP,Tel: 0800 023 2020, - ,,,No ratings yet Rate it yourself - /Services/opticians/LeaveReview/DefaultView.aspx?id=OP_12345_S9 1EP,0,0,
Optical Express,CO-2069 01__000001_S91EP,OPT,30 The Gallery - Unit 8a,Meadowhall Shopping Centre,Sheffield,South Yorkshire,,S9 1EP,Tel: 0114 235 4410, - ,,,No ratings yet Rate it yourself - /Services/opticians/LeaveReview/DefaultView.aspx?id=CO-2069 01__000001_S91EP,0,0,
Martyn Kemp Opticians,OP_5EE_10979__000002_S56HL,OPT,37 Bellhouse Road,Firth Park,,Sheffield,,S5 6HL,Tel: 0114 242 4248, - ,,,1 rating Rate it yourself - /Services/opticians/LeaveReview/DefaultView.aspx?id=OP_5EE_10979__000002_S56HL,,,
Murgatroyd Opticians,OP_5EL_6611__000001_DN121BS,OPT,2 Edlington Lane,Edlington,Doncaster,,,DN12 1BS,Tel: 01709 863293, - ,,,1 rating Rate it yourself - /Services/opticians/LeaveReview/DefaultView.aspx?id=OP_5EL_6611__000001_DN121BS,,,
Firth Park Eye Care,OP_5EE_13326__000001_S56HJ,OPT,59 Bellhouse Road,,Sheffield,South Yorkshire,,S5 6HJ,Tel: 0114 256 2501, - ,,,No ratings yet Rate it yourself - /Services/opticians/LeaveReview/DefaultView.aspx?id=OP_5EE_13326__000001_S56HJ,0,0,
Asda Opticians,OPT_S5 8NH,OPT,,CHAUCER ROAD,PARSONS CROSS,SHEFFIELD,,S5 8NH,Tel: 01142 945283, - ,,,No ratings yet Rate it yourself - /Services/opticians/LeaveReview/DefaultView.aspx?id=OPT_S5 8NH,0,0,
English T,000001_S661JY__000001_S661JY,OPT,Hastings Court,Bawtry Road,Rotherham,,,S66 1JY,Tel: 01709 533143, - ,,,No ratings yet Rate it yourself - /Services/opticians/LeaveReview/DefaultView.aspx?id=000001_S661JY__000001_S661JY,0,0,
Wickersley Eye Clinic,OP_5H8_7411__000001_S661AA,OPT,"7 Tanyard Presinct, 236 Bawtry Road",Wickersley,Rotherham,Rotherham,,S66 1AA,Tel: 01709 701255, - ,,,No ratings yet Rate it yourself - /Services/opticians/LeaveReview/DefaultView.aspx?id=OP_5H8_7411__000001_S661AA,0,0,
Eye Care Opticians Sheffield Ltd,OP-5N4-0003__000001_S56WQ,OPT,180 Firth Park Road,Firth Park,Sheffield,South Yorkshire,,S5 6WQ,Tel: 0114 243 5599, - ,,,No ratings yet Rate it yourself - /Services/opticians/LeaveReview/DefaultView.aspx?id=OP-5N4-0003__000001_S56WQ,0,0,
Healthcall Optical Services,OP_5EA_14795__000003_S92EH,OPT,23 Carbrook Hall Road,Carbrook,Sheffield,,,S9 2EH,Tel: 0114 2427272, - ,,,No ratings yet Rate it yourself - /Services/opticians/LeaveReview/DefaultView.aspx?id=OP_5EA_14795__000003_S92EH,0,0,
Martin Kemp Opticians,OP_5EE_217__000001_S58TJ,OPT,443 Herries Road,,Sheffield,Sheffield,,S5 8TJ,Tel: 0114 232 5503, - ,,,1 rating Rate it yourself - /Services/opticians/LeaveReview/DefaultView.aspx?id=OP_5EE_217__000001_S58TJ,,,
Martyn Kemp Opticians,OP_5EN_5961__000002_S361BX,OPT,Harry Brearley House,Fox Valley Retail Park,Stocksbridge,Sheffield,,S36 2AB,Tel: 0114 288 2287, - ,,,1 rating Rate it yourself - /Services/opticians/LeaveReview/DefaultView.aspx?id=OP_5EN_5961__000002_S361BX,,,
Asda Stores Limited,OP_5E8_14318__000002_WF27EQ,OPT,Asda Opticians,Asdale Road,,Wakefield,,WF2 7EQ,Tel: 01924 241820, - ,,,No ratings yet Rate it yourself - /Services/opticians/LeaveReview/DefaultView.aspx?id=OP_5E8_14318__000002_WF27EQ,0,0,
Parkhurst Opticians Ltd,OP_5EL_5106__000001_DN50AT,OPT,110 High Street,Bentley,,Doncaster,,DN5 0AT,Tel: 01405 740095, - ,,,1 rating Rate it yourself - /Services/opticians/LeaveReview/DefaultView.aspx?id=OP_5EL_5106__000001_DN50AT,,,
Boots-Doncaster - North Bridge Rd,5CKOO154__000001_DN59AN,OPT,18 - 24 North Bridge Road,,Doncaster,South Yorkshire,,DN5 9AN,Tel: 01302 321 515, - ,,,No ratings yet Rate it yourself - /Services/opticians/LeaveReview/DefaultView.aspx?id=5CKOO154__000001_DN59AN,0,0,
Moorhouse Opticians ,OP_5E7_9743__000002_WF75BE,OPT,19/21 Station Lane,Featherstone,Pontefract,,,WF7 5BE,Tel: 01977 791714, - ,,,No ratings yet Rate it yourself - /Services/opticians/LeaveReview/DefaultView.aspx?id=OP_5E7_9743__000002_WF75BE,0,0,
Vision Express (UK) Ltd,CO-3137__000001_DN11LJ,OPT,28 Frenchgate,Doncaster,,South Yorkshire,,DN1 1LJ,Tel: 01302 366555, - ,,,1 rating Rate it yourself - /Services/opticians/LeaveReview/DefaultView.aspx?id=CO-3137__000001_DN11LJ,,,
Boots-Doncaster - North Mall,OP_5CK_231__000001_DN11SR,OPT,The Frenchgate Centre,11 North Mall,,Doncaster,South Yorkshire,DN1 1SR,Tel: 01302 329873, - ,,,No ratings yet Rate it yourself - /Services/opticians/LeaveReview/DefaultView.aspx?id=OP_5CK_231__000001_DN11SR,0,0,
Opticial Express,OP_12345_DN1 1QQ,OPT,20/22 Frenchgate,,,Doncaster,South Yorkshire,DN1 1QQ,Tel: 0800 023 2020, - ,,,No ratings yet Rate it yourself - /Services/opticians/LeaveReview/DefaultView.aspx?id=OP_12345_DN1 1QQ,0,0,
Bell Brothers (Opticians) Ltd,OP_5CK_13596__000001_DN11DB,OPT,Bell Brothers Opticians,27 St. Sepulchre Gate,,Doncaster,South Yorkshire,DN1 1TD,Tel: 01302 323619, - ,,,No ratings yet Rate it yourself - /Services/opticians/LeaveReview/DefaultView.aspx?id=OP_5CK_13596__000001_DN11DB,0,0,
Specsavers Opticians,OP_5CK_5787__000002_DN11TD,OPT,9 St. Sepulchre Gate,,Doncaster,,,DN1 1TD,Tel: 01302 326557, - ,,,No ratings yet Rate it yourself - /Services/opticians/LeaveReview/DefaultView.aspx?id=OP_5CK_5787__000002_DN11TD,0,0,
Vision Value Opticians,OP_5CK_5973__000001_DN11TD,OPT,33 St. Sepulchre Gate,,Doncaster,,,DN1 1TD,Tel: 01302 768691, - ,,,1 rating Rate it yourself - /Services/opticians/LeaveReview/DefaultView.aspx?id=OP_5CK_5973__000001_DN11TD,,,
Murgatroyd Opticians,CO-2205__000002_DN121BS,OPT,"Kelham House, Kelham Street",,Doncaster,South Yorkshire,,DN1 3RE,Tel: 01302 329511, - ,,,No ratings yet Rate it yourself - /Services/opticians/LeaveReview/DefaultView.aspx?id=CO-2205__000002_DN121BS,0,0,
Parkhurst Opticians Ltd,OP_5CK_3413__000001_DN11SY,OPT,21 Printing Office Street,,Doncaster,,,DN1 1TZ,Tel: 01302 369744, - ,,,2 ratings Rate it yourself - /Services/opticians/LeaveReview/DefaultView.aspx?id=OP_5CK_3413__000001_DN11SY,,,
Edwards & Walker,OP_5CK_11152__000001_DN11TR,OPT,Edwards and Walker Opticians,16 Priory Place,Doncaster,Doncaster,South Yorkshire,DN1 1BZ,Tel: 01302 349193, - ,,,1 rating Rate it yourself - /Services/opticians/LeaveReview/DefaultView.aspx?id=OP_5CK_11152__000001_DN11TR,,,
Scrivens Ltd,OP_5CK_1079__000001_DN13JU,OPT,23 Printing Office Street,,,Doncaster,Yorkshire,DN1 1TP,Tel: 01302 323157, - ,,,No ratings yet Rate it yourself - /Services/opticians/LeaveReview/DefaultView.aspx?id=OP_5CK_1079__000001_DN13JU,0,0,
Rayner Opticians ,OP_5CK_5426__000001_DN11HQ,OPT,,37a  Printing Office Street,,Doncaster,South Yorkshire,DN1 1TP,Tel: 01302 323101, - ,,,No ratings yet Rate it yourself - /Services/opticians/LeaveReview/DefaultView.aspx?id=OP_5CK_5426__000001_DN11HQ,0,0,
H Dickinson & Co,OP_5CK_10070__000001_DN11ES,OPT,,,38 Scot Lane,Doncaster,,DN1 1ES,Tel: 01302 344811, - ,,,No ratings yet Rate it yourself - /Services/opticians/LeaveReview/DefaultView.aspx?id=OP_5CK_10070__000001_DN11ES,0,0,
The Cotler Practice,CO-2482__000002_DN11DW,OPT,18 High Street,,Doncaster,South Yorkshire,,DN1 1DW,Tel: 01302 361638, - ,,,No ratings yet Rate it yourself - /Services/opticians/LeaveReview/DefaultView.aspx?id=CO-2482__000002_DN11DW,0,0,
Specsavers Opticians,OP_5H8_9659__000001_S605TR,OPT,Poplar Way,Catcliffe,Rotherham,,,S60 5TR,Tel: 01709 839991, - ,,,1 rating Rate it yourself - /Services/opticians/LeaveReview/DefaultView.aspx?id=OP_5H8_9659__000001_S605TR,,,
UH Ltd T/A A C Smith Opticians,OP_5CK_3183__000001_DN11NE,OPT,34 Market Place,,Doncaster,,,DN1 1NE,Tel: 01302 344569, - ,,,No ratings yet Rate it yourself - /Services/opticians/LeaveReview/DefaultView.aspx?id=OP_5CK_3183__000001_DN11NE,0,0,
Vision Call Yorkshire (Community Eyecare Limited),MOB/231/5N7__000001_DN13PE,OPT,Kelham House,Kelham Street,Doncaster,,,DN1 3PE,, - ,,,No ratings yet Rate it yourself - /Services/opticians/LeaveReview/DefaultView.aspx?id=MOB/231/5N7__000001_DN13PE,0,0,
Darnall Opticians,01-24827,OPT,Darnall Opticians,2 York Road (within Darnall Health Centre),,Sheffield,South Yorkshire,S9 5DH,Tel: 01142434584, - ,,,2 ratings Rate it yourself - /Services/opticians/LeaveReview/DefaultView.aspx?id=01-24827,,,
Parkhurst Opticians,OP_5EQ_13326__000001_S93FQ,OPT,439 Staniforth Road,,Sheffield,,,S9 3FQ,Tel: 0114 244 2271, - ,,,No ratings yet Rate it yourself - /Services/opticians/LeaveReview/DefaultView.aspx?id=OP_5EQ_13326__000001_S93FQ,0,0,
Tesco Opticians,CO 1991__000001_DN48SN,OPT,The Tesco Store,Woodfield Way,Balby,Doncaster,,DN4 8SN,Tel: 0345 677 9207, - ,,,No ratings yet Rate it yourself - /Services/opticians/LeaveReview/DefaultView.aspx?id=CO 1991__000001_DN48SN,0,0,
Tunnacliffe & Lambert ,OP_5EQ_12144__000001_S95HQ,OPT,186 Main Road,Darnall,Sheffield,,,S9 5HQ,Tel: 0114 244 1187, - ,,,No ratings yet Rate it yourself - /Services/opticians/LeaveReview/DefaultView.aspx?id=OP_5EQ_12144__000001_S95HQ,0,0,
Eyecare-Optical,,OPT,,197-199 Main Road,,Sheffield ,,S9 5HP,, - ,,,N/A - Data not available,,,
Eyecare-Optical,,OPT,,197-199 Main Road,,Sheffield ,,S9 5HP,Tel: 01142434584, - ,,,N/A - Data not available,,,