Organisation Name,NACS Code,Organisation Type,Address1,Address2,Address3,Address4,Address5,PostCode,Telephone Number,Opening time,Value  (Opening time),Banding Classification  (Opening time),NHS.UK users rating,Value  (NHS.UK users rating),Banding Classification  (NHS.UK users rating),Car parking (Is there car parking at this organisation?)
Forsight,OP_5G6_14841__000002_GU179AA,OPT,2 Kings Parade,42 London Road,Blackwater,,,GU17 9AA,Tel: 01276 34053, - ,,,No ratings yet Rate it yourself - /Services/opticians/LeaveReview/DefaultView.aspx?id=OP_5G6_14841__000002_GU179AA,0,0,
Medical Eye Centre,GU17 9AA__000003_GU179AA,OPT,White Hart Parade,,Blackwater,Hampshire,,GU17 9AA,, - ,,,No ratings yet Rate it yourself - /Services/opticians/LeaveReview/DefaultView.aspx?id=GU17 9AA__000003_GU179AA,0,0,
Vision Express,OP_5G2_7146__000001_GU470FD,OPT,Tesco Extra,The Meadows,Marshall Road,Sandhurst,Berkshire,GU47 0FD,Tel: 0125 229 8186, - ,,,No ratings yet Rate it yourself - /Services/opticians/LeaveReview/DefaultView.aspx?id=OP_5G2_7146__000001_GU470FD,0,0,
Healthcall Optical Services,OP_GU470UR_46762,OPT,,108 Harvard Road,Owlsmoor,Sandhurst,Berkshire,GU47 0UR,Tel: 01962 609011, - ,,,No ratings yet Rate it yourself - /Services/opticians/LeaveReview/DefaultView.aspx?id=OP_GU470UR_46762,0,0,
Norman Prince Crowthorne Opticians,J7N9X,OPT,,85 Church Street,,Crowthorne,Berkshire,RG45 7AW,Tel: 01344 772062, - ,,,No ratings yet Rate it yourself - /Services/opticians/LeaveReview/DefaultView.aspx?id=J7N9X,0,0,
Boots-Camberley - Obelisk Way,OP_5L7_3761__000002_GU153SD,OPT,26-30 Obelisk Way,,,Camberley,Surrey,GU15 3SD,Tel: 01276 670393, - ,,,No ratings yet Rate it yourself - /Services/opticians/LeaveReview/DefaultView.aspx?id=OP_5L7_3761__000002_GU153SD,0,0,
Specsavers Opticians,OP_5L7_3649__000001_GU153SP,OPT,3 Princess Way,,Camberley,,,GU15 3SP,Tel: 01276 677 686, - ,,,No ratings yet Rate it yourself - /Services/opticians/LeaveReview/DefaultView.aspx?id=OP_5L7_3649__000001_GU153SP,0,0,
Boots-Camberley - Grace Reynolds Walk,OP_5L7_12539__000001_GU153SN,OPT,1B Grace Reynolds Walk,Main Square,,Camberley,,GU15 3SN,Tel: 01276 25880, - ,,,No ratings yet Rate it yourself - /Services/opticians/LeaveReview/DefaultView.aspx?id=OP_5L7_12539__000001_GU153SN,0,0,
Bayfields Opticians,OP_5L7_4702__000001_GU153QU,OPT,1b High Street,,Camberley,Camberley,,GU15 3QU,Tel: 01276 21791, - ,,,No ratings yet Rate it yourself - /Services/opticians/LeaveReview/DefaultView.aspx?id=OP_5L7_4702__000001_GU153QU,0,0,
Leightons Opticians & Hearing Care,OP_5L7_11292__000001_GU153RS,OPT,,62 High Street,,Camberley,Surrey,GU15 3RS,Tel: 01276 23648, - ,,,No ratings yet Rate it yourself - /Services/opticians/LeaveReview/DefaultView.aspx?id=OP_5L7_11292__000001_GU153RS,0,0,
Vision Express Camberley,E0W2O,OPT,,36 High Street,,Camberley,Surrey,GU15 3RS,Tel: 01276670222, - ,,,No ratings yet Rate it yourself - /Services/opticians/LeaveReview/DefaultView.aspx?id=E0W2O,0,0,
Insight Opticians,OP_5L7_13115__000001_GU165HJ,OPT,,21 Frimley High Street,Frimley,Camberley,Surrey,GU16 7HJ,Tel: 01276 627 44, - ,,,No ratings yet Rate it yourself - /Services/opticians/LeaveReview/DefaultView.aspx?id=OP_5L7_13115__000001_GU165HJ,0,0,Data not available
Boots-Frimley,OP_5L7_5111__000002_GU165HY,OPT,4 The Parade,,High Street,Frimley,,GU16 7HY,Tel: 01276 62656, - ,,,No ratings yet Rate it yourself - /Services/opticians/LeaveReview/DefaultView.aspx?id=OP_5L7_5111__000002_GU165HY,0,0,
Leightons Opticians & Hearing Care,OP_5G6_8593__000001_GU147NY,OPT,20 Victoria Road,.,Farnborough,.,,GU14 7NY,Tel: 01252 545666, - ,,,No ratings yet Rate it yourself - /Services/opticians/LeaveReview/DefaultView.aspx?id=OP_5G6_8593__000001_GU147NY,0,0,
Brian Craig Eyecare Ltd,GU14 7NY__000002_GU147NY,OPT,20 Victoria Road,,Farnborough,Hampshire,,GU14 7NY,, - ,,,No ratings yet Rate it yourself - /Services/opticians/LeaveReview/DefaultView.aspx?id=GU14 7NY__000002_GU147NY,0,0,
Specsavers,OP_5G6_5949__000002_GU146YA,OPT,Princes Mead Centre,,,Farnborough,,GU14 6YA,Tel: 01252 370 498, - ,,,No ratings yet Rate it yourself - /Services/opticians/LeaveReview/DefaultView.aspx?id=OP_5G6_5949__000002_GU146YA,0,0,
ASDA Opticians,OP_5G6_14839__000002_GU147LT,OPT,Asda Stores Ltd,West Meade,Farnborough,Hampshire,,GU14 7LT,Tel: 01252 557292, - ,,,No ratings yet Rate it yourself - /Services/opticians/LeaveReview/DefaultView.aspx?id=OP_5G6_14839__000002_GU147LT,0,0,
Speccies,GU14 7RL__000001_GU147RL,OPT,71 Queens Mead,,Farnborough,Hants,,GU14 7RL,Tel: 01252 373008, - ,,,No ratings yet Rate it yourself - /Services/opticians/LeaveReview/DefaultView.aspx?id=GU14 7RL__000001_GU147RL,0,0,
Boots-Farnborough,OP_5G6_5035__000001_GU147RZ,OPT,87-91 Queensmead,,,Farnborough,Hampshire,GU14 7RZ,Tel: 01252 549100, - ,,,No ratings yet Rate it yourself - /Services/opticians/LeaveReview/DefaultView.aspx?id=OP_5G6_5035__000001_GU147RZ,0,0,
Specsavers,OP_5G6_12127__000001_GU513PQ,OPT,231 Fleet Road,,Fleet,Hampshire,,GU51 4BN,Tel: 01252 815 275, - ,,,No ratings yet Rate it yourself - /Services/opticians/LeaveReview/DefaultView.aspx?id=OP_5G6_12127__000001_GU513PQ,0,0,
Leightons Opticians & Hearing Care,OP_5G6_14843__000001_GU514BE,OPT,,168b Fleet Road,,Fleet,Hampshire,GU51 4BE,Tel: 01252 617753, - ,,,No ratings yet Rate it yourself - /Services/opticians/LeaveReview/DefaultView.aspx?id=OP_5G6_14843__000001_GU514BE,0,0,
Boots-Fleet,OP_5G6_5230__000002_GU513LA,OPT,Unit 23,Hart Shopping Centre,Fleet Road,Fleet,Hampshire,GU51 3LA,Tel: 01252 629 259, - ,,,No ratings yet Rate it yourself - /Services/opticians/LeaveReview/DefaultView.aspx?id=OP_5G6_5230__000002_GU513LA,0,0,
John Harwood Optometrist,OP_5G6_13202__000002_GU513PQ,OPT,202 Fleet Road,,Fleet,Hampshire,,GU51 4BY,Tel: 01252 613733, - ,,,No ratings yet Rate it yourself - /Services/opticians/LeaveReview/DefaultView.aspx?id=OP_5G6_13202__000002_GU513PQ,0,0,
Costco Wholesale UK Ltd,CO-1833-8,OPT,,Templar Avenue,,Farnborough,,GU14 6FE,Tel: 01252 896 945, - ,,,No ratings yet Rate it yourself - /Services/opticians/LeaveReview/DefaultView.aspx?id=CO-1833-8,0,0,
Brown & White (Opticians) Ltd,OP_5G6_5186__000001_GU513BU,OPT,341 Fleet Road,,Fleet,,,GU51 3NT,Tel: 01252 616830, - ,,,No ratings yet Rate it yourself - /Services/opticians/LeaveReview/DefaultView.aspx?id=OP_5G6_5186__000001_GU513BU,0,0,
the eye people,OP_5DN_5493__000002_RG401XJ,OPT,,the eye people,22 Market Place,Wokingham,Berkshire,RG40 1AP,Tel: 0118 978 9311, - ,,,No ratings yet Rate it yourself - /Services/opticians/LeaveReview/DefaultView.aspx?id=OP_5DN_5493__000002_RG401XJ,0,0,
Specsavers Opticians,OP_RG401AL_85779,OPT,,18 Market Place,,Wokingham,Berkshire,RG40 1AL,Tel: 0118 978 3525, - ,,,No ratings yet Rate it yourself - /Services/opticians/LeaveReview/DefaultView.aspx?id=OP_RG401AL_85779,0,0,
Leightons Opticians & Hearing Care,OP_RG401XJ_85767,OPT,,15 Peach Street,,Wokingham,Berkshire,RG40 1XJ,Tel: 0118 9786 744, - ,,,No ratings yet Rate it yourself - /Services/opticians/LeaveReview/DefaultView.aspx?id=OP_RG401XJ_85767,0,0,
Boots-Wokingham,OP_5DN_11548__000001_RG401XS,OPT,41 Market Place,,Wokingham,Wokingham,Berkshire,RG40 1AT,Tel: 01189796392, - ,,,No ratings yet Rate it yourself - /Services/opticians/LeaveReview/DefaultView.aspx?id=OP_5DN_11548__000001_RG401XS,0,0,
Vision Express (UK) Ltd,OP_5DN_10002__000002_RG401XZ,OPT,4 Old Row Court,Rose Street,Wokingham,Berkshire,,RG40 1XZ,Tel: 0118 978 0937, - ,,,No ratings yet Rate it yourself - /Services/opticians/LeaveReview/DefaultView.aspx?id=OP_5DN_10002__000002_RG401XZ,0,0,
Village Eye Clinic,TP8GH,OPT,,33 High Street,,Bagshot,Surrey,GU19 5AF,Tel: 01276 785123, - ,,,No ratings yet Rate it yourself - /Services/opticians/LeaveReview/DefaultView.aspx?id=TP8GH,0,0,
Vision Express,TP8HJ,OPT,The Lexicon,26 Braccan Walk,,Bracknell,Berkshire,RG12 1EN,Tel: 01344 304217, - ,,,No ratings yet Rate it yourself - /Services/opticians/LeaveReview/DefaultView.aspx?id=TP8HJ,0,0,
Insight Opticians,OP_5G2_8738__000002_RG121LS,OPT,15b Princess Square,,Bracknell,,,RG12 1LS,Tel: 01344 454965, - ,,,No ratings yet Rate it yourself - /Services/opticians/LeaveReview/DefaultView.aspx?id=OP_5G2_8738__000002_RG121LS,0,0,
Specsavers Optician,OP_5G2_6225__000001_RG121DE,OPT,18 Princess Square,,Bracknell,,,RG12 1LS,Tel: 01344 303344, - ,,,No ratings yet Rate it yourself - /Services/opticians/LeaveReview/DefaultView.aspx?id=OP_5G2_6225__000001_RG121DE,0,0,
Specsavers,OP_5G6_3553__000001_GU111EG,OPT,25 Union Street,,Aldershot,Hampshire,,GU11 1EG,Tel: 01252 345 556, - ,,,No ratings yet Rate it yourself - /Services/opticians/LeaveReview/DefaultView.aspx?id=OP_5G6_3553__000001_GU111EG,0,0,
Boots Opticians,TP6A2,OPT,,The Lexicon,19-23 Braccan Walk,Bracknell,Berkshire,RG12 1BE,Tel: 01344 420933, - ,,,No ratings yet Rate it yourself - /Services/opticians/LeaveReview/DefaultView.aspx?id=TP6A2,0,0,
McGregor & Hull Eye Care Centre,OP_5G6_14840__000001_GU111DX,OPT,3 Wellington Street,Aldershot,Hampshire,,,GU11 1DX,Tel: 01252 661162, - ,,,No ratings yet Rate it yourself - /Services/opticians/LeaveReview/DefaultView.aspx?id=OP_5G6_14840__000001_GU111DX,0,0,
Optisave,OP_5G6_14844__000004_GU111DB,OPT,26-27 The Galleries,,Aldershot,Hampshire,,GU11 1DB,Tel: 01252 319234, - ,,,No ratings yet Rate it yourself - /Services/opticians/LeaveReview/DefaultView.aspx?id=OP_5G6_14844__000004_GU111DB,0,0,
Vision Express,OP_5G6_1652__000003_GU111DB,OPT,13a Wellington Centre,,Aldershot,Hampshire,,GU11 1DB,Tel: 01252 323491, - ,,,No ratings yet Rate it yourself - /Services/opticians/LeaveReview/DefaultView.aspx?id=OP_5G6_1652__000003_GU111DB,0,0,
Brian Craig Eyecare Ltd,OP_5G6_14842__000001_GU111HT,OPT,44 Station Road,Aldershot,,Hampshire,,GU11 1HT,Tel: 01252 324048, - ,,,No ratings yet Rate it yourself - /Services/opticians/LeaveReview/DefaultView.aspx?id=OP_5G6_14842__000001_GU111HT,0,0,
Optical Centre,OP_5L7_8334__000002_GU125AZ,OPT,5 The Parade,Wharf Road,Ash Vale,,,GU12 5AZ,Tel: 01252 314 332, - ,,,No ratings yet Rate it yourself - /Services/opticians/LeaveReview/DefaultView.aspx?id=OP_5L7_8334__000002_GU125AZ,0,0,
Brown & White (Opticians) Ltd,OP_5G6_7713__000001_RG279DJ,OPT,Bourne House,London Road,,Hook,Hampshire,RG27 9DJ,Tel: 01256 763016, - ,,,No ratings yet Rate it yourself - /Services/opticians/LeaveReview/DefaultView.aspx?id=OP_5G6_7713__000001_RG279DJ,0,0,
The Opticians,OP_5G6_9543__000001_RG291LA,OPT,,113a High Street,,Odiham,Hampshire,RG29 1LA,Tel: 01256 703707, - ,,,No ratings yet Rate it yourself - /Services/opticians/LeaveReview/DefaultView.aspx?id=OP_5G6_9543__000001_RG291LA,0,0,
Norman Prince Ascot Opticians,B8A0O,OPT,,1 Hermitage Parade,,Ascot,Berkshire,SL5 7HE,Tel: 01344 625511, - ,,,No ratings yet Rate it yourself - /Services/opticians/LeaveReview/DefaultView.aspx?id=B8A0O,0,0,
Boots-Ascot,OP_5G2_12866__000001_RG121LS,OPT,,61 High Street,,Ascot,Berkshire,SL5 7HP,Tel: 01344 622913, - ,,,No ratings yet Rate it yourself - /Services/opticians/LeaveReview/DefaultView.aspx?id=OP_5G2_12866__000001_RG121LS,0,0,
Stephen Abery Opticians,OP_5DN_8100__000001_RG67HD,OPT,,46 Gipsy Lane,Reading,Earley,Buckinghamshire,RG6 7HD,Tel: 0118 935 1975, - ,,,No ratings yet Rate it yourself - /Services/opticians/LeaveReview/DefaultView.aspx?id=OP_5DN_8100__000001_RG67HD,0,0,
ASDA Stores Ltd,OP_RG65TT_85766,OPT,,Lower Earley District Centre,,READING,,RG6 5TT,Tel: 01189 870 320, - ,,,No ratings yet Rate it yourself - /Services/opticians/LeaveReview/DefaultView.aspx?id=OP_RG65TT_85766,0,0,
Bayfield's Opticians and Audiologists (Sunninghill and Ascot) ,L8T5A ,OPT,,7 High Street,,Ascot,,SL5 9NQ,, - ,,,No ratings yet Rate it yourself - /Services/opticians/LeaveReview/DefaultView.aspx?id=L8T5A,0,0,
Optisave,OP_5L5_14614__000001_GU97TX,OPT,13 Woolmead,Farnham,Surrey,,,GU9 7TX,Tel: 01252 717 655, - ,,,No ratings yet Rate it yourself - /Services/opticians/LeaveReview/DefaultView.aspx?id=OP_5L5_14614__000001_GU97TX,0,0,
The Optical Studio,OP_5L5_14611__000001_GU97LL,OPT,,19 Lion and Lamb Yard,Farnham,Surrey,,GU9 7LL,Tel: 01252 717 717, - ,,,No ratings yet Rate it yourself - /Services/opticians/LeaveReview/DefaultView.aspx?id=OP_5L5_14611__000001_GU97LL,0,0,
Boots-Farnham,OP_5L5_3466__000002_GU97NW,OPT,30 The Borough,,,Farnham,Surrey,GU9 7NW,Tel: 01252 715 540, - ,,,No ratings yet Rate it yourself - /Services/opticians/LeaveReview/DefaultView.aspx?id=OP_5L5_3466__000002_GU97NW,0,0,
Specsavers,OP_5L5_14615__000004_GU97HH,OPT,119 West Street,Farnham,Surrey,,,GU9 7HH,Tel: 01252 727 737, - ,,,No ratings yet Rate it yourself - /Services/opticians/LeaveReview/DefaultView.aspx?id=OP_5L5_14615__000004_GU97HH,0,0,
C.E. Hall Opticians,OP_5L5_14612__000003_GU97HH,OPT,111 West Street,,,Farnham,Surrey,GU9 7HH,Tel: 01252 713 785, - ,,,No ratings yet Rate it yourself - /Services/opticians/LeaveReview/DefaultView.aspx?id=OP_5L5_14612__000003_GU97HH,0,0,
Bartlett & Austin,OP_5L5_14605__000001_GU97DN,OPT,9 West Street,Farnham,,Surrey,,GU9 7DN,Tel: 01252 715 728, - ,,,No ratings yet Rate it yourself - /Services/opticians/LeaveReview/DefaultView.aspx?id=OP_5L5_14605__000001_GU97DN,0,0,
Leightons Opticians & Hearing Care,OP_5L5_7999__000001_GU97PH,OPT,,46 Downing Street,,Farnham,Surrey,GU9 7PH,Tel: 01252 711 369, - ,,,No ratings yet Rate it yourself - /Services/opticians/LeaveReview/DefaultView.aspx?id=OP_5L5_7999__000001_GU97PH,0,0,
Penny & Hayter,OP_5L7_10130__000001_GU212PS,OPT,3 Albion Parade,High Street,Woking,,,GU21 2PS,Tel: 01483 475 205, - ,,,No ratings yet Rate it yourself - /Services/opticians/LeaveReview/DefaultView.aspx?id=OP_5L7_10130__000001_GU212PS,0,0,
Specsavers Opticians,OP_RG28HA_85773,OPT,,"203 - 205 Shinfield Road,",,"Earley, Reading",,RG2 8HA,, - ,,,No ratings yet Rate it yourself - /Services/opticians/LeaveReview/DefaultView.aspx?id=OP_RG28HA_85773,0,0,
Chobham Eye Clinic,Y8Z7R,OPT,,24 High Street,,Chobham,,GU24 8AA,Tel: 01276 932884, - ,,,No ratings yet Rate it yourself - /Services/opticians/LeaveReview/DefaultView.aspx?id=Y8Z7R,0,0,
Leightons Opticians & Hearing Care,OP_5DN_6941__000002_RG53JH,OPT,,124 Crockhamwell Road,Woodley,Reading,Berkshire,RG5 3JH,Tel: 0118 969 1139, - ,,,No ratings yet Rate it yourself - /Services/opticians/LeaveReview/DefaultView.aspx?id=OP_5DN_6941__000002_RG53JH,0,0,
Specsavers Opticians,OP_RG53JH_85780,OPT,,176 Crockhamwell Road,,Woodley,,RG5 3JH,, - ,,,No ratings yet Rate it yourself - /Services/opticians/LeaveReview/DefaultView.aspx?id=OP_RG53JH_85780,0,0,
Costco,OP_RG26UE_85770,OPT,,"100 South Oak Way, Green Park",,Reading,,RG2 6UE,, - ,,,No ratings yet Rate it yourself - /Services/opticians/LeaveReview/DefaultView.aspx?id=OP_RG26UE_85770,0,0,
Vision Express (UK) Ltd,OP_5DN_1223__000001_RG109DN,OPT,7 Church Street,Twyford,Reading,Berkshire,,RG10 9DN,Tel: 0118 934 5566, - ,,,No ratings yet Rate it yourself - /Services/opticians/LeaveReview/DefaultView.aspx?id=OP_5DN_1223__000001_RG109DN,0,0,
D & R Kirk Opticians,OP_RG20EG_85771,OPT,D & R Kirk Opticians,47 Whitley Street,,READING,Berkshire,RG2 0EG,Tel: 0118 9871020, - ,,,No ratings yet Rate it yourself - /Services/opticians/LeaveReview/DefaultView.aspx?id=OP_RG20EG_85771,0,0,
Batemans Opticians,OP_5L7_12343__000001_GU215AG,OPT,55 Commercial Way,,Woking,,,GU21 3HN,Tel: 01483 760770, - ,,,No ratings yet Rate it yourself - /Services/opticians/LeaveReview/DefaultView.aspx?id=OP_5L7_12343__000001_GU215AG,0,0,
Opticial Express,OP_12345_RG1 4BP,OPT,"Lower Ground, Havell House",62-66 Queens Road,,Reading,Berkshire,RG1 4BP,Tel: 0800 023 2020, - ,,,No ratings yet Rate it yourself - /Services/opticians/LeaveReview/DefaultView.aspx?id=OP_12345_RG1 4BP,0,0,
Optical Express,,OPT,,Havell House,,Reading,,RG1 4BP,, - ,,,N/A - Data not available,,,
Vision Express,OP_RG18DF_85776,OPT,,"Tesco Express, Napier Road",,Reading,,RG1 8DF,, - ,,,No ratings yet Rate it yourself - /Services/opticians/LeaveReview/DefaultView.aspx?id=OP_RG18DF_85776,0,0,
Vision Express (UK) Ltd,OP_5DL_2333__000003_RG12AH,OPT,"5a, Town Mall Walk, Upper Ground Level",The Oracle Centre,Reading,,,RG1 2AH,Tel: 0118 950 4504, - ,,,No ratings yet Rate it yourself - /Services/opticians/LeaveReview/DefaultView.aspx?id=OP_5DL_2333__000003_RG12AH,0,0,
Boots-Reading - Oracle Centre (in Boots UK),OP_5DL_1822__000002_RG12AH,OPT,Unit 5 Upper Ground Level,The Oracle Centre,,Reading,Berkshire,RG1 2AH,Tel: 0118 958 9783, - ,,,No ratings yet Rate it yourself - /Services/opticians/LeaveReview/DefaultView.aspx?id=OP_5DL_1822__000002_RG12AH,0,0,
Leightons Opticians & Hearing Care,OP_5DL_8141__000001_RG17UJ,OPT,,12-14 Queen Victoria Street,,Reading,Berkshire,RG1 1TG,Tel: 0118 959 0055, - ,,,No ratings yet Rate it yourself - /Services/opticians/LeaveReview/DefaultView.aspx?id=OP_5DL_8141__000001_RG17UJ,0,0,
Specsavers Opticians,OP_RG12AA_85781,OPT,,45 Broad Street,,Reading,,RG1 2AA,, - ,,,No ratings yet Rate it yourself - /Services/opticians/LeaveReview/DefaultView.aspx?id=OP_RG12AA_85781,0,0,
Eyesite Opticians,OP_5DL_297__000001_RG11EP,OPT,142 Friar Street,,,Reading,Berkshire,RG1 1EX,Tel: 0118 950 9098, - ,,,No ratings yet Rate it yourself - /Services/opticians/LeaveReview/DefaultView.aspx?id=OP_5DL_297__000001_RG11EP,0,0,
Vision Express ,OP_5L7_6926__000001_GU211GD,OPT,,46 Wolsey Walk,,Woking,Surrey,GU2 6GH,Tel: 01483 767 141, - ,,,No ratings yet Rate it yourself - /Services/opticians/LeaveReview/DefaultView.aspx?id=OP_5L7_6926__000001_GU211GD,0,0,
Boots Opticians Woking ,OP_5L7_6031__000002_GU211YA,OPT,1-9 Commercial Way,"10 Wolsey Walk, Wolsey Place Shopping Centre",,Woking,Surrey,GU21 6XU,Tel: 01483 761640, - ,,,No ratings yet Rate it yourself - /Services/opticians/LeaveReview/DefaultView.aspx?id=OP_5L7_6031__000002_GU211YA,0,0,
Specsavers Opticians,OP_5L7_375__000001_GU211XS,OPT,,17-19 Wolsey Walk,Wolsey Place Shopping Centre,Woking,Surrey,GU21 6XU,Tel: 01483 767 170, - ,,,No ratings yet Rate it yourself - /Services/opticians/LeaveReview/DefaultView.aspx?id=OP_5L7_375__000001_GU211XS,0,0,
Thomas H. Collison Ltd,OP_5L5_9284__000001_GU25XX,OPT,The Royal Surrey County Hospital,Egerton Road,,Guildford,Surrey,GU2 5XX,Tel: 01483 571122 (ext. 2144), - ,,,No ratings yet Rate it yourself - /Services/opticians/LeaveReview/DefaultView.aspx?id=OP_5L5_9284__000001_GU25XX,0,0,
Dollond & Aitchison,OP_5L7_3550__000001_GU211XX,OPT,35 Wolsey Walk,,Woking,,,GU21 6YH,Tel: 01483 761 495, - ,,,No ratings yet Rate it yourself - /Services/opticians/LeaveReview/DefaultView.aspx?id=OP_5L7_3550__000001_GU211XX,0,0,
Bayfields Opticians,OP_5L7_9872__000001_GU211XU,OPT,,35 Commercial Way,,Woking,,GU21 6XR,Tel: 01483 766 800, - ,,,No ratings yet Rate it yourself - /Services/opticians/LeaveReview/DefaultView.aspx?id=OP_5L7_9872__000001_GU211XU,0,0,
Tesco Opticians,654321__000001_RG248BE,OPT,District Shopping Centre,Chineham,,Basingstoke,,RG24 8BE,Tel: 0345 601 3479, - ,,,No ratings yet Rate it yourself - /Services/opticians/LeaveReview/DefaultView.aspx?id=654321__000001_RG248BE,0,0,
Chineham Centre Opticians,OP_5DF_11440__000002_RG248BQ,OPT,17 Chineham Shopping Centre,Chineham,,Basingstoke,,RG24 8BQ,Tel: 01256 327564, - ,,,No ratings yet Rate it yourself - /Services/opticians/LeaveReview/DefaultView.aspx?id=OP_5DF_11440__000002_RG248BQ,0,0,
Home Care Optician,OP_RG46PH_46763,OPT,,4 Highbridge Close,Caversham Park Village,Reading,Berkshire,RG4 6PH,Tel: 07909 335211, - ,,,No ratings yet Rate it yourself - /Services/opticians/LeaveReview/DefaultView.aspx?id=OP_RG46PH_46763,0,0,
Robin James Opticians Ltd,OP_5DL_844__000002_RG48AU,OPT,44 Church Street,Caversham,Reading,,,RG4 8AU,Tel: 0118 947 2099, - ,,,No ratings yet Rate it yourself - /Services/opticians/LeaveReview/DefaultView.aspx?id=OP_5DL_844__000002_RG48AU,0,0,
The Optical Studio,OPT_GU254DW_1,OPT,,13 Station Approach,,Virginia Water,,GU25 4DW,Tel: 01344 849077, - ,,,No ratings yet Rate it yourself - /Services/opticians/LeaveReview/DefaultView.aspx?id=OPT_GU254DW_1,0,0,
Vision Express,OP_RG301AH_85777,OPT,,"Tesco Express, Portman Road",,Reading,,RG30 1AH,, - ,,,No ratings yet Rate it yourself - /Services/opticians/LeaveReview/DefaultView.aspx?id=OP_RG301AH_85777,0,0,
Asda Opticians,OPT_GU21 5SE,OPT,,Forsyth Road,,Sheerwater,,GU21 5SE,Tel: 01483220 955, - ,,,No ratings yet Rate it yourself - /Services/opticians/LeaveReview/DefaultView.aspx?id=OPT_GU21 5SE,0,0,
Asda Stores Ltd,OPT_GU215SE_1,OPT,Asda Opticians,Forsyth Road,,"Sheerwater, Woking",Surrey,GU21 5SE,Tel: 01483 702700, - ,,,No ratings yet Rate it yourself - /Services/opticians/LeaveReview/DefaultView.aspx?id=OPT_GU215SE_1,0,0,
Specsavers Opticians,OP_5L5_8367__000001_GU14EH,OPT,23 Friary Street,,,Guildford,,GU1 4EH,Tel: 01483 452 225, - ,,,No ratings yet Rate it yourself - /Services/opticians/LeaveReview/DefaultView.aspx?id=OP_5L5_8367__000001_GU14EH,0,0,
Englefield Green Opticians,OP_TW200QX_34400,OPT,,44 Victoria Street,,Engelfield Green,,TW20 0QX,Tel: 01784 432818, - ,,,No ratings yet Rate it yourself - /Services/opticians/LeaveReview/DefaultView.aspx?id=OP_TW200QX_34400,0,0,
Vision Express (UK) Ltd,OP_5L5_719__000002_GU13DY,OPT,51 High Street,,,Guildford,,GU1 3DY,Tel: 01483 300 344, - ,,,No ratings yet Rate it yourself - /Services/opticians/LeaveReview/DefaultView.aspx?id=OP_5L5_719__000002_GU13DY,0,0,
Bayfields Opticians,OP_5L5_4821__000001_GU13DY,OPT,37 High Street,,Guildford,Guildford,,GU1 3DY,Tel: 01483 575 650, - ,,,No ratings yet Rate it yourself - /Services/opticians/LeaveReview/DefaultView.aspx?id=OP_5L5_4821__000001_GU13DY,0,0,
Boots Optician Ltd,OPT_GU14EQ_1,OPT,,22-24 Swan Lane,,Guildford,Surrey,GU1 4EQ,Tel: 01483 573637, - ,,,No ratings yet Rate it yourself - /Services/opticians/LeaveReview/DefaultView.aspx?id=OPT_GU14EQ_1,0,0,
Boots-Guildford - Swan Lane,OP_5L5_629__000001_GU14EQ,OPT,22-24 Swan Lane,,,Guildford,Surrey,GU1 4EQ,Tel: 01483 573637, - ,,,No ratings yet Rate it yourself - /Services/opticians/LeaveReview/DefaultView.aspx?id=OP_5L5_629__000001_GU14EQ,0,0,
David Clulow Opticians,OP_GU13DP_89449,OPT,,103 High Street,,Guildford,,GU1 3DP,Tel: 01483 453339, - ,,,No ratings yet Rate it yourself - /Services/opticians/LeaveReview/DefaultView.aspx?id=OP_GU13DP_89449,0,0,
Dollond & Aitchison,OP_5L5_7322__000001_GU13HE,OPT,94 High Street,,Guildford,,,GU1 3HE,Tel: 01483 570 093, - ,,,No ratings yet Rate it yourself - /Services/opticians/LeaveReview/DefaultView.aspx?id=OP_5L5_7322__000001_GU13HE,0,0,
Optical Express,GU1 3EZ_11111,OPT,"Suite 3, 1 Milkhouse gate",,,Guildford,Surrey,GU1 3EZ,Tel: 0800 023 2020, - ,,,No ratings yet Rate it yourself - /Services/opticians/LeaveReview/DefaultView.aspx?id=GU1 3EZ_11111,0,0,
Batemans (Opticians) Ltd,OP_5L5_2184__000001_GU13HN,OPT,162 High Street,,Guildford,,,GU1 3HN,Tel: 01483 572 953, - ,,,No ratings yet Rate it yourself - /Services/opticians/LeaveReview/DefaultView.aspx?id=OP_5L5_2184__000001_GU13HN,0,0,
Nicklins Opticians,OP_5L5_9270__000001_GU13JB,OPT,216 High Street,,,Guildford,,GU1 3JB,Tel: 01483 561 256, - ,,,No ratings yet Rate it yourself - /Services/opticians/LeaveReview/DefaultView.aspx?id=OP_5L5_9270__000001_GU13JB,0,0,
Community Eye Care,OP_5L5_3088__000001_GU236EW,OPT,"Suite A, Astra",Vicarage Lane,"Send, Woking",Surrey,,GU23 7JN,Tel: 01483 224914, - ,,,No ratings yet Rate it yourself - /Services/opticians/LeaveReview/DefaultView.aspx?id=OP_5L5_3088__000001_GU236EW,0,0,
David Clulow Opticians,OP_5DF_8373__000001_RG217JY,OPT,25 Mayfair House,25 Mayfair House,,Basingstoke,Hampshire,RG21 7JY,Tel: 01256 332113, - ,,,No ratings yet Rate it yourself - /Services/opticians/LeaveReview/DefaultView.aspx?id=OP_5DF_8373__000001_RG217JY,0,0,
Buyspecs Direct,OPT_RG211NX_1,OPT,,"Yard House, May Place",,Basingstoke,,RG21 1NX,, - ,,,No ratings yet Rate it yourself - /Services/opticians/LeaveReview/DefaultView.aspx?id=OPT_RG211NX_1,0,0,