Organisation Name,NACS Code,Organisation Type,Address1,Address2,Address3,Address4,Address5,PostCode,Telephone Number,Opening time,Value  (Opening time),Banding Classification  (Opening time),NHS.UK users rating,Value  (NHS.UK users rating),Banding Classification  (NHS.UK users rating),Car parking (Is there car parking at this organisation?)
Specsavers ,OP_5C2_13799__000001_RM95AN,OPT,249 Heathway,,Dagenham,Essex,,RM9 5AN,Tel: 020 8596 9998, - ,,,No ratings yet Rate it yourself - /Services/opticians/LeaveReview/DefaultView.aspx?id=OP_5C2_13799__000001_RM95AN,0,0,
Heathway Eyecare,OP_5C2_9798__000002_RM95AQ,OPT,295 Heathway,,Dagenham,,,RM9 5AQ,Tel: 020 8592 2309, - ,,,No ratings yet Rate it yourself - /Services/opticians/LeaveReview/DefaultView.aspx?id=OP_5C2_9798__000002_RM95AQ,0,0,
"Morgan, Henry",OP_5C2_12068__000001_RM108QU,OPT,276 Heathway,,Dagenham,Essex,,RM10 8QU,Tel: 020 8592 1033, - ,,,No ratings yet Rate it yourself - /Services/opticians/LeaveReview/DefaultView.aspx?id=OP_5C2_12068__000001_RM108QU,0,0,
Asda Opticians,OP_5C2__000002_RM96SJ,OPT,Merrielands Crescent,*,,Dagenham,Essex,RM9 6SJ,Tel: 0208 5965372, - ,,,No ratings yet Rate it yourself - /Services/opticians/LeaveReview/DefaultView.aspx?id=OP_5C2__000002_RM96SJ,0,0,
Care Optics,OPT_RM94TR_1,OPT,,527a Gale Street,,London,,RM9 4TR,, - ,,,No ratings yet Rate it yourself - /Services/opticians/LeaveReview/DefaultView.aspx?id=OPT_RM94TR_1,0,0,
Shiva Optician Ltd,TP4CT,OPT,,433 Becontree Avenue,,Dagenham,,RM8 3UH,, - ,,,No ratings yet Rate it yourself - /Services/opticians/LeaveReview/DefaultView.aspx?id=TP4CT,0,0,
Care Optics,OPT_IG110NY_4,OPT,,3 Farr Avenue,,London,,IG11 0NY,, - ,,,No ratings yet Rate it yourself - /Services/opticians/LeaveReview/DefaultView.aspx?id=OPT_IG110NY_4,0,0,
OPT A VISION,OP_5NA45713__000005_RM81XU,OPT,14 Rowallen Parade,Dagenham,London,,,RM8 1XU,Tel: 020 8590 1333, - ,,,No ratings yet Rate it yourself - /Services/opticians/LeaveReview/DefaultView.aspx?id=OP_5NA45713__000005_RM81XU,0,0,
Dawsons Opticians (R Stewart),OP_5C2_7675__000001_RM64BE,OPT,1 Station Road,Chadwell Heath,Romford,,,RM6 4BE,Tel: 020 8590 1748, - ,,,No ratings yet Rate it yourself - /Services/opticians/LeaveReview/DefaultView.aspx?id=OP_5C2_7675__000001_RM64BE,0,0,
Tesco Opticians Rainham,RM13 9YZ,OPT,,"Bridge Road, Rainham",,Essex,,RM13 9YZ,, - ,,,No ratings yet Rate it yourself - /Services/opticians/LeaveReview/DefaultView.aspx?id=RM13 9YZ,0,0,
J H PETERS,OP_5NA45707__000001_RM66LU,OPT,192 High Road,Romford,Essex,,,RM6 6LU,Tel: 020 8590 7590, - ,,,No ratings yet Rate it yourself - /Services/opticians/LeaveReview/DefaultView.aspx?id=OP_5NA45707__000001_RM66LU,0,0,
J I PARTRIDGE,OP_5NA45708__000001_RM64AD,OPT,1106 High Road,Chadwell Heath,London,,,RM6 4AD,Tel: 020 8590 1762, - ,,,No ratings yet Rate it yourself - /Services/opticians/LeaveReview/DefaultView.aspx?id=OP_5NA45708__000001_RM64AD,0,0,
Aves Opticians,OP_5A4_13772__000001_RM139Y,OPT,24 The Broadway,Rainham,Essex,,,RM13 9YW,Tel: 01708 555606, - ,,,No ratings yet Rate it yourself - /Services/opticians/LeaveReview/DefaultView.aspx?id=OP_5A4_13772__000001_RM139Y,0,0,
Peters J H,OP_52C__000001_RM64LU,OPT,192 High Road,Chadwell Heath,Dagenham,Essex,,RM6 4LU,, - ,,,No ratings yet Rate it yourself - /Services/opticians/LeaveReview/DefaultView.aspx?id=OP_52C__000001_RM64LU,0,0,
Nasir Opticians,OP_5C2_13777__000001_RM109R,OPT,2-3 Station Parade,Elm Park,,Hornchurch,Essex,RM12 5AB,Tel: 020 8593 0328, - ,,,No ratings yet Rate it yourself - /Services/opticians/LeaveReview/DefaultView.aspx?id=OP_5C2_13777__000001_RM109R,0,0,
RAJ OPTICIANS ,OP_5NA45714__000001_IG39UR,OPT,1 RAVENINGS PARADE,39 GOODMAYES ROAD,GOODMAYES,ILFORD,Essex,IG3 9NR,Tel: 0208 590 2739, - ,,,No ratings yet Rate it yourself - /Services/opticians/LeaveReview/DefaultView.aspx?id=OP_5NA45714__000001_IG39UR,0,0,
Eye Clinic,OP_5A4_13123__000001_RM124RN,OPT,35 The Broadway,Elm Park,,Hornchurch,Essex,RM12 4RN,Tel: 01708 447012, - ,,,No ratings yet Rate it yourself - /Services/opticians/LeaveReview/DefaultView.aspx?id=OP_5A4_13123__000001_RM124RN,0,0,
VISITING OPTICIAN (MR J SINGH),10040__000001_IG12TF,OPT,295 Mortlake Road,Ilford,Essex,,,IG1 2TF,, - ,,,No ratings yet Rate it yourself - /Services/opticians/LeaveReview/DefaultView.aspx?id=10040__000001_IG12TF,0,0,
Downes Eyecare,5NA 6080,OPT,,608 High Road,Seven Kings,Ilford,Essex,IG3 8RF,Tel: 020 8590 2710, - ,,,No ratings yet Rate it yourself - /Services/opticians/LeaveReview/DefaultView.aspx?id=5NA 6080,0,0,
Home Eye Care (DOM),5LA_OPT_17__000007_IG38RG,OPT,627d  Southend Road,Ilford,Essex,,,IG3 8RG,Tel: 0208 590 6666, - ,,,No ratings yet Rate it yourself - /Services/opticians/LeaveReview/DefaultView.aspx?id=5LA_OPT_17__000007_IG38RG,0,0,
EYE GEE LTD,OP_5NA45700__000002_IG38RA,OPT,651 High Street,Seven Kings,London,,,IG3 8RA,Tel: 0208 599 0033, - ,,,No ratings yet Rate it yourself - /Services/opticians/LeaveReview/DefaultView.aspx?id=OP_5NA45700__000002_IG38RA,0,0,
L Dollay,OP_5A8_766__000001_SE288RA,OPT,4a Joyce Dawson Way,,Thamesmead,London,,SE28 8RA,Tel: 020 8311 8711, - ,,,No ratings yet Rate it yourself - /Services/opticians/LeaveReview/DefaultView.aspx?id=OP_5A8_766__000001_SE288RA,0,0,
Spectacle World,OP_5C2_13780__000001_IG118D,OPT,30 Vicarage  Field Shopping Centre,Ripple Road,Barking,,,IG11 8DQ,Tel: 020 8591 4555, - ,,,No ratings yet Rate it yourself - /Services/opticians/LeaveReview/DefaultView.aspx?id=OP_5C2_13780__000001_IG118D,0,0,
Aves Opticians,OP_5C2_4090__000001_IG117PG,OPT,50 Ripple Road,,Barking,,,IG11 7PG,Tel: 020 8594 2714, - ,,,No ratings yet Rate it yourself - /Services/opticians/LeaveReview/DefaultView.aspx?id=OP_5C2_4090__000001_IG117PG,0,0,
Thamesmead Eye Care,S6U6P,OPT,,Wm Morrison Supermarkets,Twin Tumps Way,London,,SE28 8RD,Tel: 0208 310 0420, - ,,,No ratings yet Rate it yourself - /Services/opticians/LeaveReview/DefaultView.aspx?id=S6U6P,0,0,
Aquila Revolution,OP_5C2_13250__000001_IG118EJ,OPT,65 East Street,,,Barking,,IG11 8EJ,Tel: 020 8594 4692, - ,,,No ratings yet Rate it yourself - /Services/opticians/LeaveReview/DefaultView.aspx?id=OP_5C2_13250__000001_IG118EJ,0,0,
SPECSAVERS,OPT_IG118EJ_1,OPT,,45 East Street,,Barking,,IG11 8EJ,Tel: 0208 591 9611, - ,,,No ratings yet Rate it yourself - /Services/opticians/LeaveReview/DefaultView.aspx?id=OPT_IG118EJ_1,0,0,
Asda Opticians,OPT_IG11 8AA,OPT,,"London Road, Barking",,Essex,,IG11 8AA,Tel: 0203 770 1902, - ,,,No ratings yet Rate it yourself - /Services/opticians/LeaveReview/DefaultView.aspx?id=OPT_IG11 8AA,0,0,
Specsavers,OP_5A4_417__000001_RM11RX,OPT,90 South Street,,Romford,,,RM1 1RX,Tel: 01708 724475, - ,,,No ratings yet Rate it yourself - /Services/opticians/LeaveReview/DefaultView.aspx?id=OP_5A4_417__000001_RM11RX,0,0,
Boots-Romford - Stewards Walk,RM1 3RJ_19288,OPT,,16 Stewards Walk,,Romford,Essex,RM1 3RJ,Tel: 01708 741 312, - ,,,No ratings yet Rate it yourself - /Services/opticians/LeaveReview/DefaultView.aspx?id=RM1 3RJ_19288,0,0,
Boots-Romford - The Liberty,OP_5A4_11825__000002_RM13RL,OPT,12 The Liberty,,,Romford,Essex,RM1 3RL,Tel: 01708 725334, - ,,,No ratings yet Rate it yourself - /Services/opticians/LeaveReview/DefaultView.aspx?id=OP_5A4_11825__000002_RM13RL,0,0,
"Muskett, W. (N. Cox)",OP_5A4_13776__000002_RM11DL,OPT,108 North Street,,Romford,,,RM1 1DL,Tel: 01708 749589, - ,,,No ratings yet Rate it yourself - /Services/opticians/LeaveReview/DefaultView.aspx?id=OP_5A4_13776__000002_RM11DL,0,0,
Vision Express (UK) Ltd,OP_5A4_6734__000001_RM13EE,OPT,"Unit 17, Liberty 2",Mercury Gardens,Romford,,,RM1 3EE,Tel: 01708 731616, - ,,,No ratings yet Rate it yourself - /Services/opticians/LeaveReview/DefaultView.aspx?id=OP_5A4_6734__000001_RM13EE,0,0,
EYES-RITE OPTICIANS,OP_5NA45702__000001_IG12RU,OPT,207 Ilford Lane,Ilford Essex,London,,,IG1 2RU,Tel: 0208 478  5799, - ,,,No ratings yet Rate it yourself - /Services/opticians/LeaveReview/DefaultView.aspx?id=OP_5NA45702__000001_IG12RU,0,0,
Aves Opticians,OP_5A4_7090__000002_RM126LL,OPT,211 Station Lane,,Hornchurch,,,RM12 6LL,Tel: 01708 452295, - ,,,No ratings yet Rate it yourself - /Services/opticians/LeaveReview/DefaultView.aspx?id=OP_5A4_7090__000002_RM126LL,0,0,
Elite Vision,OP_5NA45696__000001_IG11LX,OPT,221 High Road,221 High Road,London,Ilford,,IG1 1LX,Tel: 0208 9118885, - ,,,No ratings yet Rate it yourself - /Services/opticians/LeaveReview/DefaultView.aspx?id=OP_5NA45696__000001_IG11LX,0,0,
BOOTS,OP_5C5_14664__000001_E67SD,OPT,Unit 15,Galleons Reach,Becton,,,E6 7FD,Tel: 020 7474 9674, - ,,,No ratings yet Rate it yourself - /Services/opticians/LeaveReview/DefaultView.aspx?id=OP_5C5_14664__000001_E67SD,0,0,
Roy Gill,OP_5A4_13770__000001_RM124U,OPT,96 High Street,Hornchurch,Essex,,,RM12 4UH,Tel: 01708 475623, - ,,,No ratings yet Rate it yourself - /Services/opticians/LeaveReview/DefaultView.aspx?id=OP_5A4_13770__000001_RM124U,0,0,
SPECSAVERS,OP_5NA45717__000001_IG11DS,OPT,92 High Road,Ilford,London,,,IG1 1DS,Tel: 020 8553 1122, - ,,,No ratings yet Rate it yourself - /Services/opticians/LeaveReview/DefaultView.aspx?id=OP_5NA45717__000001_IG11DS,0,0,
EYEWEAR CLINIC,OP_5NA45703__000001_IG11AS,OPT,Unit 49,"The Exchange, Ilford",London,,,IG1 1AS,Tel: 020 8478 2971, - ,,,No ratings yet Rate it yourself - /Services/opticians/LeaveReview/DefaultView.aspx?id=OP_5NA45703__000001_IG11AS,0,0,
VISION EXPRESS,OP_5NA45722__000002_IG11AS,OPT,The Exchange,Ilford,London,,,IG1 1AS,Tel: 0208 553 0505, - ,,,No ratings yet Rate it yourself - /Services/opticians/LeaveReview/DefaultView.aspx?id=OP_5NA45722__000002_IG11AS,0,0,
Boots-Ilford - High Rd (in Boots UK),OP_5NA45688__000002_IG11DE,OPT,177-185 High Road,,,Ilford,Essex,IG1 1DE,Tel: 0208 553 5776, - ,,,No ratings yet Rate it yourself - /Services/opticians/LeaveReview/DefaultView.aspx?id=OP_5NA45688__000002_IG11DE,0,0,
Specsavers Ltd,OP_5A4_14774__000002_RM113YD,OPT,139 High Street,Hornchurch,Essex,,,RM11 3YD,Tel: 01708 460170, - ,,,No ratings yet Rate it yourself - /Services/opticians/LeaveReview/DefaultView.aspx?id=OP_5A4_14774__000002_RM113YD,0,0,
Gill Eyecare Ltd,01/14123,OPT,,145 High Street,,Honrchurch,Essex,RM11 3YD,Tel: 01708 475623, - ,,,No ratings yet Rate it yourself - /Services/opticians/LeaveReview/DefaultView.aspx?id=01/14123,0,0,yes
Boots-Hornchurch - High St,OP_5A4_1321__000001_RM113YD,OPT,127-133 High Street,,,Hornchurch,Essex,RM11 3YD,Tel: 01708 440233, - ,,,No ratings yet Rate it yourself - /Services/opticians/LeaveReview/DefaultView.aspx?id=OP_5A4_1321__000001_RM113YD,0,0,
EYE CARE (LEWIS JACOBS),OP_5NA45699__000001_IG14DU,OPT,13 Cranbrook Road,Ilford,London,,,IG1 4DU,Tel: 020 8478 3767, - ,,,No ratings yet Rate it yourself - /Services/opticians/LeaveReview/DefaultView.aspx?id=OP_5NA45699__000001_IG14DU,0,0,
"GUPTA, MRS NP",10073__000004_IG14JT,OPT,17 Wellesley Road,,Ilford,,,IG1 4JT,Tel: 020 8554 1088, - ,,,No ratings yet Rate it yourself - /Services/opticians/LeaveReview/DefaultView.aspx?id=10073__000004_IG14JT,0,0,
AVES OPTICIANS,OP_5NA45684__000002_IG14JT,OPT,17 Wellesley Road,Ilford,London,,,IG1 4JT,Tel: 020 8551 1088, - ,,,No ratings yet Rate it yourself - /Services/opticians/LeaveReview/DefaultView.aspx?id=OP_5NA45684__000002_IG14JT,0,0,
The Outside Opticians ,OP_E62DZ_30657,OPT,,160 Lathom Road,,"East Ham, London",,E6 2DZ,Tel: 020 8177 5877, - ,,,No ratings yet Rate it yourself - /Services/opticians/LeaveReview/DefaultView.aspx?id=OP_E62DZ_30657,0,0,
W Johnston,OP_5AX_14680__000001_DA175JN,OPT,63 Nuxley Road,,Upper Belvedere,Kent,,DA17 5JN,Tel: 01322 432868, - ,,,No ratings yet Rate it yourself - /Services/opticians/LeaveReview/DefaultView.aspx?id=OP_5AX_14680__000001_DA175JN,0,0,
NEIL GORDON OPTICIANS,OP_5C5_2626__000001_E62HP,OPT,113 High Street North,Eastham,London,,,E6 2HP,Tel: 0208 4717707, - ,,,No ratings yet Rate it yourself - /Services/opticians/LeaveReview/DefaultView.aspx?id=OP_5C5_2626__000001_E62HP,0,0,
Eye Clinic Opticians,5C5-20074,OPT,,62 High Street North,,East Ham,,E6 2HJ,Tel: 020 85860200, - ,,,No ratings yet Rate it yourself - /Services/opticians/LeaveReview/DefaultView.aspx?id=5C5-20074,0,0,
Boots-London - East Ham,OP_5C5_1761__000004_E62HT,OPT,114 High Street North,,,London,,E6 2HT,Tel: 0208 472 3720, - ,,,No ratings yet Rate it yourself - /Services/opticians/LeaveReview/DefaultView.aspx?id=OP_5C5_1761__000004_E62HT,0,0,
Optical World,OP_5C5_14555__000003_E62HT,OPT,62 High Street North,Eastham,London,London,,E6 2HT,Tel: 020 8586 0200, - ,,,No ratings yet Rate it yourself - /Services/opticians/LeaveReview/DefaultView.aspx?id=OP_5C5_14555__000003_E62HT,0,0,
SPECSAVERS OPTICIANS,OP_5C5_378__000002_E61HS,OPT,43 High Street North,Eastham,London,,,E6 2JD,Tel: 020 8470 0800, - ,,,No ratings yet Rate it yourself - /Services/opticians/LeaveReview/DefaultView.aspx?id=OP_5C5_378__000002_E61HS,0,0,
Eye Deal Spectacles Limited,CO-3845,OPT,,108 De Vere Gardens,,Ilford,,IG1 3EE,, - ,,,No ratings yet Rate it yourself - /Services/opticians/LeaveReview/DefaultView.aspx?id=CO-3845,0,0,
Eye Deal Spectacles Limited,OPT_IG13EE_8,OPT,,108 De Vere Gardens,,Ilford,,IG1 3EE,, - ,,,No ratings yet Rate it yourself - /Services/opticians/LeaveReview/DefaultView.aspx?id=OPT_IG13EE_8,0,0,
Eye Deal Spectacles Limited,OPT_IG13EE_7,OPT,,108 De Vere Gardens,,Ilford,,IG1 3EE,, - ,,,No ratings yet Rate it yourself - /Services/opticians/LeaveReview/DefaultView.aspx?id=OPT_IG13EE_7,0,0,
Eye Deal Spectacles Limited,OPT_IG13EE_6,OPT,,108 De Vere Gardens,,Ilford,,IG1 3EE,, - ,,,No ratings yet Rate it yourself - /Services/opticians/LeaveReview/DefaultView.aspx?id=OPT_IG13EE_6,0,0,
Eye Deal Spectacles Limited,OPT_IG13EE_1,OPT,,108 De Vere Gardens,,Ilford,,IG1 3EE,, - ,,,No ratings yet Rate it yourself - /Services/opticians/LeaveReview/DefaultView.aspx?id=OPT_IG13EE_1,0,0,
Eye Deal Spectacles Limited,OPT_IG13EE_3,OPT,,108 De Vere Gardens,,Ilford,,IG1 3EE,, - ,,,No ratings yet Rate it yourself - /Services/opticians/LeaveReview/DefaultView.aspx?id=OPT_IG13EE_3,0,0,
Eye Deal Spectacles Limited,OPT_IG13EE_2,OPT,,108 De Vere Gardens,,Ilford,Essex,IG1 3EE,Tel: 02085548400, - ,,,No ratings yet Rate it yourself - /Services/opticians/LeaveReview/DefaultView.aspx?id=OPT_IG13EE_2,0,0,
Eye Deal Spectacles Limited,OPT_IG13EE_4,OPT,,108 De Vere Gardens,,Ilford,,IG1 3EE,, - ,,,No ratings yet Rate it yourself - /Services/opticians/LeaveReview/DefaultView.aspx?id=OPT_IG13EE_4,0,0,
Eye Deal Spectacles Limited,OPT_IG13EE_5,OPT,,108 De Vere Gardens,,Ilford,,IG1 3EE,, - ,,,No ratings yet Rate it yourself - /Services/opticians/LeaveReview/DefaultView.aspx?id=OPT_IG13EE_5,0,0,
ELITE VISION LTD,OL29145C5__000003_E126SA,OPT,230 High Street North,Manor Park,London,,,E12 6SA,Tel: 020 8471 2277, - ,,,No ratings yet Rate it yourself - /Services/opticians/LeaveReview/DefaultView.aspx?id=OL29145C5__000003_E126SA,0,0,
Asda Vision,OP_5C5_14665__000002_E64JP,OPT,Asda Store,Tollgate Road,,London,,E6 4JP,Tel: 0207 5402952, - ,,,No ratings yet Rate it yourself - /Services/opticians/LeaveReview/DefaultView.aspx?id=OP_5C5_14665__000002_E64JP,0,0,
"Debney, K. Opticians",OP_5A4_4835__000002_RM53PR,OPT,16 Chase Cross Road,Collier Row,Romford,,,RM5 3PR,Tel: 01708 737448, - ,,,No ratings yet Rate it yourself - /Services/opticians/LeaveReview/DefaultView.aspx?id=OP_5A4_4835__000002_RM53PR,0,0,
A M Fletcher Opticians,CO 3580 - 5A4__000001_RM26ND,OPT,Links Avenue,Gidea Park,,Romford,Essex,RM2 6ND,Tel: 01708 742297, - ,,,No ratings yet Rate it yourself - /Services/opticians/LeaveReview/DefaultView.aspx?id=CO 3580 - 5A4__000001_RM26ND,0,0,
MOBELEYES LTD,30000__000002_IG26LE,OPT,747 Cranbrook Road,Gants Hill,Essex,,,IG2 6LE,Tel: 0208 518 3769, - ,,,No ratings yet Rate it yourself - /Services/opticians/LeaveReview/DefaultView.aspx?id=30000__000002_IG26LE,0,0,
HOWARD HARRIS,OP_5NA45706__000001_IG26LE,OPT,474 Cranbrook Road,Gants Hill,Ilford,Essex,,IG2 6LE,Tel: 020 8518 3666, - ,,,No ratings yet Rate it yourself - /Services/opticians/LeaveReview/DefaultView.aspx?id=OP_5NA45706__000001_IG26LE,0,0,
Lais Opticians,OP_5C5_14558__000001_E125AQ,OPT,622 Romford Road,Manor Park,London,London,,E12 5AQ,Tel: 020 8478 1631, - ,,,No ratings yet Rate it yourself - /Services/opticians/LeaveReview/DefaultView.aspx?id=OP_5C5_14558__000001_E125AQ,0,0,
K A Rowland ,OP_5A8_986__000002_SE181PP,OPT,2 Lakedale Road,,Plumstead,London,,SE18 1PP,Tel: 0208 854 2406, - ,,,No ratings yet Rate it yourself - /Services/opticians/LeaveReview/DefaultView.aspx?id=OP_5A8_986__000002_SE181PP,0,0,
ROSE OPTICAL SERVICE,10079__000004_IG26JU,OPT,48/50 Wayside Mews,,Ilford,,,IG2 6JU,Tel: 020 8551 7512, - ,,,No ratings yet Rate it yourself - /Services/opticians/LeaveReview/DefaultView.aspx?id=10079__000004_IG26JU,0,0,
ROSE OPTOMETRISTS,OP_5NA45716__000010_IG26JZ,OPT,583 Cranbrook Road,Gants Hill,London,,,IG2 6JZ,Tel: 020 8551 5353, - ,,,No ratings yet Rate it yourself - /Services/opticians/LeaveReview/DefaultView.aspx?id=OP_5NA45716__000010_IG26JZ,0,0,
M M Beg Opticians,OP_5AX_14694__000001_DA81RG,OPT,115 Erith High Street,,Erith,Kent,,DA8 1RG,Tel: 01322 342620, - ,,,No ratings yet Rate it yourself - /Services/opticians/LeaveReview/DefaultView.aspx?id=OP_5AX_14694__000001_DA81RG,0,0,
Boots-Barkingside - High St,OP_5NA45687__000001_IG62DF,OPT,10 High Street,Barkingside,London,London,Essex,IG6 2DF,Tel: 020 8550 7740, - ,,,No ratings yet Rate it yourself - /Services/opticians/LeaveReview/DefaultView.aspx?id=OP_5NA45687__000001_IG62DF,0,0,
ELLIS BASS OPTOMETRISTS,5NA_0121__000001_IG62AA,OPT,"Unit 4c, 3-19 High Street",Barkingside,Ilford,Essex,,IG6 2AA,Tel: 020 8550 9288, - ,,,No ratings yet Rate it yourself - /Services/opticians/LeaveReview/DefaultView.aspx?id=5NA_0121__000001_IG62AA,0,0,
SPECSAVERS,50000__000004_IG62AD,OPT,45 High Street,Barkingside,Essex,,,IG6 2AD,Tel: 0208 418 2480, - ,,,No ratings yet Rate it yourself - /Services/opticians/LeaveReview/DefaultView.aspx?id=50000__000004_IG62AD,0,0,
Boots-Barkingside - High St,OP_5NA45695__000001_IG62DR,OPT,90 High Street,Barkingside,London,London,Essex,IG6 2DR,Tel: 0208 550 2920, - ,,,No ratings yet Rate it yourself - /Services/opticians/LeaveReview/DefaultView.aspx?id=OP_5NA45695__000001_IG62DR,0,0,
Boots-Upminster,OP_5A4_4931__000001_RM142AP,OPT,7 Corbets Tey Road,,,Upminster,Essex,RM14 2AP,Tel: 01708 222 383, - ,,,No ratings yet Rate it yourself - /Services/opticians/LeaveReview/DefaultView.aspx?id=OP_5A4_4931__000001_RM142AP,0,0,
L Dollay ,OP_5AX_14678__000003_DA83EX,OPT,259 Bexley Road,Northumberland Heath,Erith,Kent,,DA8 3EX,Tel: 01322 359 507, - ,,,No ratings yet Rate it yourself - /Services/opticians/LeaveReview/DefaultView.aspx?id=OP_5AX_14678__000003_DA83EX,0,0,
James Read Opticians Ltd,OP_5A4_14773__000001_RM142S,OPT,36 Station Road,Upminster,,Essex,,RM14 2TR,Tel: 01708 221086, - ,,,No ratings yet Rate it yourself - /Services/opticians/LeaveReview/DefaultView.aspx?id=OP_5A4_14773__000001_RM142S,0,0,
BOLEYN EYE CENTRE,OP_5C5_1991__000002_E63BP,OPT,18 Barking Road,London,,,,E6 3BP,Tel: 020 8552 9077, - ,,,No ratings yet Rate it yourself - /Services/opticians/LeaveReview/DefaultView.aspx?id=OP_5C5_1991__000002_E63BP,0,0,
John Lewis Opticians ,OP_5A8_14710__000001_SE187BZ,OPT,13 Plumstead,,Woolwich,London,,SE18 7BZ,Tel: 0208 316 1121, - ,,,No ratings yet Rate it yourself - /Services/opticians/LeaveReview/DefaultView.aspx?id=OP_5A8_14710__000001_SE187BZ,0,0,
"Bahri, P.K.",OP_5A4_8118__000001_RM143BT,OPT,172 St. Marys Lane,,Upminster,,,RM14 3BT,Tel: 01708 228397, - ,,,No ratings yet Rate it yourself - /Services/opticians/LeaveReview/DefaultView.aspx?id=OP_5A4_8118__000001_RM143BT,0,0,
KA Rowland ,OP_5A8_10593__000001_SE186LF,OPT,8 Powis Street,,Woolwich,London,,SE18 6LF,Tel: 020 8854 8750, - ,,,No ratings yet Rate it yourself - /Services/opticians/LeaveReview/DefaultView.aspx?id=OP_5A8_10593__000001_SE186LF,0,0,
B Bansal,53342__000005_E61AD,OPT,23 Plashet Grove,,East Ham,London,,E6 1AD,Tel: 020 8470 1133, - ,,,No ratings yet Rate it yourself - /Services/opticians/LeaveReview/DefaultView.aspx?id=53342__000005_E61AD,0,0,
BEG OPTICIANS,OP_5C5_1668__000001_E61AD,OPT,13 Plashet Grove,London,,,,E6 1AD,Tel: 020 8472 8028, - ,,,No ratings yet Rate it yourself - /Services/opticians/LeaveReview/DefaultView.aspx?id=OP_5C5_1668__000001_E61AD,0,0,
"BANSAL, MR BHANO COLOURED CONTACT LENS",10092__000003_E61AD,OPT,25 Plashet Grove,East Ham,London,,,E6 1AD,, - ,,,No ratings yet Rate it yourself - /Services/opticians/LeaveReview/DefaultView.aspx?id=10092__000003_E61AD,0,0,
Specsavers Opticians,OP_5A8_5021__000001_SE186LQ,OPT,66 Powis Street,,Woolwich,London,,SE18 6LQ,Tel: 0208 316 1663, - ,,,No ratings yet Rate it yourself - /Services/opticians/LeaveReview/DefaultView.aspx?id=OP_5A8_5021__000001_SE186LQ,0,0,
Virtue Specs,V2H8A,OPT,,53 Powis Street,Woolwich,London,Greater London,SE18 6HZ,Tel: 02033027460, - ,,,No ratings yet Rate it yourself - /Services/opticians/LeaveReview/DefaultView.aspx?id=V2H8A,0,0,
The Chemist,OP_5A8_800__000001_SE186HZ,OPT,Boots the Chemist,12-16 Hare Street,Woolwich,London,,SE18 6NB,Tel: 02088542602, - ,,,No ratings yet Rate it yourself - /Services/opticians/LeaveReview/DefaultView.aspx?id=OP_5A8_800__000001_SE186HZ,0,0,
Paine & Hunter Optometrists,OP_5A8_10__000002_SE182NB,OPT,1 The Slade,Plumstead,London,,,SE18 2NB,Tel: 0208 3161040, - ,,,No ratings yet Rate it yourself - /Services/opticians/LeaveReview/DefaultView.aspx?id=OP_5A8_10__000002_SE182NB,0,0,
Eyeland Vision Care,OP_5C5_8384__000001_E139JJ,OPT,428 Green Street,Upton Park,London,London,,E13 9JJ,Tel: 020 8472 0593, - ,,,No ratings yet Rate it yourself - /Services/opticians/LeaveReview/DefaultView.aspx?id=OP_5C5_8384__000001_E139JJ,0,0,
Creed Optics Ltd,B9P6Z,OPT,,474 Katherine Road,,London,,E7 8PD,Tel: 02085481155, - ,,,No ratings yet Rate it yourself - /Services/opticians/LeaveReview/DefaultView.aspx?id=B9P6Z,0,0,
UPTON PARK EYECARE,OP_5C5_14666__000004_E139AP,OPT,"386-388harold Road, Off Green Street",Upton Park,London,,,E13 9AP,Tel: 020 8552 3001, - ,,,No ratings yet Rate it yourself - /Services/opticians/LeaveReview/DefaultView.aspx?id=OP_5C5_14666__000004_E139AP,0,0,
Coton & Hamblin Ltd,OP_5A8_1772__000001_SE186PQ,OPT,11 Wellington Street,Woolwich,London,,,SE18 6PQ,Tel: 020 8854 1491, - ,,,No ratings yet Rate it yourself - /Services/opticians/LeaveReview/DefaultView.aspx?id=OP_5A8_1772__000001_SE186PQ,0,0,
Super Optical,10091__000002_E78LQ,OPT,5 St. Stephens Parade,Green Street,London,London,,E7 8LQ,Tel: 020 8472 0949, - ,,,No ratings yet Rate it yourself - /Services/opticians/LeaveReview/DefaultView.aspx?id=10091__000002_E78LQ,0,0,
Romford Tesco Opticians,OP_5A4RTO__000002_RM30LL,OPT,Bryant Avenue,,Romford,Essex,,RM3 0LL,Tel: 0345 601 3479, - ,,,No ratings yet Rate it yourself - /Services/opticians/LeaveReview/DefaultView.aspx?id=OP_5A4RTO__000002_RM30LL,0,0,
Tesco Opticians,OP_SE186JR_85036,OPT,,13 Old Stable Row,,London,,SE18 6JR,Tel: 020 8787 5538, - ,,,No ratings yet Rate it yourself - /Services/opticians/LeaveReview/DefaultView.aspx?id=OP_SE186JR_85036,0,0,
Forest Gate Eye Clinic,OP_5PV_3711__000001_IG13PD,OPT,47 Woodford Road,,Forest Gate,London,,E7 8AB,Tel: 0208 181 9171, - ,,,No ratings yet Rate it yourself - /Services/opticians/LeaveReview/DefaultView.aspx?id=OP_5PV_3711__000001_IG13PD,0,0,
NEIL GORDON OPTICIANS,OP_5C5_14593__000001_E138RU,OPT,Newham University NHS Trust,Glen Road,Plaistow,,,E13 8SL,Tel: 020 7476 4000, - ,,,No ratings yet Rate it yourself - /Services/opticians/LeaveReview/DefaultView.aspx?id=OP_5C5_14593__000001_E138RU,0,0,
Specialeyes Eyecare Opticians,V2N2P,OPT,,Address  	100 GREEN ST,Shepherd’s Bush,London,,E7 8JG,Tel: 02087437552, - ,,,No ratings yet Rate it yourself - /Services/opticians/LeaveReview/DefaultView.aspx?id=V2N2P,0,0,
SCRIVENS,OP_5NA45715__000001_IG74DJ,OPT,191 Manford Way,Chigwell,,London,,IG7 4DJ,Tel: 020 8500 2304, - ,,,No ratings yet Rate it yourself - /Services/opticians/LeaveReview/DefaultView.aspx?id=OP_5NA45715__000001_IG74DJ,0,0,