Organisation Name,NACS Code,Organisation Type,Address1,Address2,Address3,Address4,Address5,PostCode,Telephone Number,Opening time,Value  (Opening time),Banding Classification  (Opening time),NHS.UK users rating,Value  (NHS.UK users rating),Banding Classification  (NHS.UK users rating),Car parking (Is there car parking at this organisation?)
Specsavers Opticians,OP_5AX_227__000001_DA67DQ,OPT,116a Broadway,Bexleyheath,Kent,,,DA6 7DQ,Tel: 0208 298 9920, - ,,,No ratings yet Rate it yourself - /Services/opticians/LeaveReview/DefaultView.aspx?id=OP_5AX_227__000001_DA67DQ,0,0,
Linklater Optometrists,OP_5AX_10048__000002_DA67DQ,OPT,Linklaters Optometrists,120 Broadway,Bexleyheath,Kent,,DA6 7DQ,Tel: 0208 303 4014, - ,,,3 ratings Rate it yourself - /Services/opticians/LeaveReview/DefaultView.aspx?id=OP_5AX_10048__000002_DA67DQ,,,no
Vision Express Ltd,OP_5AX_5408__000003_DA67JJ,OPT,5 The Mall,Broadway Shopping Centre,Bexleyheath,Kent,,DA6 7JJ,Tel: 0208 298 9629, - ,,,No ratings yet Rate it yourself - /Services/opticians/LeaveReview/DefaultView.aspx?id=OP_5AX_5408__000003_DA67JJ,0,0,
Boots-Bexleyheath,OP_5AX_10393__000002_DA67JJ,OPT,25 The Mall,Broadway Shopping Centre,Bexleyheath,Kent,,DA6 7JJ,Tel: 020 8301 5656, - ,,,1 rating Rate it yourself - /Services/opticians/LeaveReview/DefaultView.aspx?id=OP_5AX_10393__000002_DA67JJ,,,
Second Sight,OP_5AX_2062__000002_DA163PG,OPT,81 Welling High Street,,Welling,Kent,,DA16 1TY,Tel: 0208 301 4586, - ,,,1 rating Rate it yourself - /Services/opticians/LeaveReview/DefaultView.aspx?id=OP_5AX_2062__000002_DA163PG,,,
R F Linklater & Partners,OP_5AX_8989__000001_DA161TG,OPT,136 High Street,,Welling,Kent,,DA16 1TJ,Tel: 0208 303 4963, - ,,,1 rating Rate it yourself - /Services/opticians/LeaveReview/DefaultView.aspx?id=OP_5AX_8989__000001_DA161TG,,,
L Dollay ,OP_5AX_14678__000003_DA83EX,OPT,259 Bexley Road,Northumberland Heath,Erith,Kent,,DA8 3EX,Tel: 01322 359 507, - ,,,1 rating Rate it yourself - /Services/opticians/LeaveReview/DefaultView.aspx?id=OP_5AX_14678__000003_DA83EX,,,
Crayford Opticial Centre,OP_5AX_1701__000001_DA14ES,OPT,11a Crayford High Street,,Crayford,Kent,,DA1 4HH,Tel: 01322557700, - ,,,No ratings yet Rate it yourself - /Services/opticians/LeaveReview/DefaultView.aspx?id=OP_5AX_1701__000001_DA14ES,0,0,
S Gothelf & Associates,OP_5AX_10318__000001_DA159NB,OPT,10 Wellington Parade,,Sidcup,Kent,,DA15 9NB,Tel: 0208 303 3935, - ,,,2 ratings Rate it yourself - /Services/opticians/LeaveReview/DefaultView.aspx?id=OP_5AX_10318__000001_DA159NB,,,
Specsavers Crayford,G1O1G,OPT,Sainsbury's,Stadium Way,,Dartford,Kent,DA1 4HW,Tel: 01322 470662, - ,,,1 rating Rate it yourself - /Services/opticians/LeaveReview/DefaultView.aspx?id=G1O1G,,,
Steven Harris Opticians,OP_5AX_14681__000001_DA163PG,OPT,101 Bellegrove Road,,Welling,Kent,,DA16 3PG,Tel: 0208 304 2423, - ,,,No ratings yet Rate it yourself - /Services/opticians/LeaveReview/DefaultView.aspx?id=OP_5AX_14681__000001_DA163PG,0,0,
W Johnston,OP_5AX_14680__000001_DA175JN,OPT,63 Nuxley Road,,Upper Belvedere,Kent,,DA17 5JN,Tel: 01322 432868, - ,,,1 rating Rate it yourself - /Services/opticians/LeaveReview/DefaultView.aspx?id=OP_5AX_14680__000001_DA175JN,,,
M M Beg Opticians,OP_5AX_14694__000001_DA81RG,OPT,115 Erith High Street,,Erith,Kent,,DA8 1RG,Tel: 01322 342620, - ,,,2 ratings Rate it yourself - /Services/opticians/LeaveReview/DefaultView.aspx?id=OP_5AX_14694__000001_DA81RG,,,
Specsavers Opticians,OP_5AX_14708__000001_DA146ED,OPT,53 High Street,Sidcup,Kent,,,DA14 6ED,Tel: 0208 308 3500, - ,,,No ratings yet Rate it yourself - /Services/opticians/LeaveReview/DefaultView.aspx?id=OP_5AX_14708__000001_DA146ED,0,0,
Colletts Opticians Ltd,OP_5AX_2176__000001_DA146ND,OPT,103 Main Road,Sidcup,Kent,,,DA14 6ND,Tel: 0208 300 3222, - ,,,No ratings yet Rate it yourself - /Services/opticians/LeaveReview/DefaultView.aspx?id=OP_5AX_2176__000001_DA146ND,0,0,
Paine & Hunter Optometrists,OP_5A8_10__000002_SE182NB,OPT,1 The Slade,Plumstead,London,,,SE18 2NB,Tel: 0208 3161040, - ,,,No ratings yet Rate it yourself - /Services/opticians/LeaveReview/DefaultView.aspx?id=OP_5A8_10__000002_SE182NB,0,0,
K A Rowland ,OP_5A8_986__000002_SE181PP,OPT,2 Lakedale Road,,Plumstead,London,,SE18 1PP,Tel: 0208 854 2406, - ,,,No ratings yet Rate it yourself - /Services/opticians/LeaveReview/DefaultView.aspx?id=OP_5A8_986__000002_SE181PP,0,0,
Boots-Dartford - High St,OP_5CM_1268__000002_DA11BY,OPT,20 High Street,,,Dartford,Kent,DA1 1BY,Tel: 01322 223 007, - ,,,No ratings yet Rate it yourself - /Services/opticians/LeaveReview/DefaultView.aspx?id=OP_5CM_1268__000002_DA11BY,0,0,
Linklater Opticians ,OP_5CM_3977__000001_DA11HD,OPT,22 Lowfield Street,,Dartford,Dartford,,DA1 1HD,Tel: 01322 223113, - ,,,No ratings yet Rate it yourself - /Services/opticians/LeaveReview/DefaultView.aspx?id=OP_5CM_3977__000001_DA11HD,0,0,
Boots-Dartford - High St (in Boots UK),OP_5P9_3123__000003_DA11DE,OPT,48-52 High Street,,,Dartford,Kent,DA1 1DE,Tel: 01322 223935, - ,,,No ratings yet Rate it yourself - /Services/opticians/LeaveReview/DefaultView.aspx?id=OP_5P9_3123__000003_DA11DE,0,0,
Specsavers (Dartford),OP_5CM_11606__000002_DA11DE,OPT,54 High Street,,Dartford,Kent,,DA1 1DE,Tel: 01322 294040, - ,,,5 ratings Rate it yourself - /Services/opticians/LeaveReview/DefaultView.aspx?id=OP_5CM_11606__000002_DA11DE,,,
Paine & Hunter,OP_5A8_2738__000003_SE183SH,OPT,50 Herbert Road,,Plumstead,London,,SE18 3SH,Tel: 020 8316 1040, - ,,,No ratings yet Rate it yourself - /Services/opticians/LeaveReview/DefaultView.aspx?id=OP_5A8_2738__000003_SE183SH,0,0,
Specsavers Opticians,OP_5A8_9996__000001_SE91BJ,OPT,126 Eltham High Street,,Eltham,London,,SE9 1BJ,Tel: 020 8850 8800, - ,,,2 ratings Rate it yourself - /Services/opticians/LeaveReview/DefaultView.aspx?id=OP_5A8_9996__000001_SE91BJ,,,
Colletts Opticians Ltd,OP_5A8_5844__000001_SE95DA,OPT,43 Passey Place,Eltham,London,,,SE9 5DA,Tel: 020 8850 3415, - ,,,No ratings yet Rate it yourself - /Services/opticians/LeaveReview/DefaultView.aspx?id=OP_5A8_5844__000001_SE95DA,0,0,
Boots-London - Eltham,OP_5A8_14685__000001_SE91TD,OPT,93 Eltham High Street,,Eltham,London,,SE9 1TD,Tel: 0208 850 1783, - ,,,No ratings yet Rate it yourself - /Services/opticians/LeaveReview/DefaultView.aspx?id=OP_5A8_14685__000001_SE91TD,0,0,
L Dollay,OP_5A8_766__000001_SE288RA,OPT,4a Joyce Dawson Way,,Thamesmead,London,,SE28 8RA,Tel: 020 8311 8711, - ,,,No ratings yet Rate it yourself - /Services/opticians/LeaveReview/DefaultView.aspx?id=OP_5A8_766__000001_SE288RA,0,0,
Thamesmead Eye Care,S6U6P,OPT,,Wm Morrison Supermarkets,Twin Tumps Way,London,,SE28 8RD,Tel: 0208 310 0420, - ,,,No ratings yet Rate it yourself - /Services/opticians/LeaveReview/DefaultView.aspx?id=S6U6P,0,0,
John Lewis Opticians ,OP_5A8_14710__000001_SE187BZ,OPT,13 Plumstead,,Woolwich,London,,SE18 7BZ,Tel: 0208 316 1121, - ,,,12 ratings Rate it yourself - /Services/opticians/LeaveReview/DefaultView.aspx?id=OP_5A8_14710__000001_SE187BZ,,,
Tesco Opticians,OP_SE186JR_85036,OPT,,13 Old Stable Row,,London,,SE18 6JR,Tel: 020 8787 5538, - ,,,No ratings yet Rate it yourself - /Services/opticians/LeaveReview/DefaultView.aspx?id=OP_SE186JR_85036,0,0,
Coton & Hamblin Ltd,OP_5A8_1772__000001_SE186PQ,OPT,11 Wellington Street,Woolwich,London,,,SE18 6PQ,Tel: 020 8854 1491, - ,,,2 ratings Rate it yourself - /Services/opticians/LeaveReview/DefaultView.aspx?id=OP_5A8_1772__000001_SE186PQ,,,
KA Rowland ,OP_5A8_10593__000001_SE186LF,OPT,8 Powis Street,,Woolwich,London,,SE18 6LF,Tel: 020 8854 8750, - ,,,No ratings yet Rate it yourself - /Services/opticians/LeaveReview/DefaultView.aspx?id=OP_5A8_10593__000001_SE186LF,0,0,
Virtue Specs,V2H8A,OPT,,53 Powis Street,Woolwich,London,Greater London,SE18 6HZ,Tel: 02033027460, - ,,,No ratings yet Rate it yourself - /Services/opticians/LeaveReview/DefaultView.aspx?id=V2H8A,0,0,
Linklater & Warren Opticians,RL_04122014_CO-4763,OPT,,30a High Street,,Chislehurst,Kent,BR7 5AN,Tel: 020 8295 5131, - ,,,2 ratings Rate it yourself - /Services/opticians/LeaveReview/DefaultView.aspx?id=RL_04122014_CO-4763,,,no
Specsavers Opticians,OP_5A8_5021__000001_SE186LQ,OPT,66 Powis Street,,Woolwich,London,,SE18 6LQ,Tel: 0208 316 1663, - ,,,2 ratings Rate it yourself - /Services/opticians/LeaveReview/DefaultView.aspx?id=OP_5A8_5021__000001_SE186LQ,,,
The Chemist,OP_5A8_800__000001_SE186HZ,OPT,Boots the Chemist,12-16 Hare Street,Woolwich,London,,SE18 6NB,Tel: 02088542602, - ,,,1 rating Rate it yourself - /Services/opticians/LeaveReview/DefaultView.aspx?id=OP_5A8_800__000001_SE186HZ,,,
Oakmead Opticians,02991__000002_BR75LX,OPT,Sunnyways,Prince Imperial Way,Chislehurst,Kent,,BR7 5LX,, - ,,,1 rating Rate it yourself - /Services/opticians/LeaveReview/DefaultView.aspx?id=02991__000002_BR75LX,,,
Asda Opticians (Swanley),OPT_BR8 7UN,OPT,,London Road,,Swanley,,BR8 7UN,Tel: 01322 661963, - ,,,3 ratings Rate it yourself - /Services/opticians/LeaveReview/DefaultView.aspx?id=OPT_BR8 7UN,,,
Specsavers Opticians Swanley,OPT_BR87TQ_1,OPT,,Unit 39 The Shopping Centre,,Swanley,Kent,BR8 7TQ,Tel: 01322 614827, - ,,,1 rating Rate it yourself - /Services/opticians/LeaveReview/DefaultView.aspx?id=OPT_BR87TQ_1,,,
Robert Murrell incorporating Armstrong and North,W4X1M,OPT,,17 Swanley Centre,,Swanley,Kent,BR8 7TG,Tel: 01322 663231, - ,,,No ratings yet Rate it yourself - /Services/opticians/LeaveReview/DefaultView.aspx?id=W4X1M,0,0,
Brian Ashby Opticians Ltd,TP425,OPT,,"24 West Park, Mottingham",,London,,SE9 4RQ,Tel: 020 8851 7422, - ,,,No ratings yet Rate it yourself - /Services/opticians/LeaveReview/DefaultView.aspx?id=TP425,0,0,
Vision Express (UK) Limited,BR5 3RP__000001_BR53RP,OPT,"Unit 9,",Nugent Shopping Park,Orpington,Kent,,BR5 3RP,Tel: 01689 875737, - ,,,No ratings yet Rate it yourself - /Services/opticians/LeaveReview/DefaultView.aspx?id=BR5 3RP__000001_BR53RP,0,0,
Aves Opticians,OP_5A4_13772__000001_RM139Y,OPT,24 The Broadway,Rainham,Essex,,,RM13 9YW,Tel: 01708 555606, - ,,,No ratings yet Rate it yourself - /Services/opticians/LeaveReview/DefaultView.aspx?id=OP_5A4_13772__000001_RM139Y,0,0,
iCare Optical,OPT_SE78UD_1,OPT,,"16 The Village, Charlton",,London,,SE7 8UD,Tel: 020 8856 6034, - ,,,No ratings yet Rate it yourself - /Services/opticians/LeaveReview/DefaultView.aspx?id=OPT_SE78UD_1,0,0,
Optical Express,K5B4X,OPT,40 Lower Level,"Riverbridge House, Anchor Boulevard",,Dartford,Kent,DA2 6SL,Tel: 0800 023 2020, - ,,,No ratings yet Rate it yourself - /Services/opticians/LeaveReview/DefaultView.aspx?id=K5B4X,0,0,
Tesco Opticians Rainham,RM13 9YZ,OPT,,"Bridge Road, Rainham",,Essex,,RM13 9YZ,, - ,,,No ratings yet Rate it yourself - /Services/opticians/LeaveReview/DefaultView.aspx?id=RM13 9YZ,0,0,
Page & Small Opticians,OP_5A8_14683__000002_SE77ED,OPT,213 Charlton Road,,Charlton,London,,SE7 7ED,Tel: 0208 293 9493, - ,,,9 ratings Rate it yourself - /Services/opticians/LeaveReview/DefaultView.aspx?id=OP_5A8_14683__000002_SE77ED,,,yes
BOOTS,OP_5C5_14664__000001_E67SD,OPT,Unit 15,Galleons Reach,Becton,,,E6 7FD,Tel: 020 7474 9674, - ,,,No ratings yet Rate it yourself - /Services/opticians/LeaveReview/DefaultView.aspx?id=OP_5C5_14664__000001_E67SD,0,0,
Asda Opticians,OP_5C2__000002_RM96SJ,OPT,Merrielands Crescent,*,,Dagenham,Essex,RM9 6SJ,Tel: 0208 5965372, - ,,,1 rating Rate it yourself - /Services/opticians/LeaveReview/DefaultView.aspx?id=OP_5C2__000002_RM96SJ,,,
Care Optics,OPT_IG110NY_4,OPT,,3 Farr Avenue,,London,,IG11 0NY,, - ,,,1 rating Rate it yourself - /Services/opticians/LeaveReview/DefaultView.aspx?id=OPT_IG110NY_4,,,
Steven Harris Opticians,OP_5A7_831__000002_BR51NA,OPT,16 Station Square,Petts Wood,Orpington,Kent,,BR5 1NA,Tel: 01689 831726, - ,,,No ratings yet Rate it yourself - /Services/opticians/LeaveReview/DefaultView.aspx?id=OP_5A7_831__000002_BR51NA,0,0,
Blackheath Eyecare,OP_5A8_14675__000002_SE37BT,OPT,Blackheath Eyecare Opticians,16 Old Dover Road,Blackheath,London,,SE3 7BT,Tel: 0208 305 1060, - ,,,1 rating Rate it yourself - /Services/opticians/LeaveReview/DefaultView.aspx?id=OP_5A8_14675__000002_SE37BT,,,yes
Specsavers Charlton Riverside,OLC007115A8,OPT,,7-11 Gallions Road,,London,,SE7 7SA,, - ,,,1 rating Rate it yourself - /Services/opticians/LeaveReview/DefaultView.aspx?id=OLC007115A8,,,
Boots-Petts Wood,BR5 1DE__000001_BR51DE,OPT,12 Chatsworth Parade,,,Petts Wood,Kent,BR5 1DF,Tel: 01689 823 250, - ,,,No ratings yet Rate it yourself - /Services/opticians/LeaveReview/DefaultView.aspx?id=BR5 1DE__000001_BR51DE,0,0,
Asda Vision,OP_5C5_14665__000002_E64JP,OPT,Asda Store,Tollgate Road,,London,,E6 4JP,Tel: 0207 5402952, - ,,,No ratings yet Rate it yourself - /Services/opticians/LeaveReview/DefaultView.aspx?id=OP_5C5_14665__000002_E64JP,0,0,
Grove Park opticians,OP_5LF__000003_SE120EF,OPT,384 Baring Road,Grove Park,London,,,SE12 0EF,, - ,,,No ratings yet Rate it yourself - /Services/opticians/LeaveReview/DefaultView.aspx?id=OP_5LF__000003_SE120EF,0,0,
Coton & Hamblin Ltd,OP_5A8_14673__000002_SE37DH,OPT,178 Westcombe Hill,Blackheath,London,,,SE3 7DH,Tel: 0208 858 1858, - ,,,No ratings yet Rate it yourself - /Services/opticians/LeaveReview/DefaultView.aspx?id=OP_5A8_14673__000002_SE37DH,0,0,
David Clulow (Bluewater),OP_5CM_10603__000001_DA99SS,OPT,Unit 110 Upper Guild Hall,Bluewater,Greenhithe,Kent,,DA9 9SS,Tel: 01322 624915, - ,,,No ratings yet Rate it yourself - /Services/opticians/LeaveReview/DefaultView.aspx?id=OP_5CM_10603__000001_DA99SS,0,0,
Specsavers Opticians,BR6 0TW__000001_BR60TW,OPT,,175 High Street,,Orpington,Kent,BR6 0LW,Tel: 01689 890 168, - ,,,No ratings yet Rate it yourself - /Services/opticians/LeaveReview/DefaultView.aspx?id=BR6 0TW__000001_BR60TW,0,0,
Boots Opticians ,OP_5A7_6080__000002_BR60JN,OPT,194 High Street,,Orpington,,,BR6 0JN,Tel: 01689 891303, - ,,,No ratings yet Rate it yourself - /Services/opticians/LeaveReview/DefaultView.aspx?id=OP_5A7_6080__000002_BR60JN,0,0,
Boots-Bluewater Dartford,DA9 9SJ_98372,OPT,,"Unit MSU02, Lower Thames Walk",Bluewater Shopping Centre,Greenhithe,,DA9 9SJ,Tel: 01322624780, - ,,,No ratings yet Rate it yourself - /Services/opticians/LeaveReview/DefaultView.aspx?id=DA9 9SJ_98372,0,0,
John Lewis Opticians,OPT_DA99SA_1,OPT,,Bluewater,,Greenhithe,,DA9 9SA,, - ,,,No ratings yet Rate it yourself - /Services/opticians/LeaveReview/DefaultView.aspx?id=OPT_DA99SA_1,0,0,
Boots-Bromley - The Glades,OP_5A7_7470__000001_BR11DD,OPT,40 The Glades,,,Bromley,Kent,BR1 2QG,Tel: 0208 460 4944, - ,,,5 ratings Rate it yourself - /Services/opticians/LeaveReview/DefaultView.aspx?id=OP_5A7_7470__000001_BR11DD,,,
Vision Express (Bluewater),OP_5CM_1771__000001_DA99SP,OPT,Unit 14 Upper Rose Gallery,Bluewater,Greenhithe,Kent,,DA9 9SP,Tel: 01322 624814, - ,,,4 ratings Rate it yourself - /Services/opticians/LeaveReview/DefaultView.aspx?id=OP_5CM_1771__000001_DA99SP,,,
Boots-Orpington - High St,OP_5A7_10401__000002_BR60LS,OPT,232 High Street,,,Orpington,Kent,BR6 0LS,Tel: 01689 820 848, - ,,,No ratings yet Rate it yourself - /Services/opticians/LeaveReview/DefaultView.aspx?id=OP_5A7_10401__000002_BR60LS,0,0,
Boots Opticians (Bluewater),OP_5CM_972__000002_DA99BA,OPT,South Mall,Bluewater Shopping Centre,Greenhithe,Kent,,DA9 9BA,Tel: 01322 623854, - ,,,1 rating Rate it yourself - /Services/opticians/LeaveReview/DefaultView.aspx?id=OP_5CM_972__000002_DA99BA,,,
Infocus,Q4T1O,OPT,,13 Montpelier Vale,,Blackheath,,SE3 0TA,Tel: 020 8852 4406, - ,,,No ratings yet Rate it yourself - /Services/opticians/LeaveReview/DefaultView.aspx?id=Q4T1O,0,0,
Butcher Curnow Ophthalmic Opticians,OP_5LF_12480__000001_SE30BU,OPT,19 Tranquil Vale,,London,,,SE3 0BU,Tel: 020 8318 1732, - ,,,No ratings yet Rate it yourself - /Services/opticians/LeaveReview/DefaultView.aspx?id=OP_5LF_12480__000001_SE30BU,0,0,
Care Optics,OPT_RM94TR_1,OPT,,527a Gale Street,,London,,RM9 4TR,, - ,,,No ratings yet Rate it yourself - /Services/opticians/LeaveReview/DefaultView.aspx?id=OPT_RM94TR_1,0,0,
William J Wilkinson Limited,OP_5A7_470__000001_BR60PD,OPT,277 High Street,,Orpington,,,BR6 0NW,Tel: 01689 820866, - ,,,No ratings yet Rate it yourself - /Services/opticians/LeaveReview/DefaultView.aspx?id=OP_5A7_470__000001_BR60PD,0,0,
Specsavers ,OP_5C2_13799__000001_RM95AN,OPT,249 Heathway,,Dagenham,Essex,,RM9 5AN,Tel: 020 8596 9998, - ,,,No ratings yet Rate it yourself - /Services/opticians/LeaveReview/DefaultView.aspx?id=OP_5C2_13799__000001_RM95AN,0,0,
Tesco Opticians,5A7:15__000002_BR60NH,OPT,9 Augustus Lane,Orpington,Orpington,Kent,,BR6 0NH,, - ,,,No ratings yet Rate it yourself - /Services/opticians/LeaveReview/DefaultView.aspx?id=5A7:15__000002_BR60NH,0,0,
Asda Opticians (Greenhithe),00276__000002_DA99RE,OPT,Station Road,,Greenhithe,Kent,,DA9 9RE,Tel: 01322 374162, - ,,,4 ratings Rate it yourself - /Services/opticians/LeaveReview/DefaultView.aspx?id=00276__000002_DA99RE,,,
Heathway Eyecare,OP_5C2_9798__000002_RM95AQ,OPT,295 Heathway,,Dagenham,,,RM9 5AQ,Tel: 020 8592 2309, - ,,,2 ratings Rate it yourself - /Services/opticians/LeaveReview/DefaultView.aspx?id=OP_5C2_9798__000002_RM95AQ,,,
"Morgan, Henry",OP_5C2_12068__000001_RM108QU,OPT,276 Heathway,,Dagenham,Essex,,RM10 8QU,Tel: 020 8592 1033, - ,,,No ratings yet Rate it yourself - /Services/opticians/LeaveReview/DefaultView.aspx?id=OP_5C2_12068__000001_RM108QU,0,0,
Aves Opticians,OP_5C2_4090__000001_IG117PG,OPT,50 Ripple Road,,Barking,,,IG11 7PG,Tel: 020 8594 2714, - ,,,No ratings yet Rate it yourself - /Services/opticians/LeaveReview/DefaultView.aspx?id=OP_5C2_4090__000001_IG117PG,0,0,
Freeman Of Greenwich,OP_5A8_14682__000002_SE109EQ,OPT,205 Trafalgar Road,,Greenwich,London,,SE10 9EQ,Tel: 0208 858 2481, - ,,,3 ratings Rate it yourself - /Services/opticians/LeaveReview/DefaultView.aspx?id=OP_5A8_14682__000002_SE109EQ,,,
Tesco opticians,RM201TX211015,OPT,,Cygnet View,,West Thurrock,,RM20 1TX,, - ,,,No ratings yet Rate it yourself - /Services/opticians/LeaveReview/DefaultView.aspx?id=RM201TX211015,0,0,
Spectacle World,OP_5C2_13780__000001_IG118D,OPT,30 Vicarage  Field Shopping Centre,Ripple Road,Barking,,,IG11 8DQ,Tel: 020 8591 4555, - ,,,7 ratings Rate it yourself - /Services/opticians/LeaveReview/DefaultView.aspx?id=OP_5C2_13780__000001_IG118D,,,
Aquila Revolution,OP_5C2_13250__000001_IG118EJ,OPT,65 East Street,,,Barking,,IG11 8EJ,Tel: 020 8594 4692, - ,,,No ratings yet Rate it yourself - /Services/opticians/LeaveReview/DefaultView.aspx?id=OP_5C2_13250__000001_IG118EJ,0,0,
SPECSAVERS,OPT_IG118EJ_1,OPT,,45 East Street,,Barking,,IG11 8EJ,Tel: 0208 591 9611, - ,,,No ratings yet Rate it yourself - /Services/opticians/LeaveReview/DefaultView.aspx?id=OPT_IG118EJ_1,0,0,
Asda Opticians,OPT_IG11 8AA,OPT,,"London Road, Barking",,Essex,,IG11 8AA,Tel: 0203 770 1902, - ,,,No ratings yet Rate it yourself - /Services/opticians/LeaveReview/DefaultView.aspx?id=OPT_IG11 8AA,0,0,
Costco Wholesale UK Ltd,CO-1833-17,OPT,,West Thurrock Way,,West Thurrock,Essex,RM20 3WY,Tel: 01708 683 085, - ,,,1 rating Rate it yourself - /Services/opticians/LeaveReview/DefaultView.aspx?id=CO-1833-17,,,
The Bromley Eye Centre,2BR1 1DD__000003_BR11DD,OPT,"Unit 48, The Glades",,Bromley,Kent,,BR1 1DD,Tel: 020 8466 8333, - ,,,1 rating Rate it yourself - /Services/opticians/LeaveReview/DefaultView.aspx?id=2BR1 1DD__000003_BR11DD,,,
Vision Express (UK) Limited,OP_5A7_11781__000002_BR11DN,OPT,29 Glades Shopping Centre,High Street,Bromley,,,BR1 1DN,Tel: 020 8313 1545, - ,,,No ratings yet Rate it yourself - /Services/opticians/LeaveReview/DefaultView.aspx?id=OP_5A7_11781__000002_BR11DN,0,0,
Boots-West Thurrock,OP_5GQ_1608__000001_RM202ZQ,OPT,228 Thurrock,Lakeside Shopping Centre,,Grays,Essex,RM20 2ZQ,Tel: 01708 861534, - ,,,No ratings yet Rate it yourself - /Services/opticians/LeaveReview/DefaultView.aspx?id=OP_5GQ_1608__000001_RM202ZQ,0,0,
Vision Express (UK) Ltd,OP_5GQ_11510__000001_RM161ZF,OPT,9 Thurrock Lakeside Shopping Centre,West Thurrock,Grays,,,RM16 1ZF,Tel: 01708 860300, - ,,,No ratings yet Rate it yourself - /Services/opticians/LeaveReview/DefaultView.aspx?id=OP_5GQ_11510__000001_RM161ZF,0,0,
Opticial Express,OP_12345_RM20 2ZP,OPT,"Unit 230, Level 2",Lakeside Shopping Centre,,Thurrock,Essex,RM20 2ZP,Tel: 0800 023 2020, - ,,,No ratings yet Rate it yourself - /Services/opticians/LeaveReview/DefaultView.aspx?id=OP_12345_RM20 2ZP,0,0,
M&S Opticians,,OPT,,123 High Street,,Bromley,,BR1 1JL,Tel: 0203 0054415, - ,,,N/A - Data not available,,,
Specsavers Opticians,OP_5A7_1174__000003_BR11EY,OPT,146 High Street,,Bromley,,,BR1 1EZ,Tel: 020 8466 9666, - ,,,No ratings yet Rate it yourself - /Services/opticians/LeaveReview/DefaultView.aspx?id=OP_5A7_1174__000003_BR11EY,0,0,
Vision Express (UK) Ltd,OP_5GQ_13034__000001_RM202ZH,OPT,337 Thurrock Lakeside Shopping Centre,West Thurrock,Grays,,,RM20 2ZH,Tel: 01708 860300, - ,,,No ratings yet Rate it yourself - /Services/opticians/LeaveReview/DefaultView.aspx?id=OP_5GQ_13034__000001_RM202ZH,0,0,
Boots Opticians Ltd,OP_5GQ_1340__000001_RM202ZG,OPT,74-75 Thurrock Lakeside Shopping Centre,West Thurrock,Grays,,,RM20 2ZG,Tel: 01708 861534, - ,,,2 ratings Rate it yourself - /Services/opticians/LeaveReview/DefaultView.aspx?id=OP_5GQ_1340__000001_RM202ZG,,,
NEIL GORDON OPTICIANS,OP_5C5_14593__000001_E138RU,OPT,Newham University NHS Trust,Glen Road,Plaistow,,,E13 8SL,Tel: 020 7476 4000, - ,,,No ratings yet Rate it yourself - /Services/opticians/LeaveReview/DefaultView.aspx?id=OP_5C5_14593__000001_E138RU,0,0,
Glasses Lab,01-19725,OPT,,62 High Street,,Bromley,,BR1 1EG,Tel: 0208 466 1315, - ,,,No ratings yet Rate it yourself - /Services/opticians/LeaveReview/DefaultView.aspx?id=01-19725,0,0,
Eyeland Visioncare,OP_5LF_7832__000001_SE136AA,OPT,195 Lewisham High Street,,London,,,SE13 6AA,Tel: 020 8852 0761, - ,,,No ratings yet Rate it yourself - /Services/opticians/LeaveReview/DefaultView.aspx?id=OP_5LF_7832__000001_SE136AA,0,0,
William J Wilkinson Limited,OP_5A7_4486__000001_BR11EA,OPT,42 High Street,,Bromley,,,BR1 1EA,Tel: 020 8464 5347, - ,,,No ratings yet Rate it yourself - /Services/opticians/LeaveReview/DefaultView.aspx?id=OP_5A7_4486__000001_BR11EA,0,0,
NEIL GORDON OPTICIANS,OP_5C5_2626__000001_E62HP,OPT,113 High Street North,Eastham,London,,,E6 2HP,Tel: 0208 4717707, - ,,,2 ratings Rate it yourself - /Services/opticians/LeaveReview/DefaultView.aspx?id=OP_5C5_2626__000001_E62HP,,,
Specsavers Opticians,OP_5LF_8691__000001_SE136JL,OPT,174 Lewisham High Street,Lewisham,London,,,SE13 6JL,Tel: 020 8297 2777, - ,,,No ratings yet Rate it yourself - /Services/opticians/LeaveReview/DefaultView.aspx?id=OP_5LF_8691__000001_SE136JL,0,0,
Points Of View Opticians,OP_5LF_10152__000002_BR14PQ,OPT,495a Bromley Road,,Bromley,Kent,,BR1 4PQ,Tel: 020 8697 2321, - ,,,No ratings yet Rate it yourself - /Services/opticians/LeaveReview/DefaultView.aspx?id=OP_5LF_10152__000002_BR14PQ,0,0,
Vision Express (UK) Ltd,OP_5LF_12228__000001_SE137EP,OPT,Unit 39,The Lewisham Centre,Lewisham,,,SE13 7EP,Tel: 0208 318 7147, - ,,,No ratings yet Rate it yourself - /Services/opticians/LeaveReview/DefaultView.aspx?id=OP_5LF_12228__000001_SE137EP,0,0,
Eye Clinic Opticians,5C5-20074,OPT,,62 High Street North,,East Ham,,E6 2HJ,Tel: 020 85860200, - ,,,No ratings yet Rate it yourself - /Services/opticians/LeaveReview/DefaultView.aspx?id=5C5-20074,0,0,
The Outside Opticians ,OP_E62DZ_30657,OPT,,160 Lathom Road,,"East Ham, London",,E6 2DZ,Tel: 020 8177 5877, - ,,,No ratings yet Rate it yourself - /Services/opticians/LeaveReview/DefaultView.aspx?id=OP_E62DZ_30657,0,0,
BOLEYN EYE CENTRE,OP_5C5_1991__000002_E63BP,OPT,18 Barking Road,London,,,,E6 3BP,Tel: 020 8552 9077, - ,,,No ratings yet Rate it yourself - /Services/opticians/LeaveReview/DefaultView.aspx?id=OP_5C5_1991__000002_E63BP,0,0,
Optical World,OP_5C5_14555__000003_E62HT,OPT,62 High Street North,Eastham,London,London,,E6 2HT,Tel: 020 8586 0200, - ,,,No ratings yet Rate it yourself - /Services/opticians/LeaveReview/DefaultView.aspx?id=OP_5C5_14555__000003_E62HT,0,0,