Organisation Name,NACS Code,Organisation Type,Address1,Address2,Address3,Address4,Address5,PostCode,Telephone Number,Opening time,Value  (Opening time),Banding Classification  (Opening time),NHS.UK users rating,Value  (NHS.UK users rating),Banding Classification  (NHS.UK users rating),Car parking (Is there car parking at this organisation?)
Ewoma Aibangbee,OPT_DA118BZ_1,OPT,,"Gateway Medical Practice, Fleet Health Campus, Vale Road",Northfleet,Gravesend,Kent,DA11 8BZ,Tel: 07591 246595, - ,,,No ratings yet Rate it yourself - /Services/opticians/LeaveReview/DefaultView.aspx?id=OPT_DA118BZ_1,0,0,
Asda Opticans (Gravesend),00306__000001_DA110DQ,OPT,Thames Way,,Gravesend,Kent,,DA11 0DQ,Tel: 01474 543 412, - ,,,No ratings yet Rate it yourself - /Services/opticians/LeaveReview/DefaultView.aspx?id=00306__000001_DA110DQ,0,0,
Boots-Gravesend - Kempthorne St,OP_5CM_416__000002_DA110TA,OPT,9 Kempthorne Street,St Georges Shopping Centre,,Gravsend,Kent,DA11 0TA,Tel: 01474 352911, - ,,,No ratings yet Rate it yourself - /Services/opticians/LeaveReview/DefaultView.aspx?id=OP_5CM_416__000002_DA110TA,0,0,
Specsavers (Gravesend),OP_5CM_2356__000001_DA110AU,OPT,19-20 Thamesgate Shopping Centre,,Kent,Gravesend,,DA11 0AU,Tel: 01474 537 878, - ,,,1 rating Rate it yourself - /Services/opticians/LeaveReview/DefaultView.aspx?id=OP_5CM_2356__000001_DA110AU,,,
Medical Eye Centre,00314__000001_DA122EB,OPT,14 King Street,,Gravesend,Kent,,DA12 2EB,Tel: 01474 321553, - ,,,No ratings yet Rate it yourself - /Services/opticians/LeaveReview/DefaultView.aspx?id=00314__000001_DA122EB,0,0,
K Lewis & Partners,OP_5GQ_9847__000001_RM187QT,OPT,39 - 41 Calcutta Road,,Tilbury,Essex,,RM18 7QT,Tel: 01375 843074, - ,,,No ratings yet Rate it yourself - /Services/opticians/LeaveReview/DefaultView.aspx?id=OP_5GQ_9847__000001_RM187QT,0,0,
Asda Opticians (Greenhithe),00276__000002_DA99RE,OPT,Station Road,,Greenhithe,Kent,,DA9 9RE,Tel: 01322 374162, - ,,,4 ratings Rate it yourself - /Services/opticians/LeaveReview/DefaultView.aspx?id=00276__000002_DA99RE,,,
Specsavers,RM17 6QF__000001_RM176QF,OPT,3 The Mall,Grays Shopping Centre,Grays,Essex,,RM17 6QF,Tel: 01375 389740, - ,,,No ratings yet Rate it yourself - /Services/opticians/LeaveReview/DefaultView.aspx?id=RM17 6QF__000001_RM176QF,0,0,
Kennedy Rath Opticians,0111910__000002_RM176QE,OPT,32 The Mall,,Grays,Essex,,RM17 6QE,Tel: 01375 372444, - ,,,No ratings yet Rate it yourself - /Services/opticians/LeaveReview/DefaultView.aspx?id=0111910__000002_RM176QE,0,0,
Boots Opticians (Bluewater),OP_5CM_972__000002_DA99BA,OPT,South Mall,Bluewater Shopping Centre,Greenhithe,Kent,,DA9 9BA,Tel: 01322 623854, - ,,,1 rating Rate it yourself - /Services/opticians/LeaveReview/DefaultView.aspx?id=OP_5CM_972__000002_DA99BA,,,
Vision Express (Bluewater),OP_5CM_1771__000001_DA99SP,OPT,Unit 14 Upper Rose Gallery,Bluewater,Greenhithe,Kent,,DA9 9SP,Tel: 01322 624814, - ,,,4 ratings Rate it yourself - /Services/opticians/LeaveReview/DefaultView.aspx?id=OP_5CM_1771__000001_DA99SP,,,
Euin Steele & Partners,OP_5GQ_587__000001_RM175EH,OPT,58 Orsett Road,,,Grays,,RM17 5EH,Tel: 01375 373000, - ,,,No ratings yet Rate it yourself - /Services/opticians/LeaveReview/DefaultView.aspx?id=OP_5GQ_587__000001_RM175EH,0,0,
John Lewis Opticians,OPT_DA99SA_1,OPT,,Bluewater,,Greenhithe,,DA9 9SA,, - ,,,No ratings yet Rate it yourself - /Services/opticians/LeaveReview/DefaultView.aspx?id=OPT_DA99SA_1,0,0,
Boots-Bluewater Dartford,DA9 9SJ_98372,OPT,,"Unit MSU02, Lower Thames Walk",Bluewater Shopping Centre,Greenhithe,,DA9 9SJ,Tel: 01322624780, - ,,,No ratings yet Rate it yourself - /Services/opticians/LeaveReview/DefaultView.aspx?id=DA9 9SJ_98372,0,0,
David Clulow (Bluewater),OP_5CM_10603__000001_DA99SS,OPT,Unit 110 Upper Guild Hall,Bluewater,Greenhithe,Kent,,DA9 9SS,Tel: 01322 624915, - ,,,No ratings yet Rate it yourself - /Services/opticians/LeaveReview/DefaultView.aspx?id=OP_5CM_10603__000001_DA99SS,0,0,
Chandler Clarke Opticians,OP_5GQ_4880__000001_RM164BD,OPT,83 Riverview,Chadwell St. Mary,Grays,Essex,,RM16 4BD,Tel: 01375 842103, - ,,,No ratings yet Rate it yourself - /Services/opticians/LeaveReview/DefaultView.aspx?id=OP_5GQ_4880__000001_RM164BD,0,0,
Rowland Opticians,OP_5CM_2066__000002_DA37QA,OPT,,79 Station Road,Kent,Longfield,,DA3 7QA,Tel: 01474 702125, - ,,,No ratings yet Rate it yourself - /Services/opticians/LeaveReview/DefaultView.aspx?id=OP_5CM_2066__000002_DA37QA,0,0,
Optical Express,K5B4X,OPT,40 Lower Level,"Riverbridge House, Anchor Boulevard",,Dartford,Kent,DA2 6SL,Tel: 0800 023 2020, - ,,,No ratings yet Rate it yourself - /Services/opticians/LeaveReview/DefaultView.aspx?id=K5B4X,0,0,
Costco Wholesale UK Ltd,CO-1833-17,OPT,,West Thurrock Way,,West Thurrock,Essex,RM20 3WY,Tel: 01708 683 085, - ,,,1 rating Rate it yourself - /Services/opticians/LeaveReview/DefaultView.aspx?id=CO-1833-17,,,
Opticial Express,OP_12345_RM20 2ZP,OPT,"Unit 230, Level 2",Lakeside Shopping Centre,,Thurrock,Essex,RM20 2ZP,Tel: 0800 023 2020, - ,,,No ratings yet Rate it yourself - /Services/opticians/LeaveReview/DefaultView.aspx?id=OP_12345_RM20 2ZP,0,0,
Boots Opticians Ltd,OP_5GQ_1340__000001_RM202ZG,OPT,74-75 Thurrock Lakeside Shopping Centre,West Thurrock,Grays,,,RM20 2ZG,Tel: 01708 861534, - ,,,2 ratings Rate it yourself - /Services/opticians/LeaveReview/DefaultView.aspx?id=OP_5GQ_1340__000001_RM202ZG,,,
Vision Express (UK) Ltd,OP_5GQ_13034__000001_RM202ZH,OPT,337 Thurrock Lakeside Shopping Centre,West Thurrock,Grays,,,RM20 2ZH,Tel: 01708 860300, - ,,,No ratings yet Rate it yourself - /Services/opticians/LeaveReview/DefaultView.aspx?id=OP_5GQ_13034__000001_RM202ZH,0,0,
Boots-West Thurrock,OP_5GQ_1608__000001_RM202ZQ,OPT,228 Thurrock,Lakeside Shopping Centre,,Grays,Essex,RM20 2ZQ,Tel: 01708 861534, - ,,,No ratings yet Rate it yourself - /Services/opticians/LeaveReview/DefaultView.aspx?id=OP_5GQ_1608__000001_RM202ZQ,0,0,
Vision Express (UK) Ltd,OP_5GQ_11510__000001_RM161ZF,OPT,9 Thurrock Lakeside Shopping Centre,West Thurrock,Grays,,,RM16 1ZF,Tel: 01708 860300, - ,,,No ratings yet Rate it yourself - /Services/opticians/LeaveReview/DefaultView.aspx?id=OP_5GQ_11510__000001_RM161ZF,0,0,
Specsavers Opticians,,OPT,,Sainsburys Howard Road,,"Chafford Hundred, Grays",,RM16 6YJ,Tel: 01375 808301, - ,,,N/A - Data not available,,,
Tesco opticians,RM201TX211015,OPT,,Cygnet View,,West Thurrock,,RM20 1TX,, - ,,,No ratings yet Rate it yourself - /Services/opticians/LeaveReview/DefaultView.aspx?id=RM201TX211015,0,0,
Specsavers (Dartford),OP_5CM_11606__000002_DA11DE,OPT,54 High Street,,Dartford,Kent,,DA1 1DE,Tel: 01322 294040, - ,,,5 ratings Rate it yourself - /Services/opticians/LeaveReview/DefaultView.aspx?id=OP_5CM_11606__000002_DA11DE,,,
Boots-Dartford - High St (in Boots UK),OP_5P9_3123__000003_DA11DE,OPT,48-52 High Street,,,Dartford,Kent,DA1 1DE,Tel: 01322 223935, - ,,,No ratings yet Rate it yourself - /Services/opticians/LeaveReview/DefaultView.aspx?id=OP_5P9_3123__000003_DA11DE,0,0,
Linklater Opticians ,OP_5CM_3977__000001_DA11HD,OPT,22 Lowfield Street,,Dartford,Dartford,,DA1 1HD,Tel: 01322 223113, - ,,,No ratings yet Rate it yourself - /Services/opticians/LeaveReview/DefaultView.aspx?id=OP_5CM_3977__000001_DA11HD,0,0,
Boots-Dartford - High St,OP_5CM_1268__000002_DA11BY,OPT,20 High Street,,,Dartford,Kent,DA1 1BY,Tel: 01322 223 007, - ,,,No ratings yet Rate it yourself - /Services/opticians/LeaveReview/DefaultView.aspx?id=OP_5CM_1268__000002_DA11BY,0,0,
Earnshaw & Dallow,OP_5GQ_1245__000001_RM155DZ,OPT,32 Derry Avenue,,,South Ockendon,,RM15 5DZ,Tel: 01708 853050, - ,,,No ratings yet Rate it yourself - /Services/opticians/LeaveReview/DefaultView.aspx?id=OP_5GQ_1245__000001_RM155DZ,0,0,
Stanford Opticians,OP_5GQ_7872__000001_SS170EX,OPT,6 The Green,,Stanford-le-Hope,Essex,,SS17 0EX,Tel: 01375 672149, - ,,,No ratings yet Rate it yourself - /Services/opticians/LeaveReview/DefaultView.aspx?id=OP_5GQ_7872__000001_SS170EX,0,0,
Specsavers Crayford,G1O1G,OPT,Sainsbury's,Stadium Way,,Dartford,Kent,DA1 4HW,Tel: 01322 470662, - ,,,1 rating Rate it yourself - /Services/opticians/LeaveReview/DefaultView.aspx?id=G1O1G,,,
Boots-Strood,OP_5L3_1926__000001_ME24TJ,OPT,117 High Street,,,Strood,Kent,ME2 4TJ,Tel: 01634 718676, - ,,,No ratings yet Rate it yourself - /Services/opticians/LeaveReview/DefaultView.aspx?id=OP_5L3_1926__000001_ME24TJ,0,0,
Crayford Opticial Centre,OP_5AX_1701__000001_DA14ES,OPT,11a Crayford High Street,,Crayford,Kent,,DA1 4HH,Tel: 01322557700, - ,,,No ratings yet Rate it yourself - /Services/opticians/LeaveReview/DefaultView.aspx?id=OP_5AX_1701__000001_DA14ES,0,0,
Niall O'Kane Optometrists,OP_5L3_10355__000001_ME24AR,OPT,78 - 80 High Street,Strood,Rochester,Kent,,ME2 4AR,Tel: 01634 290178, - ,,,7 ratings Rate it yourself - /Services/opticians/LeaveReview/DefaultView.aspx?id=OP_5L3_10355__000001_ME24AR,,,
Specsavers Opticians,OPT_ME24AR_1,OPT,,58 High Street,,"Strood, Rochester",Kent,ME2 4AR,Tel: 01634 540399, - ,,,No ratings yet Rate it yourself - /Services/opticians/LeaveReview/DefaultView.aspx?id=OPT_ME24AR_1,0,0,
Portobello Eyecare Ltd,K8A7B,OPT,,"3 Portobello Parade, Fawkham Road",,"West Kingsdown, Kent",,TN15 6JP,, - ,,,1 rating Rate it yourself - /Services/opticians/LeaveReview/DefaultView.aspx?id=K8A7B,,,
Goldsmith Webb,OP_5GQ_11951__000001_SS177LY,OPT,8 Grover Walk,Corringham,Stanford-le-Hope,Essex,,SS17 7LY,Tel: 01375 677577, - ,,,No ratings yet Rate it yourself - /Services/opticians/LeaveReview/DefaultView.aspx?id=OP_5GQ_11951__000001_SS177LY,0,0,
M M Beg Opticians,OP_5AX_14694__000001_DA81RG,OPT,115 Erith High Street,,Erith,Kent,,DA8 1RG,Tel: 01322 342620, - ,,,2 ratings Rate it yourself - /Services/opticians/LeaveReview/DefaultView.aspx?id=OP_5AX_14694__000001_DA81RG,,,
Belson & Sons,OP_5GQ_4450__000001_SS177NA,OPT,63 St. Johns Way,Corringham,Stanford-le-Hope,Essex,,SS17 7NA,Tel: 01375 674130, - ,,,No ratings yet Rate it yourself - /Services/opticians/LeaveReview/DefaultView.aspx?id=OP_5GQ_4450__000001_SS177NA,0,0,
Asda Opticians (Swanley),OPT_BR8 7UN,OPT,,London Road,,Swanley,,BR8 7UN,Tel: 01322 661963, - ,,,3 ratings Rate it yourself - /Services/opticians/LeaveReview/DefaultView.aspx?id=OPT_BR8 7UN,,,
Robert Murrell incorporating Armstrong and North,W4X1M,OPT,,17 Swanley Centre,,Swanley,Kent,BR8 7TG,Tel: 01322 663231, - ,,,No ratings yet Rate it yourself - /Services/opticians/LeaveReview/DefaultView.aspx?id=W4X1M,0,0,
Specsavers Opticians Swanley,OPT_BR87TQ_1,OPT,,Unit 39 The Shopping Centre,,Swanley,Kent,BR8 7TQ,Tel: 01322 614827, - ,,,1 rating Rate it yourself - /Services/opticians/LeaveReview/DefaultView.aspx?id=OPT_BR87TQ_1,,,
L Dollay ,OP_5AX_14678__000003_DA83EX,OPT,259 Bexley Road,Northumberland Heath,Erith,Kent,,DA8 3EX,Tel: 01322 359 507, - ,,,1 rating Rate it yourself - /Services/opticians/LeaveReview/DefaultView.aspx?id=OP_5AX_14678__000003_DA83EX,,,
The Village Optician,OPT_ME65NJ_1,OPT,,4 Holborough Road,,Snodland,,ME6 5NJ,Tel: 01634 240090, - ,,,No ratings yet Rate it yourself - /Services/opticians/LeaveReview/DefaultView.aspx?id=OPT_ME65NJ_1,0,0,
Boots-Bexleyheath,OP_5AX_10393__000002_DA67JJ,OPT,25 The Mall,Broadway Shopping Centre,Bexleyheath,Kent,,DA6 7JJ,Tel: 020 8301 5656, - ,,,1 rating Rate it yourself - /Services/opticians/LeaveReview/DefaultView.aspx?id=OP_5AX_10393__000002_DA67JJ,,,
Vision Express Ltd,OP_5AX_5408__000003_DA67JJ,OPT,5 The Mall,Broadway Shopping Centre,Bexleyheath,Kent,,DA6 7JJ,Tel: 0208 298 9629, - ,,,No ratings yet Rate it yourself - /Services/opticians/LeaveReview/DefaultView.aspx?id=OP_5AX_5408__000003_DA67JJ,0,0,
Buchanan Optometrists,OP_5L2_663__000001_ME65AG,OPT,Buchanan House,56 Malling Road,,Snodland,Kent,ME6 5NB,Tel: 01634 757227, - ,,,20 ratings Rate it yourself - /Services/opticians/LeaveReview/DefaultView.aspx?id=OP_5L2_663__000001_ME65AG,,,yes
Linklater Optometrists,OP_5AX_10048__000002_DA67DQ,OPT,Linklaters Optometrists,120 Broadway,Bexleyheath,Kent,,DA6 7DQ,Tel: 0208 303 4014, - ,,,3 ratings Rate it yourself - /Services/opticians/LeaveReview/DefaultView.aspx?id=OP_5AX_10048__000002_DA67DQ,,,no
Specsavvy Opticians Ltd,TP8FC,OPT,Unit 42,Dockside Shopping Centre,"Maritime Way, St Mary's Island",Chatham,Kent,ME4 3ED,Tel: 01634 891000, - ,,,39 ratings Rate it yourself - /Services/opticians/LeaveReview/DefaultView.aspx?id=TP8FC,,,
Specsavers Opticians,OP_5AX_227__000001_DA67DQ,OPT,116a Broadway,Bexleyheath,Kent,,,DA6 7DQ,Tel: 0208 298 9920, - ,,,No ratings yet Rate it yourself - /Services/opticians/LeaveReview/DefaultView.aspx?id=OP_5AX_227__000001_DA67DQ,0,0,
Aves Opticians,OP_5A4_13772__000001_RM139Y,OPT,24 The Broadway,Rainham,Essex,,,RM13 9YW,Tel: 01708 555606, - ,,,No ratings yet Rate it yourself - /Services/opticians/LeaveReview/DefaultView.aspx?id=OP_5A4_13772__000001_RM139Y,0,0,
Tesco Opticians Rainham,RM13 9YZ,OPT,,"Bridge Road, Rainham",,Essex,,RM13 9YZ,, - ,,,No ratings yet Rate it yourself - /Services/opticians/LeaveReview/DefaultView.aspx?id=RM13 9YZ,0,0,
Boots-Chatham - Wilmot Sq,OP_5L3_1784__000002_ME44BB,OPT,30-34 Wilmot Square,Pentagon Centre,,Kent,Kent,ME4 4BB,Tel: 01634 828672, - ,,,1 rating Rate it yourself - /Services/opticians/LeaveReview/DefaultView.aspx?id=OP_5L3_1784__000002_ME44BB,,,
Vision Express (Chatham),OP_5L3_6149__000002_ME44BG,OPT,199 - 201 High Street,,Chatham,Kent,,ME4 4BG,Tel: 01634 404808, - ,,,1 rating Rate it yourself - /Services/opticians/LeaveReview/DefaultView.aspx?id=OP_5L3_6149__000002_ME44BG,,,
Specsavers (Chatham),OP_5L3_7948__000001_ME44BG,OPT,215 High Street,,Chatham,Kent,,ME4 4BG,Tel: 01634 818555, - ,,,5 ratings Rate it yourself - /Services/opticians/LeaveReview/DefaultView.aspx?id=OP_5L3_7948__000001_ME44BG,,,
W Johnston,OP_5AX_14680__000001_DA175JN,OPT,63 Nuxley Road,,Upper Belvedere,Kent,,DA17 5JN,Tel: 01322 432868, - ,,,1 rating Rate it yourself - /Services/opticians/LeaveReview/DefaultView.aspx?id=OP_5AX_14680__000001_DA175JN,,,
Boots-Upminster,OP_5A4_4931__000001_RM142AP,OPT,7 Corbets Tey Road,,,Upminster,Essex,RM14 2AP,Tel: 01708 222 383, - ,,,No ratings yet Rate it yourself - /Services/opticians/LeaveReview/DefaultView.aspx?id=OP_5A4_4931__000001_RM142AP,0,0,
"Bahri, P.K.",OP_5A4_8118__000001_RM143BT,OPT,172 St. Marys Lane,,Upminster,,,RM14 3BT,Tel: 01708 228397, - ,,,No ratings yet Rate it yourself - /Services/opticians/LeaveReview/DefaultView.aspx?id=OP_5A4_8118__000001_RM143BT,0,0,
James Read Opticians Ltd,OP_5A4_14773__000001_RM142S,OPT,36 Station Road,Upminster,,Essex,,RM14 2TR,Tel: 01708 221086, - ,,,No ratings yet Rate it yourself - /Services/opticians/LeaveReview/DefaultView.aspx?id=OP_5A4_14773__000001_RM142S,0,0,
Sanford Opticians,000281__000001_ME39AA,OPT,7 Main Road,Hoo,Rochester,Kent,,ME3 9AA,Tel: 01634 256565, - ,,,No ratings yet Rate it yourself - /Services/opticians/LeaveReview/DefaultView.aspx?id=000281__000001_ME39AA,0,0,
Asda Stores Limited,OPT_ME7 1RX,OPT,,Pier Road,,Gillingham,,ME7 1RX,Tel: 01732 753131, - ,,,No ratings yet Rate it yourself - /Services/opticians/LeaveReview/DefaultView.aspx?id=OPT_ME7 1RX,0,0,
Specsavers (Gillingham),00323__000002_ME71AQ,OPT,137 High Street,,Gillingham,Kent,,ME7 1AQ,Tel: 01634 583350, - ,,,1 rating Rate it yourself - /Services/opticians/LeaveReview/DefaultView.aspx?id=00323__000002_ME71AQ,,,
"Debney, K. Optician",OP_5A4_999__000001_RM141LD,OPT,219 Front Lane,,Upminster,,,RM14 1LD,Tel: 01708 223116, - ,,,No ratings yet Rate it yourself - /Services/opticians/LeaveReview/DefaultView.aspx?id=OP_5A4_999__000001_RM141LD,0,0,
Tesco Optician (Lunsford Park),ME206RJ060716,OPT,,Lunsford Park,,Larkfield,,ME20 6RJ,Tel: 0345 601 3479, - ,,,No ratings yet Rate it yourself - /Services/opticians/LeaveReview/DefaultView.aspx?id=ME206RJ060716,0,0,
Maa Eyecare,TP8XN,OPT,Maa Eyecare,121 Avon Road,Cranham,Upminster,Greater London,RM14 1RQ,Tel: 01708 259889, - ,,,No ratings yet Rate it yourself - /Services/opticians/LeaveReview/DefaultView.aspx?id=TP8XN,0,0,yes
Aves Opticians,OP_5A4_7090__000002_RM126LL,OPT,211 Station Lane,,Hornchurch,,,RM12 6LL,Tel: 01708 452295, - ,,,No ratings yet Rate it yourself - /Services/opticians/LeaveReview/DefaultView.aspx?id=OP_5A4_7090__000002_RM126LL,0,0,
Nasir Opticians,OP_5C2_13777__000001_RM109R,OPT,2-3 Station Parade,Elm Park,,Hornchurch,Essex,RM12 5AB,Tel: 020 8593 0328, - ,,,No ratings yet Rate it yourself - /Services/opticians/LeaveReview/DefaultView.aspx?id=OP_5C2_13777__000001_RM109R,0,0,
Eye Clinic,OP_5A4_13123__000001_RM124RN,OPT,35 The Broadway,Elm Park,,Hornchurch,Essex,RM12 4RN,Tel: 01708 447012, - ,,,1 rating Rate it yourself - /Services/opticians/LeaveReview/DefaultView.aspx?id=OP_5A4_13123__000001_RM124RN,,,
Borough Green Opticians,OP_5FF_10481__000002_TN158BT,OPT,25 High Street,Borough Green,Sevenoaks,Kent,,TN15 8BT,Tel: 01732 884558, - ,,,1 rating Rate it yourself - /Services/opticians/LeaveReview/DefaultView.aspx?id=OP_5FF_10481__000002_TN158BT,,,
West Malling Opticians ,OP_5L2_7653__000001_ME196QR,OPT,32 High Street,,Kent,West Malling,,ME19 6QR,Tel: 01732 841403, - ,,,No ratings yet Rate it yourself - /Services/opticians/LeaveReview/DefaultView.aspx?id=OP_5L2_7653__000001_ME196QR,0,0,
Specsavers Ltd,OP_5A4_14774__000002_RM113YD,OPT,139 High Street,Hornchurch,Essex,,,RM11 3YD,Tel: 01708 460170, - ,,,1 rating Rate it yourself - /Services/opticians/LeaveReview/DefaultView.aspx?id=OP_5A4_14774__000002_RM113YD,,,
Gill Eyecare Ltd,01/14123,OPT,,145 High Street,,Honrchurch,Essex,RM11 3YD,Tel: 01708 475623, - ,,,No ratings yet Rate it yourself - /Services/opticians/LeaveReview/DefaultView.aspx?id=01/14123,0,0,yes
Boots-Hornchurch - High St,OP_5A4_1321__000001_RM113YD,OPT,127-133 High Street,,,Hornchurch,Essex,RM11 3YD,Tel: 01708 440233, - ,,,No ratings yet Rate it yourself - /Services/opticians/LeaveReview/DefaultView.aspx?id=OP_5A4_1321__000001_RM113YD,0,0,
Templeman Opticians,OP_5GR_10876__000002_SS155TE,OPT,11 The Laindon Centre,,Basildon,Essex,,SS15 5TE,Tel: 01268 544646, - ,,,1 rating Rate it yourself - /Services/opticians/LeaveReview/DefaultView.aspx?id=OP_5GR_10876__000002_SS155TE,,,yes
Roy Gill,OP_5A4_13770__000001_RM124U,OPT,96 High Street,Hornchurch,Essex,,,RM12 4UH,Tel: 01708 475623, - ,,,No ratings yet Rate it yourself - /Services/opticians/LeaveReview/DefaultView.aspx?id=OP_5A4_13770__000001_RM124U,0,0,
T. J. Woolley,000179__000002_ME72YN,OPT,60 Watling Street,,Gillingham,Kent,,ME7 2YN,Tel: 01634 281291, - ,,,12 ratings Rate it yourself - /Services/opticians/LeaveReview/DefaultView.aspx?id=000179__000002_ME72YN,,,
Second Sight,OP_5AX_2062__000002_DA163PG,OPT,81 Welling High Street,,Welling,Kent,,DA16 1TY,Tel: 0208 301 4586, - ,,,1 rating Rate it yourself - /Services/opticians/LeaveReview/DefaultView.aspx?id=OP_5AX_2062__000002_DA163PG,,,
R F Linklater & Partners,OP_5AX_8989__000001_DA161TG,OPT,136 High Street,,Welling,Kent,,DA16 1TJ,Tel: 0208 303 4963, - ,,,1 rating Rate it yourself - /Services/opticians/LeaveReview/DefaultView.aspx?id=OP_5AX_8989__000001_DA161TG,,,
S Gothelf & Associates,OP_5AX_10318__000001_DA159NB,OPT,10 Wellington Parade,,Sidcup,Kent,,DA15 9NB,Tel: 0208 303 3935, - ,,,2 ratings Rate it yourself - /Services/opticians/LeaveReview/DefaultView.aspx?id=OP_5AX_10318__000001_DA159NB,,,
Specsavers Opticians,OP_5AX_14708__000001_DA146ED,OPT,53 High Street,Sidcup,Kent,,,DA14 6ED,Tel: 0208 308 3500, - ,,,No ratings yet Rate it yourself - /Services/opticians/LeaveReview/DefaultView.aspx?id=OP_5AX_14708__000001_DA146ED,0,0,
Vision Express (UK) Limited,BR5 3RP__000001_BR53RP,OPT,"Unit 9,",Nugent Shopping Park,Orpington,Kent,,BR5 3RP,Tel: 01689 875737, - ,,,No ratings yet Rate it yourself - /Services/opticians/LeaveReview/DefaultView.aspx?id=BR5 3RP__000001_BR53RP,0,0,
Vraitch Vision (Walderslade),OPT_ME59LR_1,OPT,,3-4 Thetford House,,Walderslade,,ME5 9LR,Tel: 01634 682595, - ,,,No ratings yet Rate it yourself - /Services/opticians/LeaveReview/DefaultView.aspx?id=OPT_ME59LR_1,0,0,
Kent Eye Care Ltd,NKCCKNCK,OPT,Kent Eye Care Independent Specialist Optometrists & Opticians,786 London Road,,"Larkfield, Aylesford",Kent,ME20 6BE,Tel: 01732 873378, - ,,,1 rating Rate it yourself - /Services/opticians/LeaveReview/DefaultView.aspx?id=NKCCKNCK,,,no
Specsavers Opticians,OP_5GR_2933__000001_SS141DT,OPT,58-60 Town Square,,Basildon,Essex,,SS14 1DT,Tel: 01268 274444, - ,,,No ratings yet Rate it yourself - /Services/opticians/LeaveReview/DefaultView.aspx?id=OP_5GR_2933__000001_SS141DT,0,0,
Colletts Opticians Ltd,OP_5AX_2176__000001_DA146ND,OPT,103 Main Road,Sidcup,Kent,,,DA14 6ND,Tel: 0208 300 3222, - ,,,No ratings yet Rate it yourself - /Services/opticians/LeaveReview/DefaultView.aspx?id=OP_5AX_2176__000001_DA146ND,0,0,
Vision Express (UK) Ltd,OP_5GR_9390__000001_SS141BT,OPT,82 Town Square,,Basildon,,,SS14 1BJ,Tel: 01268 530198, - ,,,No ratings yet Rate it yourself - /Services/opticians/LeaveReview/DefaultView.aspx?id=OP_5GR_9390__000001_SS141BT,0,0,
Steven Harris Opticians,OP_5AX_14681__000001_DA163PG,OPT,101 Bellegrove Road,,Welling,Kent,,DA16 3PG,Tel: 0208 304 2423, - ,,,No ratings yet Rate it yourself - /Services/opticians/LeaveReview/DefaultView.aspx?id=OP_5AX_14681__000001_DA163PG,0,0,
Asda Opticians,OPT_SS14 1AE,OPT,,EASTGATE SHOPPING CENTRE,EASTGATE,BASILDON,,SS14 1AE,Tel: 01268 884 020, - ,,,1 rating Rate it yourself - /Services/opticians/LeaveReview/DefaultView.aspx?id=OPT_SS14 1AE,,,
Boots-Basildon - Town Sq,OP_5GR_570__000002_SS141BA,OPT,25 Town Square,,Basildon,Basildon,Essex,SS14 1BA,Tel: 01268 293363, - ,,,2 ratings Rate it yourself - /Services/opticians/LeaveReview/DefaultView.aspx?id=OP_5GR_570__000002_SS141BA,,,
Dollond & Aitchison,OP_5GR_5237__000002_SS141HG,OPT,1 - 3 East Walk,,Basildon,Essex,,SS14 1HG,Tel: 01268 520340, - ,,,No ratings yet Rate it yourself - /Services/opticians/LeaveReview/DefaultView.aspx?id=OP_5GR_5237__000002_SS141HG,0,0,
Weston Opticians Ltd,OP_5GR_12818__000001_SS141HA,OPT,39 East Walk,,Basildon,Essex,,SS14 1HA,Tel: 01268 531420, - ,,,No ratings yet Rate it yourself - /Services/opticians/LeaveReview/DefaultView.aspx?id=OP_5GR_12818__000001_SS141HA,0,0,
Asda Opticians,OP_5C2__000002_RM96SJ,OPT,Merrielands Crescent,*,,Dagenham,Essex,RM9 6SJ,Tel: 0208 5965372, - ,,,1 rating Rate it yourself - /Services/opticians/LeaveReview/DefaultView.aspx?id=OP_5C2__000002_RM96SJ,,,
Specsavers ,OP_5C2_13799__000001_RM95AN,OPT,249 Heathway,,Dagenham,Essex,,RM9 5AN,Tel: 020 8596 9998, - ,,,No ratings yet Rate it yourself - /Services/opticians/LeaveReview/DefaultView.aspx?id=OP_5C2_13799__000001_RM95AN,0,0,
Tesco Opticians,OP_5GR_12819__000002_SS133JU,OPT,Off Station Lane,Pitsea,Basildon,Essex,,SS13 3JU,Tel: 01268 367438, - ,,,No ratings yet Rate it yourself - /Services/opticians/LeaveReview/DefaultView.aspx?id=OP_5GR_12819__000002_SS133JU,0,0,
"Morgan, Henry",OP_5C2_12068__000001_RM108QU,OPT,276 Heathway,,Dagenham,Essex,,RM10 8QU,Tel: 020 8592 1033, - ,,,No ratings yet Rate it yourself - /Services/opticians/LeaveReview/DefaultView.aspx?id=OP_5C2_12068__000001_RM108QU,0,0,
Heathway Eyecare,OP_5C2_9798__000002_RM95AQ,OPT,295 Heathway,,Dagenham,,,RM9 5AQ,Tel: 020 8592 2309, - ,,,2 ratings Rate it yourself - /Services/opticians/LeaveReview/DefaultView.aspx?id=OP_5C2_9798__000002_RM95AQ,,,
Specsavers Opticians,BR6 0TW__000001_BR60TW,OPT,,175 High Street,,Orpington,Kent,BR6 0LW,Tel: 01689 890 168, - ,,,No ratings yet Rate it yourself - /Services/opticians/LeaveReview/DefaultView.aspx?id=BR6 0TW__000001_BR60TW,0,0,
Boots Opticians ,OP_5A7_6080__000002_BR60JN,OPT,194 High Street,,Orpington,,,BR6 0JN,Tel: 01689 891303, - ,,,No ratings yet Rate it yourself - /Services/opticians/LeaveReview/DefaultView.aspx?id=OP_5A7_6080__000002_BR60JN,0,0,
L Dollay,OP_5A8_766__000001_SE288RA,OPT,4a Joyce Dawson Way,,Thamesmead,London,,SE28 8RA,Tel: 020 8311 8711, - ,,,No ratings yet Rate it yourself - /Services/opticians/LeaveReview/DefaultView.aspx?id=OP_5A8_766__000001_SE288RA,0,0,