Organisation Name,NACS Code,Organisation Type,Address1,Address2,Address3,Address4,Address5,PostCode,Telephone Number,Opening time,Value  (Opening time),Banding Classification  (Opening time),NHS.UK users rating,Value  (NHS.UK users rating),Banding Classification  (NHS.UK users rating),Car parking (Is there car parking at this organisation?)
Loveday Opticians,OP_5GK_9877__000001_CM232QR,OPT,The Folly,18 Hadham Road,Bishops Stortford,,,CM23 2QR,Tel: 01279 54676, - ,,,No ratings yet Rate it yourself - /Services/opticians/LeaveReview/DefaultView.aspx?id=OP_5GK_9877__000001_CM232QR,0,0,
Ashwell & Barrie,OP_5GK_2223__000001_CM232LW,OPT,Ashwell and Barrie Optician Ltd,34-36 North Street,,Bishop's Stortford,Hertfordshire,CM23 2LW,Tel: 01279 652956, - ,,,No ratings yet Rate it yourself - /Services/opticians/LeaveReview/DefaultView.aspx?id=OP_5GK_2223__000001_CM232LW,0,0,yes
P S Mayo Opticians ,OP_5GK_8531__000002_CM233AL,OPT,34- 36 North Street,,Bishops Stortford,Hertfordshire,,CM23 2LW,Tel: 01279 654644, - ,,,No ratings yet Rate it yourself - /Services/opticians/LeaveReview/DefaultView.aspx?id=OP_5GK_8531__000002_CM233AL,0,0,
Martin Reynolds Opticians,5GK_27022006__000002_CM232LW,OPT,Martin Reynolds Opticians,24 North Street,,Bishop’s Stortford,Hertfordshire,CM23 2LW,Tel: 01279 757767, - ,,,No ratings yet Rate it yourself - /Services/opticians/LeaveReview/DefaultView.aspx?id=5GK_27022006__000002_CM232LW,0,0,yes
Specsavers Opticians,OP_5GK_1413__000003_CM233AT,OPT,16a South Street,Bishops Stortford,Hertfordshire,,,CM23 3AT,Tel: 01279 656696, - ,,,No ratings yet Rate it yourself - /Services/opticians/LeaveReview/DefaultView.aspx?id=OP_5GK_1413__000003_CM233AT,0,0,
Boots-Bishops Stortford - South St,OP_5GK_6064__000002_CM233AT,OPT,22 South Street,,,Bishops Stortford,Hertfordshire,CM23 3AT,Tel: 01279 651436, - ,,,1 rating Rate it yourself - /Services/opticians/LeaveReview/DefaultView.aspx?id=OP_5GK_6064__000002_CM233AT,,,
Boots-Bishops Stortford - South St,OP_5GK_899__000001_CM233AB,OPT,1a South Street,,Bishops Stortford,Hertfordshire,,CM23 3AB,Tel: 01279 757329, - ,,,No ratings yet Rate it yourself - /Services/opticians/LeaveReview/DefaultView.aspx?id=OP_5GK_899__000001_CM233AB,0,0,
The i Practice,OP_5GJ_1225__000001_CM219AX,OPT,47 Knight Street,Sawbridgeworth,Hertfordshire,,,CM21 9AX,Tel: 01279 725332, - ,,,No ratings yet Rate it yourself - /Services/opticians/LeaveReview/DefaultView.aspx?id=OP_5GJ_1225__000001_CM219AX,0,0,
FR Loveday Opticians,OP_5DC_1995__000001_CM170DW,OPT,22 High Street,,Old Harlow,Essex,,CM17 0DW,Tel: 01279 415625, - ,,,No ratings yet Rate it yourself - /Services/opticians/LeaveReview/DefaultView.aspx?id=OP_5DC_1995__000001_CM170DW,0,0,
Vision Call (DOM),-559 5LC__000006_CB114LB,OPT,Suite 1 Neville House,Wendens Ambo Saffron Walden,Essex,London,,CB11 4LB,Tel: 01799 543 561, - ,,,No ratings yet Rate it yourself - /Services/opticians/LeaveReview/DefaultView.aspx?id=-559 5LC__000006_CB114LB,0,0,
J.Oliver Radley Opticians Ltd,OP_5P3_11322__000001_SG99AQ,OPT,36 High Street,Buntingford,Hertfordshire,,,SG9 9AQ,Tel: 01763 273300, - ,,,11 ratings Rate it yourself - /Services/opticians/LeaveReview/DefaultView.aspx?id=OP_5P3_11322__000001_SG99AQ,,,
Specsavers Ltd,OP_5DC_2746__000001_CM201HP,OPT,,10-12 Broad Walk,Harlow,Essex,,CM20 1HT,Tel: 01279 410888, - ,,,No ratings yet Rate it yourself - /Services/opticians/LeaveReview/DefaultView.aspx?id=OP_5DC_2746__000001_CM201HP,0,0,
Dollond & Aitchison Proffessional Services 2 Ltd,OP_5DC_1594__000002_CM201HT,OPT,4 The Broadwalk,,Harlow,Essex,,CM20 1HT,Tel: 01279 438851, - ,,,No ratings yet Rate it yourself - /Services/opticians/LeaveReview/DefaultView.aspx?id=OP_5DC_1594__000002_CM201HT,0,0,
Boots-Harlow - Broadwalk,OP_5DC_1813__000002_CM201JA,OPT,37 Broadwalk,,Harlow,Essex,,CM20 1JA,Tel: 01279 439581, - ,,,No ratings yet Rate it yourself - /Services/opticians/LeaveReview/DefaultView.aspx?id=OP_5DC_1813__000002_CM201JA,0,0,
Rose Optometrists,OP_5DC_8699__000001_CM201XR,OPT,15F The Harvey Centre,,Harlow,Essex,,CM20 1XR,Tel: 01279 443181, - ,,,No ratings yet Rate it yourself - /Services/opticians/LeaveReview/DefaultView.aspx?id=OP_5DC_8699__000001_CM201XR,0,0,
Vision Express Opticians,OP_5DC_13314__000001_CM201XW,OPT,33a Harvey Shopping Centre,,Harlow,Essex,,CM20 1XW,Tel: 01279 410346, - ,,,No ratings yet Rate it yourself - /Services/opticians/LeaveReview/DefaultView.aspx?id=OP_5DC_13314__000001_CM201XW,0,0,
Bird & Fairley,OP_5GN_2946__000001_CM61AG,OPT,18a High Street,,Great Dunmow,Essex,,CM6 1AG,Tel: 01371 874138, - ,,,No ratings yet Rate it yourself - /Services/opticians/LeaveReview/DefaultView.aspx?id=OP_5GN_2946__000001_CM61AG,0,0,
Specsavers Great Dunmow,Q7Q0A,OPT,,11 High Street,,Great Dunmow,,CM6 1AB,Tel: 01376 552247, - ,,,No ratings yet Rate it yourself - /Services/opticians/LeaveReview/DefaultView.aspx?id=Q7Q0A,0,0,
The Opticians,OP_5GN_8681__000002_CM61AB,OPT,35 High Street,,Great Dunmow,Essex,,CM6 1AB,Tel: 01376 876044, - ,,,No ratings yet Rate it yourself - /Services/opticians/LeaveReview/DefaultView.aspx?id=OP_5GN_8681__000002_CM61AB,0,0,
Eye Deal Opticians,OP_5GJ_10215__000001_SG129BP,OPT,5 High Street,,Ware,,,SG12 9BP,Tel: 01920 460866, - ,,,No ratings yet Rate it yourself - /Services/opticians/LeaveReview/DefaultView.aspx?id=OP_5GJ_10215__000001_SG129BP,0,0,
Ware Eye Centre,OP_5GJ_79__000001_SG129HW,OPT,12 Amwell End,Ware,Hertfordshire,,,SG12 9HW,Tel: 01920 469978, - ,,,No ratings yet Rate it yourself - /Services/opticians/LeaveReview/DefaultView.aspx?id=OP_5GJ_79__000001_SG129HW,0,0,
D H Thomas,OP_5GN_10846__000001_CB101EJ,OPT,"Suite 2, Goldhill House",Gold Street,Saffron Walden,Essex,,CB10 1EJ,Tel: 01799 525957, - ,,,No ratings yet Rate it yourself - /Services/opticians/LeaveReview/DefaultView.aspx?id=OP_5GN_10846__000001_CB101EJ,0,0,
Boots-Saffron Walden,OP_5GN_10289__000001_CB101EE,OPT,44 High Street,,,Saffron Walden,Essex,CB10 1EE,Tel: 01799 522 175, - ,,,1 rating Rate it yourself - /Services/opticians/LeaveReview/DefaultView.aspx?id=OP_5GN_10289__000001_CB101EE,,,
Ernest Aves & Partners,OP_5GJ_10894__000002_SG129AD,OPT,61 High Street,,Ware,,,SG12 9AD,Tel: 01920 462751, - ,,,No ratings yet Rate it yourself - /Services/opticians/LeaveReview/DefaultView.aspx?id=OP_5GJ_10894__000002_SG129AD,0,0,
S J Williams,OP_5GN_13383__000001_CB101EU,OPT,21 King Street,,Saffron Walden,Essex,,CB10 1EU,Tel: 01799 523302, - ,,,1 rating Rate it yourself - /Services/opticians/LeaveReview/DefaultView.aspx?id=OP_5GN_13383__000001_CB101EU,,,
Appelman Charman Opticians ,180808__000001_EN118HD,OPT,90 High Street,,Hoddesdon,Hertfordshire,,EN11 8HD,Tel: 01992 447141, - ,,,1 rating Rate it yourself - /Services/opticians/LeaveReview/DefaultView.aspx?id=180808__000001_EN118HD,,,
Scrivens Opticians,OP_5GJ_13119__000003_EN118TJ,OPT,,7 Fawkon Walk,High Street,Hoddesdon,,EN11 8TJ,Tel: 01992 469 393, - ,,,No ratings yet Rate it yourself - /Services/opticians/LeaveReview/DefaultView.aspx?id=OP_5GJ_13119__000003_EN118TJ,0,0,
Boots-Hoddesdon,OP_5GJ_6255__000001_EN118TA,OPT,47 High Street,,,Hoddesdon,Hertfordshire,EN11 8TA,Tel: 01992 463055, - ,,,No ratings yet Rate it yourself - /Services/opticians/LeaveReview/DefaultView.aspx?id=OP_5GJ_6255__000001_EN118TA,0,0,
Hertford Opticians,OP_5GJ_3719__000001_SG137DZ,OPT,73 Railway Street,,Hertford,Hertfordshire,,SG14 1RP,Tel: 01992 551762, - ,,,No ratings yet Rate it yourself - /Services/opticians/LeaveReview/DefaultView.aspx?id=OP_5GJ_3719__000001_SG137DZ,0,0,
Stuart Davidson Opticians ,OP_5P3_1321__000002_SG141BN,OPT,22a Bircherley Green,Hertford,Herts,,,SG14 1BN,Tel: 01992 586 979, - ,,,No ratings yet Rate it yourself - /Services/opticians/LeaveReview/DefaultView.aspx?id=OP_5P3_1321__000002_SG141BN,0,0,
Boots-Hertford,OP_5GJ_4619__000001_SG141DW,OPT,27 Maidenhead Street,,,Hertford,Hertfordshire,SG14 1DW,Tel: 01992 583285, - ,,,No ratings yet Rate it yourself - /Services/opticians/LeaveReview/DefaultView.aspx?id=OP_5GJ_4619__000001_SG141DW,0,0,
Eileen Gay Optometrists,OP_5GJ_7911__000001_EN107AA,OPT,8 Station Road,,,Broxbourne,Herefordshire,EN10 7QU,Tel: 01992 476300, - ,,,No ratings yet Rate it yourself - /Services/opticians/LeaveReview/DefaultView.aspx?id=OP_5GJ_7911__000001_EN107AA,0,0,
Aves Optometrists,OP_5AJ_8196__000002_CM164BL,OPT,,221 High Street,,Epping,Essex,CM16 4BL,Tel: 01992 572302, - ,,,1 rating Rate it yourself - /Services/opticians/LeaveReview/DefaultView.aspx?id=OP_5AJ_8196__000002_CM164BL,,,
Boots-Epping - High St,CM16 4AQ_19173,OPT,,188 Epping High Street,,Epping,Essex,CM16 4AQ,Tel: 01992 571986, - ,,,No ratings yet Rate it yourself - /Services/opticians/LeaveReview/DefaultView.aspx?id=CM16 4AQ_19173,0,0,
Boatmans Opticians,OP_5PV_01__000003_CM59JJ,OPT,182 High Street,,Ongar,Essex,,CM5 9JJ,Tel: 01277 366665, - ,,,No ratings yet Rate it yourself - /Services/opticians/LeaveReview/DefaultView.aspx?id=OP_5PV_01__000003_CM59JJ,0,0,
Scrivens Optical & Hearing Care,OP_5GK_5479__000001_SG89AW,OPT,,42A High Street,,Royston,Hertfordshire,SG8 9AW,Tel: 01763 243050, - ,,,1 rating Rate it yourself - /Services/opticians/LeaveReview/DefaultView.aspx?id=OP_5GK_5479__000001_SG89AW,,,
Pryor & Clacher,OP_5AJ_1464__000001_CM164BD,OPT,91 High Street,,Epping,Essex,,CM16 4BD,Tel: 01992 575999, - ,,,No ratings yet Rate it yourself - /Services/opticians/LeaveReview/DefaultView.aspx?id=OP_5AJ_1464__000001_CM164BD,0,0,
E.H. Howes Opticians,OP_5GK_10929__000001_SG89AA,OPT,33/35 High Street,,Royston,,,SG8 9AA,Tel: 01763 243132, - ,,,No ratings yet Rate it yourself - /Services/opticians/LeaveReview/DefaultView.aspx?id=OP_5GK_10929__000001_SG89AA,0,0,
Pipkin Partnership Optometrists,OP_5AJ_4264__000001_CM59EB,OPT,96 High Street,,Ongar,Essex,,CM5 9EB,Tel: 01277 362192, - ,,,No ratings yet Rate it yourself - /Services/opticians/LeaveReview/DefaultView.aspx?id=OP_5AJ_4264__000001_CM59EB,0,0,
Christopher's Opticians  ,OP_5GH_3618__000001_SG20DL,OPT,21 The Glebe,,Stevenage,,,SG2 0DL,Tel: 01438 314538, - ,,,No ratings yet Rate it yourself - /Services/opticians/LeaveReview/DefaultView.aspx?id=OP_5GH_3618__000001_SG20DL,0,0,
Tesco Opticians,EN8 0TA,OPT,,Brookfield Centre,,Cheshunt,,EN8 0TA,Tel: 0345 601 3479, - ,,,No ratings yet Rate it yourself - /Services/opticians/LeaveReview/DefaultView.aspx?id=EN8 0TA,0,0,
M&S Opticians,A0C1W,OPT,M&S,Brookfield Centre,,Cheshunt,Hertfordshire,EN8 0TZ,Tel: 01992 660 864, - ,,,No ratings yet Rate it yourself - /Services/opticians/LeaveReview/DefaultView.aspx?id=A0C1W,0,0,
Christopher's Opticians,5GH_02012006__000002_SG36AP,OPT,7a Station Road,,Knebworth,Hertfordshire,,SG3 6AP,Tel: 01438 816306, - ,,,No ratings yet Rate it yourself - /Services/opticians/LeaveReview/DefaultView.aspx?id=5GH_02012006__000002_SG36AP,0,0,
Billson Opticians,515PP__000001_CB214HS,OPT,55 High Street Linton,,Cambridge,Cambridgeshire,,CB21 4HS,Tel: 01223 891333, - ,,,No ratings yet Rate it yourself - /Services/opticians/LeaveReview/DefaultView.aspx?id=515PP__000001_CB214HS,0,0,
M&S Opticians,D7F2F,OPT,,5 Roaring Meg Retail Park,,Stevenage,,SG1 1XN,Tel: 01438576301, - ,,,No ratings yet Rate it yourself - /Services/opticians/LeaveReview/DefaultView.aspx?id=D7F2F,0,0,
Asda Opticians,OP_SG11LA_30695,OPT,,Monkswood Way,,Stevenage,,SG1 1LA,Tel: 01438 744912, - ,,,No ratings yet Rate it yourself - /Services/opticians/LeaveReview/DefaultView.aspx?id=OP_SG11LA_30695,0,0,
Broomfield Refraction Clinic,OP_5JN_13368__000001_CM29BG,OPT,Court Road,Broomfield,,Chelmsford,Essex,CM1 5ET,Tel: 01245 440761, - ,,,No ratings yet Rate it yourself - /Services/opticians/LeaveReview/DefaultView.aspx?id=OP_5JN_13368__000001_CM29BG,0,0,
Boots-Stevenage - Queenway,OP_5GH_6024__000001_SG11BS,OPT,35 Queensway,,,Stevenage,Hertfordshire,SG1 1DN,Tel: 01438 312263, - ,,,1 rating Rate it yourself - /Services/opticians/LeaveReview/DefaultView.aspx?id=OP_5GH_6024__000001_SG11BS,,,
Orthoptic Department,OP_5JN_U/K__000002_CM29BG,OPT,West Wing 2,Broomfield Hospital,Court Road,Chelmsford,Essex,CM1 7ET,Tel: 01245 514500, - ,,,1 rating Rate it yourself - /Services/opticians/LeaveReview/DefaultView.aspx?id=OP_5JN_U/K__000002_CM29BG,,,
Boots-Cheshunt,EN8 8NT_99912,OPT,,57A Turners Hill,Waltham Cross,Cheshunt,,EN8 8NT,Tel: 01992 638996, - ,,,No ratings yet Rate it yourself - /Services/opticians/LeaveReview/DefaultView.aspx?id=EN8 8NT_99912,0,0,
Specsavers Opticians,OP_5GH_7474__000001_SG11EG,OPT,90 Queensway,,Stevenage,,,SG1 1EG,Tel: 01438 748900, - ,,,No ratings yet Rate it yourself - /Services/opticians/LeaveReview/DefaultView.aspx?id=OP_5GH_7474__000001_SG11EG,0,0,
Dollond & Aitchison,OP_5GH_4998__000003_SG11ES,OPT,The Forum Centre,The Forum,Stevenage,Hertfordshire,,SG1 1ES,Tel: 01438 364656, - ,,,No ratings yet Rate it yourself - /Services/opticians/LeaveReview/DefaultView.aspx?id=OP_5GH_4998__000003_SG11ES,0,0,
GPC Opticians,OP_5GH_7785__000001_SG11EE,OPT,22 The Forum,,Stevenage,,,SG1 1EH,Tel: 01438 364168, - ,,,No ratings yet Rate it yourself - /Services/opticians/LeaveReview/DefaultView.aspx?id=OP_5GH_7785__000001_SG11EE,0,0,
Sun Street Opticians,1909161410,OPT,,54 Sun Street,,Waltham Abbey,Herefordshire,EN9 1EJ,Tel: 01992 669669, - ,,,2 ratings Rate it yourself - /Services/opticians/LeaveReview/DefaultView.aspx?id=1909161410,,,
Tesco Stores Ltd,OP_5PX_1998__000001_CM777WW,OPT,1 The Square,Notley Green,Braintree,Essex,,CM77 7WW,Tel: 01376 307438, - ,,,No ratings yet Rate it yourself - /Services/opticians/LeaveReview/DefaultView.aspx?id=OP_5PX_1998__000001_CM777WW,0,0,
Refraction Clinic,OP_TAG_13856__000001_CM72QJ,OPT,Rayne Road,,Braintree,Essex,,CM7 2QJ,Tel: 01376 551221, - ,,,No ratings yet Rate it yourself - /Services/opticians/LeaveReview/DefaultView.aspx?id=OP_TAG_13856__000001_CM72QJ,0,0,
Tesco Opticians,SG7 6BN,OPT,,58 High St,,Baldock,,SG7 6BN,Tel: 0345 601 3479, - ,,,No ratings yet Rate it yourself - /Services/opticians/LeaveReview/DefaultView.aspx?id=SG7 6BN,0,0,
Billson Opticians,5PP CB22 3BG,OPT,,66 High Street Sawston,,Cambridge,Cambridgeshire,CB22 3BG,Tel: 01223 836656, - ,,,No ratings yet Rate it yourself - /Services/opticians/LeaveReview/DefaultView.aspx?id=5PP CB22 3BG,0,0,
Allders Opticians,OP_5GH_3148__000001_SG76BG,OPT,31 High Street,,Baldock,,,SG7 6BG,Tel: 01462 893330, - ,,,No ratings yet Rate it yourself - /Services/opticians/LeaveReview/DefaultView.aspx?id=OP_5GH_3148__000001_SG76BG,0,0,
Crystal Eyecare,OP_5GJ_9521__000002_EN87BY,OPT,Unit 28 Shopping Pavilion,High Street,,Waltham Cross,Hertfordshire,EN8 7BY,Tel: 01992 717555, - ,,,No ratings yet Rate it yourself - /Services/opticians/LeaveReview/DefaultView.aspx?id=OP_5GJ_9521__000002_EN87BY,0,0,
Vaid Optometrists,12052009__000001_EN87BX,OPT,108 High Street,,Waltham Cross,Hertfordshire,,EN8 7BX,Tel: 01992 718451, - ,,,No ratings yet Rate it yourself - /Services/opticians/LeaveReview/DefaultView.aspx?id=12052009__000001_EN87BX,0,0,
Vision Express Opticians Ltd - Welwyn Garden City,,OPT,, 61 Howardsgate ,,Welwyn Garden City,,AL8 6BB,, - ,,,N/A - Data not available,,,
Vision Express Welwyn Garden City,TP9K6,OPT,,61 Howardsgate,,Herts,,AL8 6BB,, - ,,,No ratings yet Rate it yourself - /Services/opticians/LeaveReview/DefaultView.aspx?id=TP9K6,0,0,
Bayfields Opticians,OP_5GG_6847__000001_AL86HA,OPT,39 The Howard Centre,Howardsgate,Welwyn Garden City,Hertfordshire,,AL8 6HA,Tel: 01707 392919, - ,,,7 ratings Rate it yourself - /Services/opticians/LeaveReview/DefaultView.aspx?id=OP_5GG_6847__000001_AL86HA,,,
Boots-Welwyn Garden City - Howard Centre,OP_5GG_1231__000002_AL86HA,OPT,15 The Howard Centre,Howardsgate,,Welwyn Garden City,Hertfordshire,AL8 6HA,Tel: 01707 322495, - ,,,1 rating Rate it yourself - /Services/opticians/LeaveReview/DefaultView.aspx?id=OP_5GG_1231__000002_AL86HA,,,
Boots-Welwyn Garden City - Howard Gate,AL8 6PU_19283,OPT,,38-40 Howards Gate,,Welwyn Garden City,Hertfordshire,AL8 6PU,Tel: 01707 327 130, - ,,,No ratings yet Rate it yourself - /Services/opticians/LeaveReview/DefaultView.aspx?id=AL8 6PU_19283,0,0,
Jeremy Solomon Opticians,OP_5GG_11321__000001_AL86BP,OPT,,62 Howardsgate,,Welwyn Garden City,,AL8 6BP,Tel: 01707 334455, - ,,,1 rating Rate it yourself - /Services/opticians/LeaveReview/DefaultView.aspx?id=OP_5GG_11321__000001_AL86BP,,,
Scrivens Opticians,OP_5GG_11792__000001_AL86AP,OPT,,47 Howardsgate,,Welwyn Garden City,,AL8 6AP,Tel: 01707 330077, - ,,,No ratings yet Rate it yourself - /Services/opticians/LeaveReview/DefaultView.aspx?id=OP_5GG_11792__000001_AL86AP,0,0,
Patrick & Menzies,OP_TAG_1588__000001_CM71JX,OPT,84 High Street,,Braintree,Essex,,CM7 1JP,Tel: 01376 320419, - ,,,No ratings yet Rate it yourself - /Services/opticians/LeaveReview/DefaultView.aspx?id=OP_TAG_1588__000001_CM71JX,0,0,
Specsavers Opticians,OP_TAG_13854__000001_CM71JP,OPT,68 High Street,,Braintree,Essex,,CM7 1JP,Tel: 01376 552247, - ,,,2 ratings Rate it yourself - /Services/opticians/LeaveReview/DefaultView.aspx?id=OP_TAG_13854__000001_CM71JP,,,
Dollond & Aitchison ,OP_5GG_8026__000001_AL86PW,OPT,24 Church Road,Welwyn Garden City,Hertfordshire,,,AL8 6PW,Tel: 01707 327130, - ,,,No ratings yet Rate it yourself - /Services/opticians/LeaveReview/DefaultView.aspx?id=OP_5GG_8026__000001_AL86PW,0,0,
Vision Express (UK) Ltd,OP_CM71UR_34504,OPT,,36-38 Bank Street,,Braintree,,CM7 1UR,, - ,,,No ratings yet Rate it yourself - /Services/opticians/LeaveReview/DefaultView.aspx?id=OP_CM71UR_34504,0,0,
Broomfield Opticians,OP_5JN_9929__000001_CM11SW,OPT,24 Broomfield Road,,Chelmsford,Essex,,CM1 1SW,Tel: 01245 352803, - ,,,No ratings yet Rate it yourself - /Services/opticians/LeaveReview/DefaultView.aspx?id=OP_5JN_9929__000001_CM11SW,0,0,
Boots-Braintree,OP_TAG_11408__000001_CM77TX,OPT,2-4 Great Square,,,Braintree,Essex,CM7 1TX,Tel: 01376 346319, - ,,,No ratings yet Rate it yourself - /Services/opticians/LeaveReview/DefaultView.aspx?id=OP_TAG_11408__000001_CM77TX,0,0,
Harley Eyecare,OP_TAG_4169__000001_CM71UT,OPT,Manor House,Little Square,Braintree,Essex,,CM7 1UT,Tel: 01376 321852, - ,,,No ratings yet Rate it yourself - /Services/opticians/LeaveReview/DefaultView.aspx?id=OP_TAG_4169__000001_CM71UT,0,0,
Yourhomevisits Limited,OPL01-26347TAK,OPT,,8 Hodson Place,,Enfield,,EN3 6XE,, - ,,,1 rating Rate it yourself - /Services/opticians/LeaveReview/DefaultView.aspx?id=OPL01-26347TAK,,,
Eye Gee Opticians,OP_5AJ_13310__000003_IG103ST,OPT,66 The Broadway,Debden,,Loughton,,IG10 3ST,Tel: 0208 508 5092, - ,,,No ratings yet Rate it yourself - /Services/opticians/LeaveReview/DefaultView.aspx?id=OP_5AJ_13310__000003_IG103ST,0,0,
Opticial Express,OPT_CM11LN_1,OPT,,"Ground Floor, Marlborough House",,Chelmsford,,CM1 1LN,, - ,,,No ratings yet Rate it yourself - /Services/opticians/LeaveReview/DefaultView.aspx?id=OPT_CM11LN_1,0,0,
Opticial Express,OP_12345_CM1 1LN,OPT,"Ground Floor, Marlborough House",Victoria Road South,,Chelmsford,Essex,CM1 1LN,Tel: 0800 023 2020, - ,,,No ratings yet Rate it yourself - /Services/opticians/LeaveReview/DefaultView.aspx?id=OP_12345_CM1 1LN,0,0,
Scher & Ward Opticians,OP_5AJ_2908__000001_IG101BR,OPT,278 High Road,,Loughton,Essex,,IG10 1RB,Tel: 020 8508 5852, - ,,,1 rating Rate it yourself - /Services/opticians/LeaveReview/DefaultView.aspx?id=OP_5AJ_2908__000001_IG101BR,,,
GoldsmithWebb,OP_5JN_11793__000001_CM11LU,OPT,19 Market Road,,Chelmsford,Essex,,CM1 1LU,Tel: 01245 260555, - ,,,No ratings yet Rate it yourself - /Services/opticians/LeaveReview/DefaultView.aspx?id=OP_5JN_11793__000001_CM11LU,0,0,
Bird & Fairley,OP_5AJ_3042__000001_IG101AH,OPT,269 High Road,,,Loughton,Essex,IG10 1AH,Tel: 0208 508 4070, - ,,,No ratings yet Rate it yourself - /Services/opticians/LeaveReview/DefaultView.aspx?id=OP_5AJ_3042__000001_IG101AH,0,0,
David Clulow Opticians,NEW WEPCT__000002_IG101AH,OPT,297 High Road,,Loughton,Essex,,IG10 1AH,Tel: 0208 502 5259, - ,,,No ratings yet Rate it yourself - /Services/opticians/LeaveReview/DefaultView.aspx?id=NEW WEPCT__000002_IG101AH,0,0,
Vision Express Opticians,OP_5JN_13317__000001_CM11XR,OPT,Unit 5 High Chelmer Shopping Ctr,,Chelmsford,Essex,,CM1 1XR,Tel: 01245 251313, - ,,,No ratings yet Rate it yourself - /Services/opticians/LeaveReview/DefaultView.aspx?id=OP_5JN_13317__000001_CM11XR,0,0,
Boots-Loughton,IG10 1AD_19218,OPT,,247 High Road,,Loughton,Essex,IG10 1AD,Tel: 02085 087 497, - ,,,1 rating Rate it yourself - /Services/opticians/LeaveReview/DefaultView.aspx?id=IG10 1AD_19218,,,
Specsavers Opticians,OP_5AJ_14203__000001_IG101AD,OPT,231 High Road,,Loughton,Essex,,IG10 1AD,Tel: 0208 498 6740, - ,,,No ratings yet Rate it yourself - /Services/opticians/LeaveReview/DefaultView.aspx?id=OP_5AJ_14203__000001_IG101AD,0,0,
Specsavers Opticians,OP_5JN_2616__000001_CM11DX,OPT,92-93 High Street,,,Chelmsford,,CM1 1DX,Tel: 01245 600000, - ,,,No ratings yet Rate it yourself - /Services/opticians/LeaveReview/DefaultView.aspx?id=OP_5JN_2616__000001_CM11DX,0,0,
Boots-Chelmsford - High Chelmer,OP_5JN_13300__000001_CM11XG,OPT,"Unit 2b, High Chelmer East",,,Chelmsford,Essex,CM1 1XG,Tel: 01245 354027, - ,,,4 ratings Rate it yourself - /Services/opticians/LeaveReview/DefaultView.aspx?id=OP_5JN_13300__000001_CM11XG,,,
Healthcall Optical Services,OP_5EK_14984__000005_S92EH,OPT,County Square,100 New London Road,Chelmsford,Essex,,CM2 0RG,Tel: 01245 261811, - ,,,No ratings yet Rate it yourself - /Services/opticians/LeaveReview/DefaultView.aspx?id=OP_5EK_14984__000005_S92EH,0,0,
Blink Opticians,OP_5PX_11885__000001_CM20SW,OPT,22 New London Road,High Chelmer Shopping Centre,Chelmsford,Essex,,CM2 0SW,Tel: 01245 347666, - ,,,No ratings yet Rate it yourself - /Services/opticians/LeaveReview/DefaultView.aspx?id=OP_5PX_11885__000001_CM20SW,0,0,
Atkinson Opticians Ltd,OP_5AJ_794__000001_IG101DX,OPT,24 Forest Road,,Loughton,,,IG10 1DX,Tel: 0208 508 1325, - ,,,No ratings yet Rate it yourself - /Services/opticians/LeaveReview/DefaultView.aspx?id=OP_5AJ_794__000001_IG101DX,0,0,
Boots-Chelmsford - High St,OP_5JN_167__000001_CM11DH,OPT,60 High Street,,,Chelmsford,Essex,CM1 1DH,Tel: 01245 353 654, - ,,,1 rating Rate it yourself - /Services/opticians/LeaveReview/DefaultView.aspx?id=OP_5JN_167__000001_CM11DH,,,
Boatmans Optical,OP_5JN_3705__000001_CM20LD,OPT,175 Moulsham Street,,Chelmsford,Essex,,CM2 0LD,Tel: 01245 264659, - ,,,No ratings yet Rate it yourself - /Services/opticians/LeaveReview/DefaultView.aspx?id=OP_5JN_3705__000001_CM20LD,0,0,
Optical Express,CM26JE_12356,OPT,,31 Springfield Road,,Chelmsford,,CM2 6JE,Tel: 0800 0232020, - ,,,No ratings yet Rate it yourself - /Services/opticians/LeaveReview/DefaultView.aspx?id=CM26JE_12356,0,0,
Enfield Eye Care,OP_EN35UQ_46387,OPT,,555 Hertford Road,,Enfield,,EN3 5UQ,Tel: 0208 804 1509, - ,,,No ratings yet Rate it yourself - /Services/opticians/LeaveReview/DefaultView.aspx?id=OP_EN35UQ_46387,0,0,
"Charrington, Cross, Liversidge & Partners",OP_5C1_8770__000001_EN35UQ,OPT,555 Hertford Road,Enfield,London,Middx,,EN3 5UQ,Tel: 020 8804 1509, - ,,,No ratings yet Rate it yourself - /Services/opticians/LeaveReview/DefaultView.aspx?id=OP_5C1_8770__000001_EN35UQ,0,0,
J Bryan Opticians Ltd,OP_5JN_12108__000002_CM26FD,OPT,,33 The Meadows Shopping Centre,,Chelmsford,Essex,CM2 6FD,Tel: 01245 357766, - ,,,No ratings yet Rate it yourself - /Services/opticians/LeaveReview/DefaultView.aspx?id=OP_5JN_12108__000002_CM26FD,0,0,
"OSAGIE, HENRY",10036__000001_IG103HT,OPT,61 The Lindens,Loughton,Essex,,,IG10 3HT,Tel: 020 8965 6707, - ,,,No ratings yet Rate it yourself - /Services/opticians/LeaveReview/DefaultView.aspx?id=10036__000001_IG103HT,0,0,
Andrew Merry ,OP_5GH_3629__000001_SG63ED,OPT,29 Leys Avenue,,Letchworth,,,SG6 3ED,Tel: 01462 486123, - ,,,No ratings yet Rate it yourself - /Services/opticians/LeaveReview/DefaultView.aspx?id=OP_5GH_3629__000001_SG63ED,0,0,
Boots-Letchworth,CO-4090,OPT,19 Commerce Way,,,Letchworth Garden City,Hertfordshire,SG6 3DN,Tel: 01462 681805, - ,,,No ratings yet Rate it yourself - /Services/opticians/LeaveReview/DefaultView.aspx?id=CO-4090,0,0,