Organisation Name,NACS Code,Organisation Type,Address1,Address2,Address3,Address4,Address5,PostCode,Telephone Number,Opening time,Value  (Opening time),Banding Classification  (Opening time),NHS.UK users rating,Value  (NHS.UK users rating),Banding Classification  (NHS.UK users rating),Car parking (Is there car parking at this organisation?)
Tudball (Opticians) Ltd,OP_5M8_2234__000001_BS206AH,OPT,,Tudball Opticians,95 Hill Road,CLEVEDON,,BS21 7PN,Tel: 01275 343 353, - ,,,No ratings yet Rate it yourself - /Services/opticians/LeaveReview/DefaultView.aspx?id=OP_5M8_2234__000001_BS206AH,0,0,
Tudball (Opticians) Ltd,OP_5M8_8889__000001_BS217PN,OPT,95 Hill Road,Clevedon,North Somerset,,,BS21 7PN,Tel: 01275 343353, - ,,,No ratings yet Rate it yourself - /Services/opticians/LeaveReview/DefaultView.aspx?id=OP_5M8_8889__000001_BS217PN,0,0,
Vision Express Opticians,OP_5M8_12104__000001_BS217NZ,OPT,20 Hill Road,,North Somerset,Clevedon,,BS21 7NZ,Tel: 01275 873536, - ,,,No ratings yet Rate it yourself - /Services/opticians/LeaveReview/DefaultView.aspx?id=OP_5M8_12104__000001_BS217NZ,0,0,
Optika,OP_5M8_518__000001_BS231HL,OPT,81 The High Street,,,"Weston-Super-Mare, North Somerset",,BS23 1HE,Tel: 01934 642909, - ,,,No ratings yet Rate it yourself - /Services/opticians/LeaveReview/DefaultView.aspx?id=OP_5M8_518__000001_BS231HL,0,0,
Specsavers Opticians,OP_5M8_8224__000001_BS231HE,OPT,75 High Street,Weston-Super-Mare,North Somerset,,,BS23 1HE,Tel: 01934 642140, - ,,,No ratings yet Rate it yourself - /Services/opticians/LeaveReview/DefaultView.aspx?id=OP_5M8_8224__000001_BS231HE,0,0,
Greenslade Opticians,OP_5M8_12325__000001_BS231HD,OPT,51 High Street,Weston-Super-Mare,North Somerset,,,BS23 1HD,Tel: 01934 629755, - ,,,No ratings yet Rate it yourself - /Services/opticians/LeaveReview/DefaultView.aspx?id=OP_5M8_12325__000001_BS231HD,0,0,
Boots-Weston-Super-Mare,OP_5M8_5109__000002_BS231HD,OPT,37 High Street,,,Weston Super Mare,,BS23 1HD,Tel: 01934 629 852, - ,,,2 ratings Rate it yourself - /Services/opticians/LeaveReview/DefaultView.aspx?id=OP_5M8_5109__000002_BS231HD,,,
Darlingtons,OP_5M8_14816__000002_BS231QH,OPT,44 Meadow Street,Weston-Super-Mare,North Somerset,,,BS23 1QH,Tel: 01934 631539, - ,,,No ratings yet Rate it yourself - /Services/opticians/LeaveReview/DefaultView.aspx?id=OP_5M8_14816__000002_BS231QH,0,0,
NK Opticians,OP_5M8_6391__000001_BS231QH,OPT,40 Meadow Street,Weston-Super-Mare,North Somerset,,,BS23 1QH,Tel: 01934 628820, - ,,,No ratings yet Rate it yourself - /Services/opticians/LeaveReview/DefaultView.aspx?id=OP_5M8_6391__000001_BS231QH,0,0,
Spex Appeal Ltd,OP_5M8_8712__000001_BS216NN,OPT,29 Old Church Road,Clevedon,North Somerset,,,BS21 6NN,Tel: 01275 873559, - ,,,No ratings yet Rate it yourself - /Services/opticians/LeaveReview/DefaultView.aspx?id=OP_5M8_8712__000001_BS216NN,0,0,
Armstrong & North ,OP_5M8_148__000001_BS231TR,OPT,,55c Oxford Street,,Weston Super Mare,,BS23 1TR,Tel: 01934 626579, - ,,,No ratings yet Rate it yourself - /Services/opticians/LeaveReview/DefaultView.aspx?id=OP_5M8_148__000001_BS231TR,0,0,
Boots-Clevedon,OP_5M8_4612__000001_BS216LZ,OPT,9 Old Church Road,,,Clevedon,Avon,BS21 6LZ,Tel: 01275 877 877, - ,,,No ratings yet Rate it yourself - /Services/opticians/LeaveReview/DefaultView.aspx?id=OP_5M8_4612__000001_BS216LZ,0,0,
Bowen Opticians,OP_5M8_8094__000001_BS226HQ,OPT,135 High Street,Worle,North Somerset,,,BS22 6HQ,Tel: 01934 520520, - ,,,No ratings yet Rate it yourself - /Services/opticians/LeaveReview/DefaultView.aspx?id=OP_5M8_8094__000001_BS226HQ,0,0,
Bowen Opticians,OP_5M8_13133__000002_BS233SS,OPT,,135 High Street,Worle,Weston-super-Mare,Avon,BS22 6HQ,Tel: 01934 520520, - ,,,No ratings yet Rate it yourself - /Services/opticians/LeaveReview/DefaultView.aspx?id=OP_5M8_13133__000002_BS233SS,0,0,
Stephen Bryson Opticians,OP_5M8_13183__000001_BS226JD,OPT,184a High Street,Worle,North Somerset,,,BS22 6JD,Tel: 01934 512838, - ,,,No ratings yet Rate it yourself - /Services/opticians/LeaveReview/DefaultView.aspx?id=OP_5M8_13183__000001_BS226JD,0,0,
Dyer & Scott,OP_5M8_9345__000001_BS206AJ,OPT,96 High Street,Portishead,North Somerset,,,BS20 6AJ,Tel: 01275 842504, - ,,,No ratings yet Rate it yourself - /Services/opticians/LeaveReview/DefaultView.aspx?id=OP_5M8_9345__000001_BS206AJ,0,0,
Darlington Opticians,OP_5M8_14823__000001_BS206AG,OPT,55 High Street,Portishead,North Somerset,,,BS20 6AG,Tel: 01275 818427, - ,,,No ratings yet Rate it yourself - /Services/opticians/LeaveReview/DefaultView.aspx?id=OP_5M8_14823__000001_BS206AG,0,0,
Bell & Stenton Ltd,OP_5M8_11852__000001_BS494HJ,OPT,52 High Street,Yatton,North Somerset,,,BS49 4HJ,Tel: 01934 838818, - ,,,No ratings yet Rate it yourself - /Services/opticians/LeaveReview/DefaultView.aspx?id=OP_5M8_11852__000001_BS494HJ,0,0,
Boots-Nailsea,OP_5M8_12555__000002_BS481RQ,OPT,1-2 Colliers Walk,Crown Glass Shopping Centre,,Nailsea,Somerset,BS48 1RH,Tel: 01275 856074, - ,,,No ratings yet Rate it yourself - /Services/opticians/LeaveReview/DefaultView.aspx?id=OP_5M8_12555__000002_BS481RQ,0,0,
Sight Centres Ltd,OP_5M8_7558__000001_BS481RG,OPT,14 Colliers Walk,Nailsea,Bristol,,,BS48 1RG,Tel: 01275 810301, - ,,,No ratings yet Rate it yourself - /Services/opticians/LeaveReview/DefaultView.aspx?id=OP_5M8_7558__000001_BS481RG,0,0,
Specsavers,OP_5M8_14822__000002_BS481RP,OPT,2 Somerset Square,Nailsea,North Somerset,,,BS48 1RP,Tel: 01275 850950, - ,,,No ratings yet Rate it yourself - /Services/opticians/LeaveReview/DefaultView.aspx?id=OP_5M8_14822__000002_BS481RP,0,0,
Lynne Fernandes Optometrists,OP_5M8_14821__000001_BS481AW,OPT,124a High Street,Nailsea,,North Somerset,,BS48 1AH,Tel: 01275 854946, - ,,,2 ratings Rate it yourself - /Services/opticians/LeaveReview/DefaultView.aspx?id=OP_5M8_14821__000001_BS481AW,,,
Orriss & Low,OP_5M8_6588__000001_BS251AQ,OPT,2-4 Corner House,Corner House,Woodborough Road,Winscombe,Somerset,BS25 1AQ,Tel: 01934 843713, - ,,,No ratings yet Rate it yourself - /Services/opticians/LeaveReview/DefaultView.aspx?id=OP_5M8_6588__000001_BS251AQ,0,0,yes
Costco Wholesale UK Ltd,CO-1833-2,OPT,,St Brendans Way,,Bristol,,BS11 9EZ,Tel: 0117 916 0145, - ,,,No ratings yet Rate it yourself - /Services/opticians/LeaveReview/DefaultView.aspx?id=CO-1833-2,0,0,
Marian Donovan Optometrist,OP_5M8_14820__000001_BS405LD,OPT,Broad Street,,Wrington,North Somerset,,BS40 5LD,Tel: 01934 862933, - ,,,No ratings yet Rate it yourself - /Services/opticians/LeaveReview/DefaultView.aspx?id=OP_5M8_14820__000001_BS405LD,0,0,yes
D J Bull,OP_5FW_13584__000002_TA81PB,OPT,41 High Street,Burnham On Sea,Somerset,,,TA8 1PB,Tel: 01278 785743, - ,,,No ratings yet Rate it yourself - /Services/opticians/LeaveReview/DefaultView.aspx?id=OP_5FW_13584__000002_TA81PB,0,0,
A H Meyrick Ltd,OP_5FW_7499__000001_TA81PA,OPT,31 High Street,Burnham-on-Sea,,Somerset,,TA8 1PA,Tel: 01278 782034, - ,,,No ratings yet Rate it yourself - /Services/opticians/LeaveReview/DefaultView.aspx?id=OP_5FW_7499__000001_TA81PA,0,0,
Specsavers,OP_5QL_71__000001_TA81NX,OPT,3 High Street,,Burnham On Sea,Somerset,,TA8 1NX,Tel: 01278 765460, - ,,,No ratings yet Rate it yourself - /Services/opticians/LeaveReview/DefaultView.aspx?id=OP_5QL_71__000001_TA81NX,0,0,
Andrew Pinn Optometrists,OP_5JF_6143__000001_BS110DP,OPT,12 High Street,Shirehampton,,Bristol,,BS11 0DP,Tel: 0117 982 2269, - ,,,2 ratings Rate it yourself - /Services/opticians/LeaveReview/DefaultView.aspx?id=OP_5JF_6143__000001_BS110DP,,,
Iris Eye Care Optometrists ,GOC CO-3924,OPT,,"Birdwell Clinic, 33 Weston Road",,"Birdwell Clinic, 33 Weston Road",,BS41 9AA,Tel: 01275 393149 (ext. 0789154552), - ,,,No ratings yet Rate it yourself - /Services/opticians/LeaveReview/DefaultView.aspx?id=GOC CO-3924,0,0,yes
Vision Call (Bristol) Ltd,CO- 2321/5FL__000001_BS419LB,OPT,Yanley Court,Long Ashton Business Park,Long Ashton,North Somerset,,BS41 9LB,Tel: 01275 393 507, - ,,,No ratings yet Rate it yourself - /Services/opticians/LeaveReview/DefaultView.aspx?id=CO- 2321/5FL__000001_BS419LB,0,0,
Armstrong & North Opticians,OP_5JF_5604__000002_BS107DR,OPT,161 Crow Lane,Henbury,,Bristol,,BS10 7DR,Tel: 0117 9501868, - ,,,No ratings yet Rate it yourself - /Services/opticians/LeaveReview/DefaultView.aspx?id=OP_5JF_5604__000002_BS107DR,0,0,
Boots-Bristol - Westbury On Trym,OP_5JF_3779__000001_BS93DB,OPT,3 Canford Lane,Westbury-on-Trym,Bristol,Bristol,,BS9 3DB,Tel: 0117 950 7878, - ,,,No ratings yet Rate it yourself - /Services/opticians/LeaveReview/DefaultView.aspx?id=OP_5JF_3779__000001_BS93DB,0,0,
Vision Express,OP_5JF_8289__000001_BS93DU,OPT,8 High Street,Westbury-on-Trym,Bristol,,,BS9 3DU,Tel: 0117 9507151, - ,,,No ratings yet Rate it yourself - /Services/opticians/LeaveReview/DefaultView.aspx?id=OP_5JF_8289__000001_BS93DU,0,0,
N K Opticians,CO - 3455__000002_BS273NA,OPT,Myrtle House,Bath Street,Cheddar,Somerset,,BS27 3AA,Tel: 01934 743723, - ,,,1 rating Rate it yourself - /Services/opticians/LeaveReview/DefaultView.aspx?id=CO - 3455__000002_BS273NA,,,
Scrivens Opticians,OP_5JG_11126__000001_BS84BX,OPT,15 Princess Victoria Street,Clifton,Bristol,Bristol,,BS8 4BX,Tel: 01272 737764, - ,,,No ratings yet Rate it yourself - /Services/opticians/LeaveReview/DefaultView.aspx?id=OP_5JG_11126__000001_BS84BX,0,0,
Newsom & Davies Opticians,OP_5JF_2055__000001_BS94JU,OPT,45 Henleaze Road,,Bristol,,,BS9 4JU,Tel: 0117 962 2612, - ,,,No ratings yet Rate it yourself - /Services/opticians/LeaveReview/DefaultView.aspx?id=OP_5JF_2055__000001_BS94JU,0,0,
B A Vousden Ltd,OP_5JG_9372__000001_BS84HU,OPT,44 Regent Street,Clifton,Bristol,Bristol,,BS8 4HU,Tel: 0117 974 4944, - ,,,No ratings yet Rate it yourself - /Services/opticians/LeaveReview/DefaultView.aspx?id=OP_5JG_9372__000001_BS84HU,0,0,
Dyer & Scott,OP_5JG_7065__000002_BS82RP,OPT,120 Whiteladies Road,Clifton,Bristol,,,BS8 2RP,Tel: 0117 973 7667, - ,,,1 rating Rate it yourself - /Services/opticians/LeaveReview/DefaultView.aspx?id=OP_5JG_7065__000002_BS82RP,,,
Boots-Bristol - Clifton Down,BS8 2NN_94821,OPT,,"Unit 8a, Clifton Down Shopping Centre",Clifton,Bristol,,BS8 2NN,Tel: 01179 237319, - ,,,1 rating Rate it yourself - /Services/opticians/LeaveReview/DefaultView.aspx?id=BS8 2NN_94821,,,
Specsavers,OP_5JG_51__000003_BS82NN,OPT,15 Clifton Down Shopping Centre,Whiteladies Road,Bristol,,,BS8 2NN,Tel: 0117 946 6994, - ,,,No ratings yet Rate it yourself - /Services/opticians/LeaveReview/DefaultView.aspx?id=OP_5JG_51__000003_BS82NN,0,0,
Bristol Contact Lens Service,OP_5JF_4661__000001_BS67SL,OPT,126 Coldharbour Road,Redland,Bristol,,,BS6 7SL,Tel: 0117 9427833, - ,,,No ratings yet Rate it yourself - /Services/opticians/LeaveReview/DefaultView.aspx?id=OP_5JF_4661__000001_BS67SL,0,0,
Juul & Payne,OP_5JG_4755__000001_BS82DJ,OPT,Juul & Payne,70 Alma Rd,Clifton,Bristol,Avon,BS8 2DJ,Tel: 0117 9735929, - ,,,6 ratings Rate it yourself - /Services/opticians/LeaveReview/DefaultView.aspx?id=OP_5JG_4755__000001_BS82DJ,,,yes
Lea (Opticians) Ltd,OP_5JF_9370__000002_BS106AT,OPT,1 Arnside Road,Bristol,,,,BS10 6AT,Tel: 01272 505025, - ,,,No ratings yet Rate it yourself - /Services/opticians/LeaveReview/DefaultView.aspx?id=OP_5JF_9370__000002_BS106AT,0,0,
Amar Shah Optometrist,OP_5JG_12627__000001_BS66JX,OPT,52 Cotham Hill,,Bristol,,,BS6 6JX,Tel: 0117 9730335, - ,,,No ratings yet Rate it yourself - /Services/opticians/LeaveReview/DefaultView.aspx?id=OP_5JG_12627__000001_BS66JX,0,0,
David Phillips Opticians,OP_5JG_11857__000001_BS31JJ,OPT,230 North Street,Bedminister,Bristol,,,BS3 1JB,Tel: 0117 966 3417, - ,,,1 rating Rate it yourself - /Services/opticians/LeaveReview/DefaultView.aspx?id=OP_5JG_11857__000001_BS31JJ,,,
Goatman and Batham,OP_5JG_3296__000001_BS81EY,OPT,77 Queens Road,Clifton,Bristol,,,BS8 1QP,Tel: 0117 9262380, - ,,,1 rating Rate it yourself - /Services/opticians/LeaveReview/DefaultView.aspx?id=OP_5JG_3296__000001_BS81EY,,,
David Phillips Opticians,OP_5JG_7618__000002_BS31JD,OPT,230 North Street,Bedminster,Bristol,,,BS3 1JD,Tel: 0117 963 5477, - ,,,No ratings yet Rate it yourself - /Services/opticians/LeaveReview/DefaultView.aspx?id=OP_5JG_7618__000002_BS31JD,0,0,
Asda Wal-Mart Vision Centre,OP_5A3_12997__000002_BS345TL,OPT,Highwood Lane,Patchway,Bristol,Bristol,,BS34 5TL,Tel: 0117 9798289, - ,,,No ratings yet Rate it yourself - /Services/opticians/LeaveReview/DefaultView.aspx?id=OP_5A3_12997__000002_BS345TL,0,0,
Boots Opticians Ltd,OP_5A3_640__000003_BS345UP,OPT,"116 The Mall, Upper Level",Cribbs Causeway,Patchway,Bristol,,BS34 5UP,Tel: 0117 950 9649, - ,,,1 rating Rate it yourself - /Services/opticians/LeaveReview/DefaultView.aspx?id=OP_5A3_640__000003_BS345UP,,,
Vision Express,OP_5A3_682__000001_BS345GF,OPT,"8 The Mall, Lower Level","Cribbs Causeway Regional Shopping Centre, Patchway",Bristol,Bristol,,BS34 5GF,Tel: 0117 9500857, - ,,,No ratings yet Rate it yourself - /Services/opticians/LeaveReview/DefaultView.aspx?id=OP_5A3_682__000001_BS345GF,0,0,
M W Dunscombe Ltd,OP_5JG_12001__000001_BS14XH,OPT,7 St. Augustines Parade,,Bristol,,,BS1 4XH,Tel: 0117 927 2155, - ,,,No ratings yet Rate it yourself - /Services/opticians/LeaveReview/DefaultView.aspx?id=OP_5JG_12001__000001_BS14XH,0,0,
Lynne Fernandes Optometrists,OP_5JF_6000__000001_BS78AS,OPT,75 Gloucester Road,Bishopston,,Bristol,,BS7 8AS,Tel: 0117 942 6843, - ,,,2 ratings Rate it yourself - /Services/opticians/LeaveReview/DefaultView.aspx?id=OP_5JF_6000__000001_BS78AS,,,
Bramley Pope,OP_5JG_14825__000001_BS11JX,OPT,35 St. Stephens Street,,Bristol,,,BS1 1JX,Tel: 0117 9300035, - ,,,No ratings yet Rate it yourself - /Services/opticians/LeaveReview/DefaultView.aspx?id=OP_5JG_14825__000001_BS11JX,0,0,
Scrivens,OP_5JG_10172__000002_BS34EY,OPT,100 East Street,Bedminster,,Bristol,Avon,BS3 4EY,Tel: 0117 963 7105, - ,,,No ratings yet Rate it yourself - /Services/opticians/LeaveReview/DefaultView.aspx?id=OP_5JG_10172__000002_BS34EY,0,0,
Specs Savers,OP_5JG_9205__000001_BS34JY,OPT,East Street,Bedminster,Bristol,,,BS3 4JY,Tel: 0117 9231839, - ,,,No ratings yet Rate it yourself - /Services/opticians/LeaveReview/DefaultView.aspx?id=OP_5JG_9205__000001_BS34JY,0,0,
Specsavers Opticians,OP_5JG_5923__000001_BS12DD,OPT,1 and 7 Union Street,,Bristol,,,BS1 2DD,Tel: 0117 927 2931, - ,,,2 ratings Rate it yourself - /Services/opticians/LeaveReview/DefaultView.aspx?id=OP_5JG_5923__000001_BS12DD,,,
Specsavers Opticians,OP_5JG_12494__000001_BS34HH,OPT,9 Imperial Parade,East Street,Bristol,,,BS3 4HH,Tel: 0117 966 4000, - ,,,No ratings yet Rate it yourself - /Services/opticians/LeaveReview/DefaultView.aspx?id=OP_5JG_12494__000001_BS34HH,0,0,
Everybody,OP_5JG_138__000002_BS13ED,OPT,2 Castle Gallery,Broadmead,Bristol,,,BS1 3XE,Tel: 0117 929 7677, - ,,,No ratings yet Rate it yourself - /Services/opticians/LeaveReview/DefaultView.aspx?id=OP_5JG_138__000002_BS13ED,0,0,
David Clulow Opticians,OP_5JG_4665__000002_BS13XB,OPT,13 Broadmead Gallery,Broadmead,Bristol,,,BS1 3XB,Tel: 0117 925 4954, - ,,,No ratings yet Rate it yourself - /Services/opticians/LeaveReview/DefaultView.aspx?id=OP_5JG_4665__000002_BS13XB,0,0,
Boots-Bristol - Broadmead (in Boots UK),OP_5JG_704__000003_BS13ED,OPT,59 Broadmead,,Bristol,Bristol,,BS1 3EA,Tel: 0117 927 2418, - ,,,No ratings yet Rate it yourself - /Services/opticians/LeaveReview/DefaultView.aspx?id=OP_5JG_704__000003_BS13ED,0,0,
Paul White Opticians,OP_5JF_5728__000001_BS70PA,OPT,28 Filton Road,Horfield,,Bristol,,BS7 0PA,Tel: 0117 951 9339, - ,,,No ratings yet Rate it yourself - /Services/opticians/LeaveReview/DefaultView.aspx?id=OP_5JF_5728__000001_BS70PA,0,0,
Specsavers Bristol City Centre,TP15R,OPT,,30-32 Merchant Street,,Bristol,,BS1 3EP,Tel: 0117 922 5288, - ,,,No ratings yet Rate it yourself - /Services/opticians/LeaveReview/DefaultView.aspx?id=TP15R,0,0,
Dollond & Aitchison,OP_5JG_3031__000001_BS13HH,OPT,8 Broadmead,,Bristol,,,BS1 3HH,Tel: 0117 926 2859, - ,,,No ratings yet Rate it yourself - /Services/opticians/LeaveReview/DefaultView.aspx?id=OP_5JG_3031__000001_BS13HH,0,0,
Vision Express,OP_5JG_12626__000001_BS13HF,OPT,9 Broadmead,,Bristol,,,BS1 3HF,Tel: 0117 929 2206, - ,,,No ratings yet Rate it yourself - /Services/opticians/LeaveReview/DefaultView.aspx?id=OP_5JG_12626__000001_BS13HF,0,0,
Christine Townsend Opticians,OP_5JF_370__000001_BS70BE,OPT,384 Filton Avenue,Horfield,,Bristol,,BS7 0BE,Tel: 0117 979 9942, - ,,,No ratings yet Rate it yourself - /Services/opticians/LeaveReview/DefaultView.aspx?id=OP_5JF_370__000001_BS70BE,0,0,
Specsavers Opticians,OP_5A3_11418__000001_BS347BT,OPT,5 Church View,Filton,Bristol,,,BS34 7BT,Tel: 0117 969 3513, - ,,,No ratings yet Rate it yourself - /Services/opticians/LeaveReview/DefaultView.aspx?id=OP_5A3_11418__000001_BS347BT,0,0,
Boots-Bristol - Patchway,OP_5A3_10555__000001_BS345PA,OPT,4 Coniston Road,Patchway,,Bristol,,BS34 5PA,Tel: 01179 692727, - ,,,No ratings yet Rate it yourself - /Services/opticians/LeaveReview/DefaultView.aspx?id=OP_5A3_10555__000001_BS345PA,0,0,
Healthcall Optical Services Ltd,OP_5JF_11771__000002_BS20BH,OPT,6-7 Hide Market,West Street,St. Philips,,,BS2 0BH,Tel: 0117 954 3700, - ,,,No ratings yet Rate it yourself - /Services/opticians/LeaveReview/DefaultView.aspx?id=OP_5JF_11771__000002_BS20BH,0,0,
C M Lea (Opticians) Ltd,OP_5JF_1481__000002_BS50RB,OPT,62 Stapleton Road,,Bristol,,,BS5 0RB,Tel: 0117 9557625, - ,,,No ratings yet Rate it yourself - /Services/opticians/LeaveReview/DefaultView.aspx?id=OP_5JF_1481__000002_BS50RB,0,0,
Brock & Houlford,OP_5FL_10314__000001_BS408PR,OPT,33 High Street,Chew Magna,Bristol,,,BS40 8PR,Tel: 01275 332882, - ,,,No ratings yet Rate it yourself - /Services/opticians/LeaveReview/DefaultView.aspx?id=OP_5FL_10314__000001_BS408PR,0,0,
Lynne Fernandes Optometrists,OP_5JG_6422__000002_BS42AL,OPT,182a Wells Road,Knowle,,Bristol,,BS4 2AL,Tel: 0117 977 6330, - ,,,2 ratings Rate it yourself - /Services/opticians/LeaveReview/DefaultView.aspx?id=OP_5JG_6422__000002_BS42AL,,,
Specsavers,00147__000002_TA245UF,OPT,4 Floyds Corner,,Minehead,Somerset,,TA24 5UF,, - ,,,No ratings yet Rate it yourself - /Services/opticians/LeaveReview/DefaultView.aspx?id=00147__000002_TA245UF,0,0,
Cranmers Optometrists,OP_5FW_3616__000001_TA245LZ,OPT,12 Park Street,,,Minehead,Somerset,TA24 5NQ,Tel: 01643 702204, - ,,,1 rating Rate it yourself - /Services/opticians/LeaveReview/DefaultView.aspx?id=OP_5FW_3616__000001_TA245LZ,,,
Exmoor Eyecare,OP_5FW_6431__000001_TA245NF,OPT,3 The Parks,Minehead,Somerset,Somerset,,TA24 5NF,Tel: 01643 702983, - ,,,2 ratings Rate it yourself - /Services/opticians/LeaveReview/DefaultView.aspx?id=OP_5FW_6431__000001_TA245NF,,,
Dury & Shaw Ltd,OP_5JG_9432__000002_BS140SX,OPT,5 Asda Centre,Oatlands Avenue,Bristol,,,BS14 0SX,Tel: 01275 839331, - ,,,No ratings yet Rate it yourself - /Services/opticians/LeaveReview/DefaultView.aspx?id=OP_5JG_9432__000002_BS140SX,0,0,
Brock & Houlford,TP7M0,OPT,Westway Farm,Wick Road,Bishop Sutton,Bristol,,BS39 5XP,Tel: 01275 332882, - ,,,No ratings yet Rate it yourself - /Services/opticians/LeaveReview/DefaultView.aspx?id=TP7M0,0,0,
David Kear Opticians,OP_5KX_4608__000002_GL168HF,OPT,David Kear Opticians,10 High Street,,Coleford,Gloucestershire,GL16 8HF,Tel: 01594 832968, - ,,,No ratings yet Rate it yourself - /Services/opticians/LeaveReview/DefaultView.aspx?id=OP_5KX_4608__000002_GL168HF,0,0,
Rogers Optical (trading as Boots Opticians),01-26179,OPT,,66 High Street,,Somerset,,BA5 2AJ,, - ,,,1 rating Rate it yourself - /Services/opticians/LeaveReview/DefaultView.aspx?id=01-26179,,,
David & Sandra Millican Opticians,OP_5FX_8575__000001_BA52AQ,OPT,75 High Street,Wells,Somerset,,,BA5 2AQ,Tel: 01749 673991, - ,,,No ratings yet Rate it yourself - /Services/opticians/LeaveReview/DefaultView.aspx?id=OP_5FX_8575__000001_BA52AQ,0,0,
Specsavers,OP_5FX_9046__000001_BA52SN,OPT,60a High Street,Wells,Somerset,,,BA5 2SN,Tel: 01749 673 694, - ,,,1 rating Rate it yourself - /Services/opticians/LeaveReview/DefaultView.aspx?id=OP_5FX_9046__000001_BA52SN,,,
R A Mansfield Opticians,OP_5FX_4104__000001_BA52AG,OPT,65 High Street,Wells,Somerset,,,BA5 2AG,Tel: 01749 672229, - ,,,No ratings yet Rate it yourself - /Services/opticians/LeaveReview/DefaultView.aspx?id=OP_5FX_4104__000001_BA52AG,0,0,
Vision Express (UK) Ltd,OPL 1405QL__000001_BA52AE,OPT,43 High Street,,,Wells,,BA5 2AE,Tel: 01749 674111, - ,,,No ratings yet Rate it yourself - /Services/opticians/LeaveReview/DefaultView.aspx?id=OPL 1405QL__000001_BA52AE,0,0,
