Organisation Name,NACS Code,Organisation Type,Address1,Address2,Address3,Address4,Address5,PostCode,Telephone Number,Opening time,Value  (Opening time),Banding Classification  (Opening time),NHS.UK users rating,Value  (NHS.UK users rating),Banding Classification  (NHS.UK users rating),Car parking (Is there car parking at this organisation?)
Tesco Opticians,WD6 1JG,OPT,,Shenley Road,,Borehamwood,,WD6 1JG,Tel: 0345 601 3479, - ,,,No ratings yet Rate it yourself - /Services/opticians/LeaveReview/DefaultView.aspx?id=WD6 1JG,0,0,
Boots-Borehamwood,OP_5CP_9725__000001_WD61AW,OPT,181 Shenley Road,,,Borehamwood,Hertfordshire,WD6 1AW,Tel: 0208 953 3120, - ,,,1 rating Rate it yourself - /Services/opticians/LeaveReview/DefaultView.aspx?id=OP_5CP_9725__000001_WD61AW,,,
Insight Opticians,OP_5CP_2153__000002_WD61AH,OPT,167 Shenley Road,Borehamwood,Hertfordshire,,,WD6 1AH,Tel: 020 8207 1074, - ,,,1 rating Rate it yourself - /Services/opticians/LeaveReview/DefaultView.aspx?id=OP_5CP_2153__000002_WD61AH,,,
Boots-Barnet,OP1691__000006_EN55UR,OPT,77 High Street,,Barnet,Herts,,EN5 5UR,Tel: 020 8275 1689, - ,,,1 rating Rate it yourself - /Services/opticians/LeaveReview/DefaultView.aspx?id=OP1691__000006_EN55UR,,,
Central Park Eyecare,EN55SN190814,OPT,,88A High Street,,London,,EN5 5SN,Tel: 0208 440 9950, - ,,,No ratings yet Rate it yourself - /Services/opticians/LeaveReview/DefaultView.aspx?id=EN55SN190814,0,0,
Visual Eyes - Gary Swerner Opticians,OP_5A9_1688__000001_EN55SN,OPT,92 High Street,Barnet,Hertfordshire,,,EN5 5SN,Tel: 020 8441 1200, - ,,,No ratings yet Rate it yourself - /Services/opticians/LeaveReview/DefaultView.aspx?id=OP_5A9_1688__000001_EN55SN,0,0,
Specsavers Opticians,OP_5A9_6986__000001_EN55XQ,OPT,104 High Street,Barnet,Hertfordshire,,,EN5 5XQ,Tel: 020 8364 8881, - ,,,No ratings yet Rate it yourself - /Services/opticians/LeaveReview/DefaultView.aspx?id=OP_5A9_6986__000001_EN55XQ,0,0,
Vision Express Barnet,OP1690__000001_EN55UZ,OPT,103 - 105 High Street,,Barnet,Herts,,EN5 5UZ,Tel: 020 8440 6361, - ,,,No ratings yet Rate it yourself - /Services/opticians/LeaveReview/DefaultView.aspx?id=OP1690__000001_EN55UZ,0,0,
Specs Direct,OP_5A9_7932__000002_EN55SA,OPT,129 High Street,High Barnet,Barnet,Herts,Hertfordshire,EN5 5UZ,Tel: 020 8449 1993, - ,,,No ratings yet Rate it yourself - /Services/opticians/LeaveReview/DefaultView.aspx?id=OP_5A9_7932__000002_EN55SA,0,0,
Barnet Opticians,OP_5A9_4668__000002_EN55XP,OPT,172 High Street,,Barnet,,,EN5 5XP,Tel: 020 8440 0258, - ,,,No ratings yet Rate it yourself - /Services/opticians/LeaveReview/DefaultView.aspx?id=OP_5A9_4668__000002_EN55XP,0,0,
Scrivens Opticians,OP_5A9_12214__000002_NW73DA,OPT,47 The Broadway,Mill Hill,London,London,,NW7 3DA,Tel: 020 8906 0626, - ,,,No ratings yet Rate it yourself - /Services/opticians/LeaveReview/DefaultView.aspx?id=OP_5A9_12214__000002_NW73DA,0,0,
Boots-Mill Hill,OP_5A9_7236__000001_NW73LL,OPT,14 The Broadway,,Mill Hill,London,,NW7 3LL,Tel: 0208 201 1817, - ,,,No ratings yet Rate it yourself - /Services/opticians/LeaveReview/DefaultView.aspx?id=OP_5A9_7236__000001_NW73LL,0,0,
Susan Leighter,OP_5A9_13664__000001_HA88JE,OPT,41 Fairview Way,Edgware,Middlesex,,,HA8 8JE,Tel: 020 8958 2211, - ,,,No ratings yet Rate it yourself - /Services/opticians/LeaveReview/DefaultView.aspx?id=OP_5A9_13664__000001_HA88JE,0,0,
Foster Opticians,OP_5A9_11007__000001_EN51AD,OPT,7 Western Parade,Great North Road,Barnet,Barnet,,EN5 1AD,Tel: 020 8440 0196, - ,,,No ratings yet Rate it yourself - /Services/opticians/LeaveReview/DefaultView.aspx?id=OP_5A9_11007__000001_EN51AD,0,0,
Home Eyecare Limited,OP_EN191PH_34835,OPT,Falcon House,40 Green Lane,,Edgware,Middlesex,HA8 7PT,Tel: 0208 5906666, - ,,,No ratings yet Rate it yourself - /Services/opticians/LeaveReview/DefaultView.aspx?id=OP_EN191PH_34835,0,0,
Specsavers Opticians,OP_5A9_13676__000004_HA87BD,OPT,3 Broadwalk Shopping Centre,Station Road,Edgware,,,HA8 7BD,Tel: 020 8952 2262, - ,,,No ratings yet Rate it yourself - /Services/opticians/LeaveReview/DefaultView.aspx?id=OP_5A9_13676__000004_HA87BD,0,0,
Vision Express (uk) Ltd,VISION EXPRESS (UK) LTD_HA8 7BD,OPT,,"Unit 6b, Broadwalk Shopping Centre",,"Edgware, Middlesex,",,HA8 7BD,, - ,,,No ratings yet Rate it yourself - /Services/opticians/LeaveReview/DefaultView.aspx?id=VISION EXPRESS (UK) LTD_HA8 7BD,0,0,
Vaid Optometrists,OP_5A9_10905__000001_HA87AA,OPT,132 Station Road,Edgware,Middlesex,,,HA8 7AA,Tel: 020 8381 2641, - ,,,No ratings yet Rate it yourself - /Services/opticians/LeaveReview/DefaultView.aspx?id=OP_5A9_10905__000001_HA87AA,0,0,
DF Optometrists At The Devans,OP_5A9_8256__000001_N209HR,OPT,1355 High Road,,London,Whetstone,,N20 9HR,Tel: 020 8445 3130, - ,,,1 rating Rate it yourself - /Services/opticians/LeaveReview/DefaultView.aspx?id=OP_5A9_8256__000001_N209HR,,,
I Opticians,OP 3293__000003_N209HJ,OPT,1352 High Road,Whetstone,London,,,N20 9HJ,Tel: 020 8446 3311, - ,,,No ratings yet Rate it yourself - /Services/opticians/LeaveReview/DefaultView.aspx?id=OP 3293__000003_N209HJ,0,0,
Boots-Whetstone,N20 9HS_18172,OPT,,1261-1275 High Road,,Whetstone,,N20 9HS,Tel: 0208 4463589, - ,,,5 ratings Rate it yourself - /Services/opticians/LeaveReview/DefaultView.aspx?id=N20 9HS_18172,,,
Gordon Thomas,OP_5A9_13671__000006_N209HS,OPT,1291 High Road,Whetstone,London,,,N20 9HS,Tel: 020 8445 1147, - ,,,No ratings yet Rate it yourself - /Services/opticians/LeaveReview/DefaultView.aspx?id=OP_5A9_13671__000006_N209HS,0,0,
Vision Care,OP_5A9_2410__000002_EN48RQ,OPT,Visioncare Medical Eye Centre,94 East Barnet Rd,New Barnet,Herts,,EN4 8RQ,Tel: 020 8440 8986, - ,,,No ratings yet Rate it yourself - /Services/opticians/LeaveReview/DefaultView.aspx?id=OP_5A9_2410__000002_EN48RQ,0,0,
A.I. Jones Ltd,OP_5A9_13578__000001_HA80BB,OPT,132 Burnt Oak Broadway,,,Edgware,Middlesex,HA8 0BB,Tel: 020 8952 1102, - ,,,1 rating Rate it yourself - /Services/opticians/LeaveReview/DefaultView.aspx?id=OP_5A9_13578__000001_HA80BB,,,
Oak Optometrists,OP_5K6_14957__000002_HA85EP,OPT,61 Burnt Oak Broadway,Edgware,Middlesex,,,HA8 5EP,Tel: 020 8951 4004, - ,,,No ratings yet Rate it yourself - /Services/opticians/LeaveReview/DefaultView.aspx?id=OP_5K6_14957__000002_HA85EP,0,0,
Specsavers Opticians,5A9_OPT01__000002_N129QU,OPT,796 High Road,North Finchley,London,,,N12 9QU,Tel: 020 8492 9750, - ,,,2 ratings Rate it yourself - /Services/opticians/LeaveReview/DefaultView.aspx?id=5A9_OPT01__000002_N129QU,,,
Village Opticians,OP_5A9_13581__000001_EN48PQ,OPT,39 Church Hill Road,East Barnet,Hertfordshire,,,EN4 8SY,Tel: 020 8441 1163, - ,,,No ratings yet Rate it yourself - /Services/opticians/LeaveReview/DefaultView.aspx?id=OP_5A9_13581__000001_EN48PQ,0,0,
"Charrington, Cross, Liversidge & Partners",OP_5A9_8771__000001_EN48HG,OPT,5 Cat Hill,East Barnet,Hertfordshire,,,EN4 8HG,Tel: 020 8449 2814, - ,,,1 rating Rate it yourself - /Services/opticians/LeaveReview/DefaultView.aspx?id=OP_5A9_8771__000001_EN48HG,,,
Scrivens Opticians,OP_5A9_7641__000002_N128PR,OPT,752 High Road,North Finchley,London,London,,N12 9QG,Tel: 020 8445 5881, - ,,,No ratings yet Rate it yourself - /Services/opticians/LeaveReview/DefaultView.aspx?id=OP_5A9_7641__000002_N128PR,0,0,
VISION ONE 2 ONE OPTICIANS,OL01160915K6__000002_HA86RW,OPT,19 Station Parade,Whitchurch Lane,Edgware,Middx,,HA8 6RW,, - ,,,No ratings yet Rate it yourself - /Services/opticians/LeaveReview/DefaultView.aspx?id=OL01160915K6__000002_HA86RW,0,0,
Boots-Stanmore,-805K6__000001_HA74DJ,OPT,47 The Broadway,,,Stanmore,Middlesex,HA7 4DJ,Tel: 0208 954 4513, - ,,,No ratings yet Rate it yourself - /Services/opticians/LeaveReview/DefaultView.aspx?id=-805K6__000001_HA74DJ,0,0,
Boots-North Finchley,OP_5A9_7229__000001_N129QD,OPT,734 High Road,,North Finchley,London,,N12 9QD,Tel: 0208 343 7721, - ,,,No ratings yet Rate it yourself - /Services/opticians/LeaveReview/DefaultView.aspx?id=OP_5A9_7229__000001_N129QD,0,0,
Socialeyes Optics Ltd,OP_5A9_13604__000001_N120EL,OPT,4 Nether Street,North Finchley,London,,,N12 0EL,Tel: 020 8445 9661, - ,,,No ratings yet Rate it yourself - /Services/opticians/LeaveReview/DefaultView.aspx?id=OP_5A9_13604__000001_N120EL,0,0,
Kingsley Opticians,OP_5A9_5525__000003_N31XP,OPT,71 Ballards Lane,Finchley,,London,,N3 1XT,Tel: 020 8346 9636, - ,,,No ratings yet Rate it yourself - /Services/opticians/LeaveReview/DefaultView.aspx?id=OP_5A9_5525__000003_N31XP,0,0,
Asda Opticians,OPT_NW9 0AS,OPT,,EDGEWARE ROAD,COLINDALE,HARROW,,NW9 0AS,Tel: 0208 358 2513, - ,,,No ratings yet Rate it yourself - /Services/opticians/LeaveReview/DefaultView.aspx?id=OPT_NW9 0AS,0,0,
Boots-Colindale,OP_5A9_13592__000001_NW96LE,OPT,The Hyde,Edgware Road,,Colindale,,NW9 5EB,Tel: 0208 205 9280, - ,,,2 ratings Rate it yourself - /Services/opticians/LeaveReview/DefaultView.aspx?id=OP_5A9_13592__000001_NW96LE,,,
Finchley Eyecare,OP_5A9_6337__000001_N32BU,OPT,90 Ballards Lane,Finchley,London,,,N3 2DL,Tel: 020 8343 0780, - ,,,No ratings yet Rate it yourself - /Services/opticians/LeaveReview/DefaultView.aspx?id=OP_5A9_6337__000001_N32BU,0,0,
Dave Opticians,OP_5K6_22__000001_HA74AW,OPT,2 Church Road,,Stanmore,,,HA7 4AW,Tel: 020 8954 7707, - ,,,4 ratings Rate it yourself - /Services/opticians/LeaveReview/DefaultView.aspx?id=OP_5K6_22__000001_HA74AW,,,
Adams Opticians (Stanmore),OP_5K6_74__000001_HA73DP,OPT,3 Church Road,.,Stanmore,Middx,,HA7 4AR,Tel: 020 8954 2133, - ,,,1 rating Rate it yourself - /Services/opticians/LeaveReview/DefaultView.aspx?id=OP_5K6_74__000001_HA73DP,,,
Optikal,OP_5A9_689__000001_N32LJ,OPT,352 Regents Park Road,,London,,,N3 2LJ,Tel: 020 8371 0023, - ,,,No ratings yet Rate it yourself - /Services/opticians/LeaveReview/DefaultView.aspx?id=OP_5A9_689__000001_N32LJ,0,0,
John Horwitz,01-73135K6__000001_HA73DY,OPT,4 Halsbury Close,,Stanmore Hill,Middlesex,,HA7 3DY,Tel: 020 8954 4499, - ,,,No ratings yet Rate it yourself - /Services/opticians/LeaveReview/DefaultView.aspx?id=01-73135K6__000001_HA73DY,0,0,
Central Vision Optics Limited,OP-5A9-13606__000001_N31DP,OPT,327 Regents Park Road,Finchley,,London,,N3 1DP,Tel: 020 8343 1122, - ,,,No ratings yet Rate it yourself - /Services/opticians/LeaveReview/DefaultView.aspx?id=OP-5A9-13606__000001_N31DP,0,0,
Steven  P Salik Opticians,OP_5C1_13553__000001_EN40HX,OPT,1a Duchy Road    ,Hadley Wood,Hertfordshire ,,,EN4 0HX,Tel: 020 8440 5413, - ,,,No ratings yet Rate it yourself - /Services/opticians/LeaveReview/DefaultView.aspx?id=OP_5C1_13553__000001_EN40HX,0,0,
Eye Professionals Ltd,OP_HA72SA_85045,OPT,,40 Lansdowne Road,Stanmore,London,,HA7 2SA,Tel: 0800 8815207, - ,,,No ratings yet Rate it yourself - /Services/opticians/LeaveReview/DefaultView.aspx?id=OP_HA72SA_85045,0,0,
Blink Eye Care,OP_5P2_3373__000001_HA63AT,OPT,4 Wigton Gardens,Stanmore,,Middlesex,Middlesex,HA7 1BG,Tel: 0208 816 8549, - ,,,No ratings yet Rate it yourself - /Services/opticians/LeaveReview/DefaultView.aspx?id=OP_5P2_3373__000001_HA63AT,0,0,
Hendon Opticians & Contact Lens Centre,0206141422,OPT,"Hendon Opticians, Hendon",127 Brent Street,,Hendon,,NW4 2DX,Tel: 02082025555, - ,,,3 ratings Rate it yourself - /Services/opticians/LeaveReview/DefaultView.aspx?id=0206141422,,,
Judith Stechler,OP_5A9_13614__000001_N33DS,OPT,13 Chessington Avenue,Finchley,London,,,N3 3DS,Tel: 020 8346 5600, - ,,,No ratings yet Rate it yourself - /Services/opticians/LeaveReview/DefaultView.aspx?id=OP_5A9_13614__000001_N33DS,0,0,
Optomlink Limited,OP_5GD_2767__000001_HA72LZ,OPT,97 St andrews Drive,,,Stanmore,Middlesex,HA7 2LZ,Tel: 020 8357 7925, - ,,,No ratings yet Rate it yourself - /Services/opticians/LeaveReview/DefaultView.aspx?id=OP_5GD_2767__000001_HA72LZ,0,0,
Avista Eyecare,291220160909,OPT,,117 Cockfosters Road,,Barnet,,EN4 0DA,, - ,,,1 rating Rate it yourself - /Services/opticians/LeaveReview/DefaultView.aspx?id=291220160909,,,
Dollond & Aitchison,OP_5C1_13551__000001_EN40DP,OPT,110 Cockfosters Road,,,Barnet,Hertfordshire,EN4 0DP,Tel: 0208 275 0800, - ,,,No ratings yet Rate it yourself - /Services/opticians/LeaveReview/DefaultView.aspx?id=OP_5C1_13551__000001_EN40DP,0,0,
Boots-Cockfosters,OP_EN40DP_29640,OPT,110 Cockfosters Road,,,Barnet,Hertfordshire,EN4 0DP,Tel: 02082750800, - ,,,No ratings yet Rate it yourself - /Services/opticians/LeaveReview/DefaultView.aspx?id=OP_EN40DP_29640,0,0,
Eye Care Centre,OP_5CP_10176__000002_EN62HW,OPT,46 The Broadway,Darkes Lane,Potters Bar,,,EN6 2HW,Tel: 01707 650064, - ,,,No ratings yet Rate it yourself - /Services/opticians/LeaveReview/DefaultView.aspx?id=OP_5CP_10176__000002_EN62HW,0,0,
Central Opticians,OP_5A9_13606__000001_NW43UT,OPT,11 Vivian Avenue,Hendon,,London,,NW4 3UT,Tel: 0208 202 5165, - ,,,No ratings yet Rate it yourself - /Services/opticians/LeaveReview/DefaultView.aspx?id=OP_5A9_13606__000001_NW43UT,0,0,
Dr DH Glover,OP_WD77ER_46758,OPT,,24 Canons Close,,Radlett,,WD7 7ER,Tel: 07887850987, - ,,,No ratings yet Rate it yourself - /Services/opticians/LeaveReview/DefaultView.aspx?id=OP_WD77ER_46758,0,0,
Kingsbury Opticians,OP_5K5_11069__000001_NW99HE,OPT,528 Kingsbury Road,Kingsbury,London,,,NW9 9HE,Tel: 020 8204 8758, - ,,,No ratings yet Rate it yourself - /Services/opticians/LeaveReview/DefaultView.aspx?id=OP_5K5_11069__000001_NW99HE,0,0,
Grant & Glass Opticians,OP_5CP_8337__000003_WD77LB,OPT,365-367 Watling Street,,Radlett,,,WD7 7LB,Tel: 01923 858222, - ,,,No ratings yet Rate it yourself - /Services/opticians/LeaveReview/DefaultView.aspx?id=OP_5CP_8337__000003_WD77LB,0,0,
Stanfields Opticians,OP_5K5_7296__000001_NW99HJ,OPT,572 Kingsbury Road,Kingsbury,London,,,NW9 9HJ,Tel: 020 8204 7124, - ,,,No ratings yet Rate it yourself - /Services/opticians/LeaveReview/DefaultView.aspx?id=OP_5K5_7296__000001_NW99HJ,0,0,
R. R. Weiniger,OP_5A9_13670__000001_NW110JB,OPT,69 Cranbourne Gardens,London,,,,NW11 0JB,Tel: 020 8455 1893, - ,,,No ratings yet Rate it yourself - /Services/opticians/LeaveReview/DefaultView.aspx?id=OP_5A9_13670__000001_NW110JB,0,0,
Home Opti-Care Ltd,OP_5PX_0000__000001_NW42QH,OPT,64 Danescroft,Brent Street,Hendon,London,,NW4 2QH,Tel: 0208 202 1364, - ,,,No ratings yet Rate it yourself - /Services/opticians/LeaveReview/DefaultView.aspx?id=OP_5PX_0000__000001_NW42QH,0,0,
Radlett Opticians,OP_5CP_10814__000001_WD77AB,OPT,86 Watling Street,,Radlett,,,WD7 7AB,Tel: 01923 855888, - ,,,1 rating Rate it yourself - /Services/opticians/LeaveReview/DefaultView.aspx?id=OP_5CP_10814__000001_WD77AB,,,
Wiseman and Ashley Optical Centre,OP_5K5_14712__000001_NW99EL,OPT,561 Kingsbury Road,561 Kingsbury High Road,London,Kingsbury,,NW9 9EL,Tel: 020 8204 4348, - ,,,5 ratings Rate it yourself - /Services/opticians/LeaveReview/DefaultView.aspx?id=OP_5K5_14712__000001_NW99EL,,,
Davidson Opticians,OP_5CP_12574__000001_EN61AE,OPT,106 Darkes Lane,,Potters Bar,,,EN6 1AE,Tel: 01707 642255, - ,,,No ratings yet Rate it yourself - /Services/opticians/LeaveReview/DefaultView.aspx?id=OP_5CP_12574__000001_EN61AE,0,0,
InView Opticians,OP_5K6_13916__000001_HA38RF,OPT,15 Belmont Circle,Harrow,Middlesex,HARROW,Middlesex,HA3 8RF,Tel: 020 8907 3454, - ,,,15 ratings Rate it yourself - /Services/opticians/LeaveReview/DefaultView.aspx?id=OP_5K6_13916__000001_HA38RF,,,
Melissa Conway Ltd,OP_5A9_1485__000002_NW110AA,OPT,1193 Finchley Road,,London,,,NW11 0AA,Tel: 020 8201 9292, - ,,,1 rating Rate it yourself - /Services/opticians/LeaveReview/DefaultView.aspx?id=OP_5A9_1485__000002_NW110AA,,,
Eye 2 Eye Opticians Bushey,OPT_WD231GE_1,OPT,,84 High Road Bushey,,Heath Bushey,,WD23 1GE,Tel: 020 3925 3925, - ,,,18 ratings Rate it yourself - /Services/opticians/LeaveReview/DefaultView.aspx?id=OPT_WD231GE_1,,,
Eye 2 Eye Opticians Bushey,CO-3211,OPT,,84 High Road Bushey,,Heath Bushey ,,WD23 1GE,, - ,,,No ratings yet Rate it yourself - /Services/opticians/LeaveReview/DefaultView.aspx?id=CO-3211,0,0,
Alexander Kobrin Optometrists ,OP_5CP_10088__000001_EN61BW,OPT,177 Darkes Lane,,Potters Bar,,,EN6 1BW,Tel: 01707 652322, - ,,,No ratings yet Rate it yourself - /Services/opticians/LeaveReview/DefaultView.aspx?id=OP_5CP_10088__000001_EN61BW,0,0,
Eye 2 Eye Opticians Harrow,HARR5K6__000002_HA38SA,OPT,6 Warwick Parade,"Belmont Ciircle , Kenton Lane",Harrow,Middlesex,,HA3 8SA,Tel: 020 8907 8128, - ,,,30 ratings Rate it yourself - /Services/opticians/LeaveReview/DefaultView.aspx?id=HARR5K6__000002_HA38SA,,,
Tesco Opticians,OP-5A9-13605__000001_N120SH,OPT,North Circular Road,North Finchley,,London,,N12 0SH,Tel: 0345 677 9171, - ,,,No ratings yet Rate it yourself - /Services/opticians/LeaveReview/DefaultView.aspx?id=OP-5A9-13605__000001_N120SH,0,0,
Boots-Potters Bar,OP_5GG_10701__000001_AL97QT,OPT,144-146 Darkes Lane,,,Potters Bar,Hertfordshire,EN6 1AF,Tel: 01707 664321, - ,,,No ratings yet Rate it yourself - /Services/opticians/LeaveReview/DefaultView.aspx?id=OP_5GG_10701__000001_AL97QT,0,0,
Eye Deal Eyes Opticians,OP_5CP_12057__000001_EN65AP,OPT,2 Kemble Parade,High Street,Potters Bar,,,EN6 5AP,Tel: 01707 660808, - ,,,No ratings yet Rate it yourself - /Services/opticians/LeaveReview/DefaultView.aspx?id=OP_5CP_12057__000001_EN65AP,0,0,
EYELEVEL OPTOMETRISTS,OP 1689__000002_NW110QS,OPT,24 Temple Fortune Parade,Finchley Road,London,,,NW11 0QS,Tel: 020 8209 1231, - ,,,1 rating Rate it yourself - /Services/opticians/LeaveReview/DefaultView.aspx?id=OP 1689__000002_NW110QS,,,
Krishna Vision,OP_5A9_13599__000001_N113EG,OPT,53 Friern Barnet Road,New Southgate,London,,,N11 3EG,Tel: 020 8368 0924, - ,,,No ratings yet Rate it yourself - /Services/opticians/LeaveReview/DefaultView.aspx?id=OP_5A9_13599__000001_N113EG,0,0,
Kusoom Vadgama,OP_5A9_13668__000001_NW116XL,OPT,808 Finchley Road,Temple Fortune,London,,,NW11 6XL,Tel: 020 8458 3802, - ,,,No ratings yet Rate it yourself - /Services/opticians/LeaveReview/DefaultView.aspx?id=OP_5A9_13668__000001_NW116XL,0,0,
Ben Mirkin Ltd,OP_5A9_3502__000001_NW43FG,OPT,Unit V2 Brent Cross Shopping Centre,Prince Charles Drive,London,,,NW4 3FG,Tel: 020 8202 3771, - ,,,No ratings yet Rate it yourself - /Services/opticians/LeaveReview/DefaultView.aspx?id=OP_5A9_3502__000001_NW43FG,0,0,
Boots-Brent Cross,OP_5A9_6916__000003_NW43FB,OPT,Brent Cross Centre,,,Brent Cross,,NW4 3FB,Tel: 020 8202 7530, - ,,,2 ratings Rate it yourself - /Services/opticians/LeaveReview/DefaultView.aspx?id=OP_5A9_6916__000003_NW43FB,,,
Vision Express Ltd,OP_5A9_13669__000002_NW43FB,OPT,Brent Cross Shopping Centre,Prince Charles Drive,Hendon,,,NW4 3FB,Tel: 020 8202 6715, - ,,,No ratings yet Rate it yourself - /Services/opticians/LeaveReview/DefaultView.aspx?id=OP_5A9_13669__000002_NW43FB,0,0,
Simon Hoff,OP_5A9_13613__000001_NW119NN,OPT,18 Russell Parade,Golders Green Road,London,,,NW11 9NN,Tel: 020 8458 9992, - ,,,No ratings yet Rate it yourself - /Services/opticians/LeaveReview/DefaultView.aspx?id=OP_5A9_13613__000001_NW119NN,0,0,
Simon Gavzey,OP_5A9_13594__000001_HA89TP,OPT,Gavzey Opticians,48 The Market Place,,Hampstead Garden Suburb,,NW11 6JP,Tel: 020 8731 9999, - ,,,No ratings yet Rate it yourself - /Services/opticians/LeaveReview/DefaultView.aspx?id=OP_5A9_13594__000001_HA89TP,0,0,
The Vision Clinic,R9J0E,OPT,,327 Kenton Road,,"Kenton, Harrow",,HA3 0XS,Tel: 020 8907 5270, - ,,,No ratings yet Rate it yourself - /Services/opticians/LeaveReview/DefaultView.aspx?id=R9J0E,0,0,
Optical Warehouse,OP_5C1_13668__000003_N145PH,OPT,68 Chase Side,Southgate,London,,,N14 5PH,Tel: 020 8882 2298, - ,,,No ratings yet Rate it yourself - /Services/opticians/LeaveReview/DefaultView.aspx?id=OP_5C1_13668__000003_N145PH,0,0,
Scrivens Opticians,OP_5C1_2978__000002_N145PH,OPT,104 Chase Side,Southgate,London,London,,N14 5PH,Tel: 020 8882 6381, - ,,,1 rating Rate it yourself - /Services/opticians/LeaveReview/DefaultView.aspx?id=OP_5C1_2978__000002_N145PH,,,
M Wallace Opticians,OP_5C1_5648__000002_N144XA,OPT,191 Bramley Road,Oakwood,London,,,N14 4XA,Tel: 020 8367 3538, - ,,,No ratings yet Rate it yourself - /Services/opticians/LeaveReview/DefaultView.aspx?id=OP_5C1_5648__000002_N144XA,0,0,
Clive H. Rosen,OP_5C1_13552__000001_N147AL,OPT,152 Morton Way,Southgate,London,,,N14 7AL,Tel: 020 8886 9331, - ,,,No ratings yet Rate it yourself - /Services/opticians/LeaveReview/DefaultView.aspx?id=OP_5C1_13552__000001_N147AL,0,0,
Optitech,OP_5C1_13550__000001_N145PA,OPT,,28 Chase Side,Southgate,London,,N14 5PA,Tel: 020 8886 7266, - ,,,8 ratings Rate it yourself - /Services/opticians/LeaveReview/DefaultView.aspx?id=OP_5C1_13550__000001_N145PA,,,
David Hillel,HILLEL123,OPT,,119 High Road,East Finchley,London,,N2 8AG,Tel: 020 8444 2233, - ,,,2 ratings Rate it yourself - /Services/opticians/LeaveReview/DefaultView.aspx?id=HILLEL123,,,
Stewart Duncan,OP_5A9_4396__000002_N29ED,OPT,126 High Road,East Finchley,London,London,,N2 9ED,Tel: 020 8883 2020, - ,,,2 ratings Rate it yourself - /Services/opticians/LeaveReview/DefaultView.aspx?id=OP_5A9_4396__000002_N29ED,,,
Olivier Opticians,OP_5C1_2658__000001_N111AA,OPT,355 Bowes Road,New Southgate,London,,,N11 1AA,Tel: 020 8368 5648, - ,,,No ratings yet Rate it yourself - /Services/opticians/LeaveReview/DefaultView.aspx?id=OP_5C1_2658__000001_N111AA,0,0,
Panoptica,OP_5A9_10056__000001_N29PN,OPT,56 High Road,East Finchley,London,,,N2 9PN,Tel: 020 8883 6693, - ,,,No ratings yet Rate it yourself - /Services/opticians/LeaveReview/DefaultView.aspx?id=OP_5A9_10056__000001_N29PN,0,0,
Adams Opticians (Harrow Weald),OP_5K6_9378__000002_HA36EL,OPT,411 High Road,Harrow Weald,Harrow,,,HA3 6EL,Tel: 0208 427 3201, - ,,,No ratings yet Rate it yourself - /Services/opticians/LeaveReview/DefaultView.aspx?id=OP_5K6_9378__000002_HA36EL,0,0,
Euro Optica,OP_5A9_13678__000001_NW11,OPT,80 Golders Green,Golders Green,London,,,NW11 8LN,Tel: 020 8458 2888, - ,,,No ratings yet Rate it yourself - /Services/opticians/LeaveReview/DefaultView.aspx?id=OP_5A9_13678__000001_NW11,0,0,
icare optician T/a myicare,OP_5LC_610__000001_HA30RN,OPT,23 Trevelyan Cresent,Kenton,,Harrow,Middlesex,HA3 0RN,Tel: 0208 907 7787, - ,,,No ratings yet Rate it yourself - /Services/opticians/LeaveReview/DefaultView.aspx?id=OP_5LC_610__000001_HA30RN,0,0,
Boots-Golders Green,OP_5A9_1698__000002_NW118EL,OPT,55 Golders Green Road,,Golders Green,London,,NW11 8EL,Tel: 0208 455 8418, - ,,,No ratings yet Rate it yourself - /Services/opticians/LeaveReview/DefaultView.aspx?id=OP_5A9_1698__000002_NW118EL,0,0,
Visionsavers Opticians,OP_5K6_14943__000001_HA35DQ,OPT,53 High Street,Wealdstone,Harrow,,,HA3 5DQ,Tel: 020 8861 6006, - ,,,No ratings yet Rate it yourself - /Services/opticians/LeaveReview/DefaultView.aspx?id=OP_5K6_14943__000001_HA35DQ,0,0,
Visioncare Eye -Clinic ,OP_5K6_543__000002_HA37AF,OPT,Visioncare Medical Eye Centre,62-64 High Street,Wealdstone,Harrow,Middlesex,HA3 7AF,Tel: 020 8863 5333, - ,,,No ratings yet Rate it yourself - /Services/opticians/LeaveReview/DefaultView.aspx?id=OP_5K6_543__000002_HA37AF,0,0,
SPECSAVERS OPTICIANS,OP-5A9-13607__000001_NW118EE,OPT,29 Golders Green Road,Golders Green,London,,,NW11 8EE,Tel: 020 8209 9840, - ,,,No ratings yet Rate it yourself - /Services/opticians/LeaveReview/DefaultView.aspx?id=OP-5A9-13607__000001_NW118EE,0,0,
Cannon Hill Clinic,OP_5A9_13673__000003_N147HD,OPT,16 Cannon Hill,Southgate,London,,,N14 7HD,Tel: 020 8882 2131, - ,,,1 rating Rate it yourself - /Services/opticians/LeaveReview/DefaultView.aspx?id=OP_5A9_13673__000003_N147HD,,,
Globe Opticians,OP_5A9_1689__000002_NW117RR,OPT,618 Finchley Road,,Golders Green,,,NW11 7RR,Tel: 0208 458 3035, - ,,,1 rating Rate it yourself - /Services/opticians/LeaveReview/DefaultView.aspx?id=OP_5A9_1689__000002_NW117RR,,,
Costco Wholesale UK Ltd,CO-1833-22,OPT,,Hartspring Lane,,"Watford, Hertfordshire",,WD25 8JS,Tel: 01923 699 815, - ,,,No ratings yet Rate it yourself - /Services/opticians/LeaveReview/DefaultView.aspx?id=CO-1833-22,0,0,
Cravitz Opticians,OP_5K5_11249__000001_HA30AZ,OPT,119 Kenton Road,Kenton,Harrow,,,HA3 0AZ,Tel: 020 8907 7860, - ,,,2 ratings Rate it yourself - /Services/opticians/LeaveReview/DefaultView.aspx?id=OP_5K5_11249__000001_HA30AZ,,,