Organisation Name,NACS Code,Organisation Type,Address1,Address2,Address3,Address4,Address5,PostCode,Telephone Number,Opening time,Value  (Opening time),Banding Classification  (Opening time),NHS.UK users rating,Value  (NHS.UK users rating),Banding Classification  (NHS.UK users rating),Car parking (Is there car parking at this organisation?)
Vision Call (Bristol) Ltd,CO- 2321/5FL__000001_BS419LB,OPT,Yanley Court,Long Ashton Business Park,Long Ashton,North Somerset,,BS41 9LB,Tel: 01275 393 507, - ,,,No ratings yet Rate it yourself - /Services/opticians/LeaveReview/DefaultView.aspx?id=CO- 2321/5FL__000001_BS419LB,0,0,
Iris Eye Care Optometrists ,GOC CO-3924,OPT,,"Birdwell Clinic, 33 Weston Road",,"Birdwell Clinic, 33 Weston Road",,BS41 9AA,Tel: 01275 393149 (ext. 0789154552), - ,,,No ratings yet Rate it yourself - /Services/opticians/LeaveReview/DefaultView.aspx?id=GOC CO-3924,0,0,yes
David Phillips Opticians,OP_5JG_7618__000002_BS31JD,OPT,230 North Street,Bedminster,Bristol,,,BS3 1JD,Tel: 0117 963 5477, - ,,,No ratings yet Rate it yourself - /Services/opticians/LeaveReview/DefaultView.aspx?id=OP_5JG_7618__000002_BS31JD,0,0,
David Phillips Opticians,OP_5JG_11857__000001_BS31JJ,OPT,230 North Street,Bedminister,Bristol,,,BS3 1JB,Tel: 0117 966 3417, - ,,,1 rating Rate it yourself - /Services/opticians/LeaveReview/DefaultView.aspx?id=OP_5JG_11857__000001_BS31JJ,,,
Scrivens,OP_5JG_10172__000002_BS34EY,OPT,100 East Street,Bedminster,,Bristol,Avon,BS3 4EY,Tel: 0117 963 7105, - ,,,No ratings yet Rate it yourself - /Services/opticians/LeaveReview/DefaultView.aspx?id=OP_5JG_10172__000002_BS34EY,0,0,
Specsavers Opticians,OP_5JG_12494__000001_BS34HH,OPT,9 Imperial Parade,East Street,Bristol,,,BS3 4HH,Tel: 0117 966 4000, - ,,,No ratings yet Rate it yourself - /Services/opticians/LeaveReview/DefaultView.aspx?id=OP_5JG_12494__000001_BS34HH,0,0,
Specs Savers,OP_5JG_9205__000001_BS34JY,OPT,East Street,Bedminster,Bristol,,,BS3 4JY,Tel: 0117 9231839, - ,,,No ratings yet Rate it yourself - /Services/opticians/LeaveReview/DefaultView.aspx?id=OP_5JG_9205__000001_BS34JY,0,0,
Dury & Shaw Ltd,OP_5JG_9432__000002_BS140SX,OPT,5 Asda Centre,Oatlands Avenue,Bristol,,,BS14 0SX,Tel: 01275 839331, - ,,,No ratings yet Rate it yourself - /Services/opticians/LeaveReview/DefaultView.aspx?id=OP_5JG_9432__000002_BS140SX,0,0,
Scrivens Opticians,OP_5JG_11126__000001_BS84BX,OPT,15 Princess Victoria Street,Clifton,Bristol,Bristol,,BS8 4BX,Tel: 01272 737764, - ,,,No ratings yet Rate it yourself - /Services/opticians/LeaveReview/DefaultView.aspx?id=OP_5JG_11126__000001_BS84BX,0,0,
B A Vousden Ltd,OP_5JG_9372__000001_BS84HU,OPT,44 Regent Street,Clifton,Bristol,Bristol,,BS8 4HU,Tel: 0117 974 4944, - ,,,No ratings yet Rate it yourself - /Services/opticians/LeaveReview/DefaultView.aspx?id=OP_5JG_9372__000001_BS84HU,0,0,
M W Dunscombe Ltd,OP_5JG_12001__000001_BS14XH,OPT,7 St. Augustines Parade,,Bristol,,,BS1 4XH,Tel: 0117 927 2155, - ,,,No ratings yet Rate it yourself - /Services/opticians/LeaveReview/DefaultView.aspx?id=OP_5JG_12001__000001_BS14XH,0,0,
Goatman and Batham,OP_5JG_3296__000001_BS81EY,OPT,77 Queens Road,Clifton,Bristol,,,BS8 1QP,Tel: 0117 9262380, - ,,,1 rating Rate it yourself - /Services/opticians/LeaveReview/DefaultView.aspx?id=OP_5JG_3296__000001_BS81EY,,,
Bramley Pope,OP_5JG_14825__000001_BS11JX,OPT,35 St. Stephens Street,,Bristol,,,BS1 1JX,Tel: 0117 9300035, - ,,,No ratings yet Rate it yourself - /Services/opticians/LeaveReview/DefaultView.aspx?id=OP_5JG_14825__000001_BS11JX,0,0,
Sight Centres,OP_5JG_5944__000001_BS42RA,OPT,17 Broad Walk,,Bristol,,,BS4 2RA,Tel: 0117 977 2579, - ,,,No ratings yet Rate it yourself - /Services/opticians/LeaveReview/DefaultView.aspx?id=OP_5JG_5944__000001_BS42RA,0,0,
Lynne Fernandes Optometrists,OP_5JG_6422__000002_BS42AL,OPT,182a Wells Road,Knowle,,Bristol,,BS4 2AL,Tel: 0117 977 6330, - ,,,2 ratings Rate it yourself - /Services/opticians/LeaveReview/DefaultView.aspx?id=OP_5JG_6422__000002_BS42AL,,,
Specsavers Opticians,OP_5JG_5923__000001_BS12DD,OPT,1 and 7 Union Street,,Bristol,,,BS1 2DD,Tel: 0117 927 2931, - ,,,2 ratings Rate it yourself - /Services/opticians/LeaveReview/DefaultView.aspx?id=OP_5JG_5923__000001_BS12DD,,,
Juul & Payne,OP_5JG_4755__000001_BS82DJ,OPT,Juul & Payne,70 Alma Rd,Clifton,Bristol,Avon,BS8 2DJ,Tel: 0117 9735929, - ,,,6 ratings Rate it yourself - /Services/opticians/LeaveReview/DefaultView.aspx?id=OP_5JG_4755__000001_BS82DJ,,,yes
Brock & Houlford,OP_5FL_10314__000001_BS408PR,OPT,33 High Street,Chew Magna,Bristol,,,BS40 8PR,Tel: 01275 332882, - ,,,No ratings yet Rate it yourself - /Services/opticians/LeaveReview/DefaultView.aspx?id=OP_5FL_10314__000001_BS408PR,0,0,
Everybody,OP_5JG_138__000002_BS13ED,OPT,2 Castle Gallery,Broadmead,Bristol,,,BS1 3XE,Tel: 0117 929 7677, - ,,,No ratings yet Rate it yourself - /Services/opticians/LeaveReview/DefaultView.aspx?id=OP_5JG_138__000002_BS13ED,0,0,
David Clulow Opticians,OP_5JG_4665__000002_BS13XB,OPT,13 Broadmead Gallery,Broadmead,Bristol,,,BS1 3XB,Tel: 0117 925 4954, - ,,,No ratings yet Rate it yourself - /Services/opticians/LeaveReview/DefaultView.aspx?id=OP_5JG_4665__000002_BS13XB,0,0,
Specsavers,OP_5JG_51__000003_BS82NN,OPT,15 Clifton Down Shopping Centre,Whiteladies Road,Bristol,,,BS8 2NN,Tel: 0117 946 6994, - ,,,No ratings yet Rate it yourself - /Services/opticians/LeaveReview/DefaultView.aspx?id=OP_5JG_51__000003_BS82NN,0,0,
Boots-Bristol - Clifton Down,BS8 2NN_94821,OPT,,"Unit 8a, Clifton Down Shopping Centre",Clifton,Bristol,,BS8 2NN,Tel: 01179 237319, - ,,,1 rating Rate it yourself - /Services/opticians/LeaveReview/DefaultView.aspx?id=BS8 2NN_94821,,,
Boots-Bristol - Broadmead (in Boots UK),OP_5JG_704__000003_BS13ED,OPT,59 Broadmead,,Bristol,Bristol,,BS1 3EA,Tel: 0117 927 2418, - ,,,No ratings yet Rate it yourself - /Services/opticians/LeaveReview/DefaultView.aspx?id=OP_5JG_704__000003_BS13ED,0,0,
Amar Shah Optometrist,OP_5JG_12627__000001_BS66JX,OPT,52 Cotham Hill,,Bristol,,,BS6 6JX,Tel: 0117 9730335, - ,,,No ratings yet Rate it yourself - /Services/opticians/LeaveReview/DefaultView.aspx?id=OP_5JG_12627__000001_BS66JX,0,0,
Specsavers Bristol City Centre,TP15R,OPT,,30-32 Merchant Street,,Bristol,,BS1 3EP,Tel: 0117 922 5288, - ,,,No ratings yet Rate it yourself - /Services/opticians/LeaveReview/DefaultView.aspx?id=TP15R,0,0,
Vision Express,OP_5JG_12626__000001_BS13HF,OPT,9 Broadmead,,Bristol,,,BS1 3HF,Tel: 0117 929 2206, - ,,,No ratings yet Rate it yourself - /Services/opticians/LeaveReview/DefaultView.aspx?id=OP_5JG_12626__000001_BS13HF,0,0,
Dollond & Aitchison,OP_5JG_3031__000001_BS13HH,OPT,8 Broadmead,,Bristol,,,BS1 3HH,Tel: 0117 926 2859, - ,,,No ratings yet Rate it yourself - /Services/opticians/LeaveReview/DefaultView.aspx?id=OP_5JG_3031__000001_BS13HH,0,0,
Healthcall Optical Services Ltd,OP_5JF_11771__000002_BS20BH,OPT,6-7 Hide Market,West Street,St. Philips,,,BS2 0BH,Tel: 0117 954 3700, - ,,,No ratings yet Rate it yourself - /Services/opticians/LeaveReview/DefaultView.aspx?id=OP_5JF_11771__000002_BS20BH,0,0,
Dyer & Scott,OP_5JG_7065__000002_BS82RP,OPT,120 Whiteladies Road,Clifton,Bristol,,,BS8 2RP,Tel: 0117 973 7667, - ,,,1 rating Rate it yourself - /Services/opticians/LeaveReview/DefaultView.aspx?id=OP_5JG_7065__000002_BS82RP,,,
Simon Goldsmith,OP_5JG_9484__000002_BS148PG,OPT,70 Hollway Road,Stockwood,Bristol,,,BS14 8PG,Tel: 01275 838532, - ,,,No ratings yet Rate it yourself - /Services/opticians/LeaveReview/DefaultView.aspx?id=OP_5JG_9484__000002_BS148PG,0,0,
C M Lea (Opticians) Ltd,OP_5JG_4375__000001_BS43PF,OPT,38 Sandy Park Road,Brislington,Bristol,,,BS4 3PF,Tel: 0117 9776202, - ,,,No ratings yet Rate it yourself - /Services/opticians/LeaveReview/DefaultView.aspx?id=OP_5JG_4375__000001_BS43PF,0,0,
C M Lea (Opticians) Ltd,OP_5JF_1481__000002_BS50RB,OPT,62 Stapleton Road,,Bristol,,,BS5 0RB,Tel: 0117 9557625, - ,,,No ratings yet Rate it yourself - /Services/opticians/LeaveReview/DefaultView.aspx?id=OP_5JF_1481__000002_BS50RB,0,0,
Lynne Fernandes Optometrists,OP_5JF_6000__000001_BS78AS,OPT,75 Gloucester Road,Bishopston,,Bristol,,BS7 8AS,Tel: 0117 942 6843, - ,,,2 ratings Rate it yourself - /Services/opticians/LeaveReview/DefaultView.aspx?id=OP_5JF_6000__000001_BS78AS,,,
Bristol Contact Lens Service,OP_5JF_4661__000001_BS67SL,OPT,126 Coldharbour Road,Redland,Bristol,,,BS6 7SL,Tel: 0117 9427833, - ,,,No ratings yet Rate it yourself - /Services/opticians/LeaveReview/DefaultView.aspx?id=OP_5JF_4661__000001_BS67SL,0,0,
MikeCees Opticians,OP_5JF_8838__000001_BS59HH,OPT,122 Church Road,Redfield,Bristol,Bristol,,BS5 9HH,Tel: 0117 9556253, - ,,,No ratings yet Rate it yourself - /Services/opticians/LeaveReview/DefaultView.aspx?id=OP_5JF_8838__000001_BS59HH,0,0,
Newsom & Davies Opticians,OP_5JF_2055__000001_BS94JU,OPT,45 Henleaze Road,,Bristol,,,BS9 4JU,Tel: 0117 962 2612, - ,,,No ratings yet Rate it yourself - /Services/opticians/LeaveReview/DefaultView.aspx?id=OP_5JF_2055__000001_BS94JU,0,0,
Lynne Fernandes Optometrists,OP_5M8_14821__000001_BS481AW,OPT,124a High Street,Nailsea,,North Somerset,,BS48 1AH,Tel: 01275 854946, - ,,,2 ratings Rate it yourself - /Services/opticians/LeaveReview/DefaultView.aspx?id=OP_5M8_14821__000001_BS481AW,,,
Andrew Pinn Optometrists,OP_5JF_6143__000001_BS110DP,OPT,12 High Street,Shirehampton,,Bristol,,BS11 0DP,Tel: 0117 982 2269, - ,,,2 ratings Rate it yourself - /Services/opticians/LeaveReview/DefaultView.aspx?id=OP_5JF_6143__000001_BS110DP,,,
Specsavers,OP_5M8_14822__000002_BS481RP,OPT,2 Somerset Square,Nailsea,North Somerset,,,BS48 1RP,Tel: 01275 850950, - ,,,No ratings yet Rate it yourself - /Services/opticians/LeaveReview/DefaultView.aspx?id=OP_5M8_14822__000002_BS481RP,0,0,
Sight Centres Ltd,OP_5M8_7558__000001_BS481RG,OPT,14 Colliers Walk,Nailsea,Bristol,,,BS48 1RG,Tel: 01275 810301, - ,,,No ratings yet Rate it yourself - /Services/opticians/LeaveReview/DefaultView.aspx?id=OP_5M8_7558__000001_BS481RG,0,0,
Boots-Nailsea,OP_5M8_12555__000002_BS481RQ,OPT,1-2 Colliers Walk,Crown Glass Shopping Centre,,Nailsea,Somerset,BS48 1RH,Tel: 01275 856074, - ,,,No ratings yet Rate it yourself - /Services/opticians/LeaveReview/DefaultView.aspx?id=OP_5M8_12555__000002_BS481RQ,0,0,
Boots-Bristol - Westbury On Trym,OP_5JF_3779__000001_BS93DB,OPT,3 Canford Lane,Westbury-on-Trym,Bristol,Bristol,,BS9 3DB,Tel: 0117 950 7878, - ,,,No ratings yet Rate it yourself - /Services/opticians/LeaveReview/DefaultView.aspx?id=OP_5JF_3779__000001_BS93DB,0,0,
Vision Express,OP_5JF_8289__000001_BS93DU,OPT,8 High Street,Westbury-on-Trym,Bristol,,,BS9 3DU,Tel: 0117 9507151, - ,,,No ratings yet Rate it yourself - /Services/opticians/LeaveReview/DefaultView.aspx?id=OP_5JF_8289__000001_BS93DU,0,0,
Four Eyes Dispensing Optician,TP0MT,OPT,,63 High Street,Hanham,Bristol,,BS15 3DG,Tel: 0117 9611100, - ,,,No ratings yet Rate it yourself - /Services/opticians/LeaveReview/DefaultView.aspx?id=TP0MT,0,0,
Brignall & Partners,OP_5FL_8625__000001_BS312UA,OPT,36 West View Road,Keynsham,Bristol,,,BS31 2UA,Tel: 0117 986 2147, - ,,,No ratings yet Rate it yourself - /Services/opticians/LeaveReview/DefaultView.aspx?id=OP_5FL_8625__000001_BS312UA,0,0,
Boots-Keynsham,OP_5FL_1599__000001_BS311DP,OPT,17 High Street,,,Keynsham,Avon,BS31 1DP,Tel: 0117 986 2278 (ext. 2), - ,,,1 rating Rate it yourself - /Services/opticians/LeaveReview/DefaultView.aspx?id=OP_5FL_1599__000001_BS311DP,,,
Brock & Houlford,TP7M0,OPT,Westway Farm,Wick Road,Bishop Sutton,Bristol,,BS39 5XP,Tel: 01275 332882, - ,,,No ratings yet Rate it yourself - /Services/opticians/LeaveReview/DefaultView.aspx?id=TP7M0,0,0,
Norville Opticians,OP_5FL_39__000001_BS311EB,OPT,69 High Street,Keynsham,,Bristol,Avon,BS31 1DS,Tel: 0117 9865066, - ,,,No ratings yet Rate it yourself - /Services/opticians/LeaveReview/DefaultView.aspx?id=OP_5FL_39__000001_BS311EB,0,0,
Lee Opticians Limited,OP_5FL_14819__000002_BS311DS,OPT,41 High Street,Keynsham,Bristol,,,BS31 1DS,, - ,,,No ratings yet Rate it yourself - /Services/opticians/LeaveReview/DefaultView.aspx?id=OP_5FL_14819__000002_BS311DS,0,0,
Specsavers Opticians,OP_5FL_8988__000001_BS311EG,OPT,12 Temple Street,Keynsham,Bristol,,,BS31 1EG,Tel: 0117 986 6226, - ,,,4 ratings Rate it yourself - /Services/opticians/LeaveReview/DefaultView.aspx?id=OP_5FL_8988__000001_BS311EG,,,
Paul White Opticians,OP_5JF_5728__000001_BS70PA,OPT,28 Filton Road,Horfield,,Bristol,,BS7 0PA,Tel: 0117 951 9339, - ,,,No ratings yet Rate it yourself - /Services/opticians/LeaveReview/DefaultView.aspx?id=OP_5JF_5728__000001_BS70PA,0,0,
Christine Townsend Opticians,OP_5JF_370__000001_BS70BE,OPT,384 Filton Avenue,Horfield,,Bristol,,BS7 0BE,Tel: 0117 979 9942, - ,,,No ratings yet Rate it yourself - /Services/opticians/LeaveReview/DefaultView.aspx?id=OP_5JF_370__000001_BS70BE,0,0,
Lea (Opticians) Ltd,OP_5JF_9370__000002_BS106AT,OPT,1 Arnside Road,Bristol,,,,BS10 6AT,Tel: 01272 505025, - ,,,No ratings yet Rate it yourself - /Services/opticians/LeaveReview/DefaultView.aspx?id=OP_5JF_9370__000002_BS106AT,0,0,
Costco Wholesale UK Ltd,CO-1833-2,OPT,,St Brendans Way,,Bristol,,BS11 9EZ,Tel: 0117 916 0145, - ,,,No ratings yet Rate it yourself - /Services/opticians/LeaveReview/DefaultView.aspx?id=CO-1833-2,0,0,
Harold Turner & Son,OP_5JF_14813__000001_BS163UA,OPT,768 Fishponds Road,Fishponds,Bristol,,,BS16 3UA,Tel: 0117 9654434, - ,,,1 rating Rate it yourself - /Services/opticians/LeaveReview/DefaultView.aspx?id=OP_5JF_14813__000001_BS163UA,,,
Scrivens Opticians & Hearing Care,OP_5JF_4253__000001_BS163UW,OPT,725 Fishponds Road,Fishponds,,Bristol,Avon,BS16 3UW,Tel: 0117 958 3395, - ,,,No ratings yet Rate it yourself - /Services/opticians/LeaveReview/DefaultView.aspx?id=OP_5JF_4253__000001_BS163UW,0,0,
Goldsmith & Harvey Opticians,OP_5A3_8324__000002_BS307DY,OPT,Asda Store,Craven Way,Longwell Green,Bristol,,BS30 7DY,Tel: 0117 9605809, - ,,,3 ratings Rate it yourself - /Services/opticians/LeaveReview/DefaultView.aspx?id=OP_5A3_8324__000002_BS307DY,,,
Boots-Kingswood,OP_5A3_537__000001_BS158LQ,OPT,10-11 Kingschase Centre,Regent Street,Kingswood,Bristol,,BS15 8LP,Tel: 0117 960 8379, - ,,,2 ratings Rate it yourself - /Services/opticians/LeaveReview/DefaultView.aspx?id=OP_5A3_537__000001_BS158LQ,,,
Specsavers Opticians,OP_5A3_99__000003_BS158LP,OPT,20 Kings Chase Shopping Centre,Regent Street,Kingswood,,,BS15 8LP,Tel: 0117 947 8809, - ,,,No ratings yet Rate it yourself - /Services/opticians/LeaveReview/DefaultView.aspx?id=OP_5A3_99__000003_BS158LP,0,0,
Vision Express,OP_5A3_767__000001_BS158PH,OPT,,2-4 Hanham Road,Kingswood,Bristol,,BS15 8PH,Tel: 0117 967 4513, - ,,,No ratings yet Rate it yourself - /Services/opticians/LeaveReview/DefaultView.aspx?id=OP_5A3_767__000001_BS158PH,0,0,
Armstrong & North Opticians,OP_5JF_5604__000002_BS107DR,OPT,161 Crow Lane,Henbury,,Bristol,,BS10 7DR,Tel: 0117 9501868, - ,,,No ratings yet Rate it yourself - /Services/opticians/LeaveReview/DefaultView.aspx?id=OP_5JF_5604__000002_BS107DR,0,0,
Marian Donovan Optometrist,OP_5M8_14820__000001_BS405LD,OPT,Broad Street,,Wrington,North Somerset,,BS40 5LD,Tel: 01934 862933, - ,,,No ratings yet Rate it yourself - /Services/opticians/LeaveReview/DefaultView.aspx?id=OP_5M8_14820__000001_BS405LD,0,0,yes
Specsavers,OP_5JF_5809__000001_BS56JH,OPT,767 Fishponds Road,,Bristol,,,BS16 3BS,Tel: 0117 965 9241, - ,,,No ratings yet Rate it yourself - /Services/opticians/LeaveReview/DefaultView.aspx?id=OP_5JF_5809__000001_BS56JH,0,0,
Mike Cees Opticians,OP_BS154EJ_46948,OPT,Kingswood Health Centre,Alma Road,Kingswood,Bristol,,BS15 4EJ,Tel: 0117 3012091, - ,,,No ratings yet Rate it yourself - /Services/opticians/LeaveReview/DefaultView.aspx?id=OP_BS154EJ_46948,0,0,
Specsavers Opticians,OP_5A3_11418__000001_BS347BT,OPT,5 Church View,Filton,Bristol,,,BS34 7BT,Tel: 0117 969 3513, - ,,,No ratings yet Rate it yourself - /Services/opticians/LeaveReview/DefaultView.aspx?id=OP_5A3_11418__000001_BS347BT,0,0,
Armstrong & North Opticians,OP_5A3_5605__000002_BS165HL,OPT,,94 High Street,Staple Hill,Bristol,,BS16 5HL,Tel: 0117 956 9255, - ,,,1 rating Rate it yourself - /Services/opticians/LeaveReview/DefaultView.aspx?id=OP_5A3_5605__000002_BS165HL,,,
Dury and Tippett Ltd,OP_5A3_9431__000001_BS165LR,OPT,2 The Square,Broad Street,,Staple Hill,,BS16 5LR,Tel: 0117 957 3542, - ,,,2 ratings Rate it yourself - /Services/opticians/LeaveReview/DefaultView.aspx?id=OP_5A3_9431__000001_BS165LR,,,
Darlington Opticians,OP_5M8_14823__000001_BS206AG,OPT,55 High Street,Portishead,North Somerset,,,BS20 6AG,Tel: 01275 818427, - ,,,No ratings yet Rate it yourself - /Services/opticians/LeaveReview/DefaultView.aspx?id=OP_5M8_14823__000001_BS206AG,0,0,
Dyer & Scott,OP_5M8_9345__000001_BS206AJ,OPT,96 High Street,Portishead,North Somerset,,,BS20 6AJ,Tel: 01275 842504, - ,,,No ratings yet Rate it yourself - /Services/opticians/LeaveReview/DefaultView.aspx?id=OP_5M8_9345__000001_BS206AJ,0,0,
Norville Opticians,OP_5A3_5621__000001_BS165UJ,OPT,16 Downend Road,Downend,,Downed,,BS16 5UJ,Tel: 0117 956 0939, - ,,,No ratings yet Rate it yourself - /Services/opticians/LeaveReview/DefaultView.aspx?id=OP_5A3_5621__000001_BS165UJ,0,0,
Adrian Dobinson Opticians Ltd,OP_BS166BB_46945,OPT,,23 Badminton Road,,Downend,,BS16 6BB,Tel: 0117 957 3010, - ,,,No ratings yet Rate it yourself - /Services/opticians/LeaveReview/DefaultView.aspx?id=OP_BS166BB_46945,0,0,
Vision Express,OP_5A3_682__000001_BS345GF,OPT,"8 The Mall, Lower Level","Cribbs Causeway Regional Shopping Centre, Patchway",Bristol,Bristol,,BS34 5GF,Tel: 0117 9500857, - ,,,No ratings yet Rate it yourself - /Services/opticians/LeaveReview/DefaultView.aspx?id=OP_5A3_682__000001_BS345GF,0,0,
Boots Opticians Ltd,OP_5A3_640__000003_BS345UP,OPT,"116 The Mall, Upper Level",Cribbs Causeway,Patchway,Bristol,,BS34 5UP,Tel: 0117 950 9649, - ,,,1 rating Rate it yourself - /Services/opticians/LeaveReview/DefaultView.aspx?id=OP_5A3_640__000003_BS345UP,,,
Bell & Stenton Ltd,OP_5M8_11852__000001_BS494HJ,OPT,52 High Street,Yatton,North Somerset,,,BS49 4HJ,Tel: 01934 838818, - ,,,No ratings yet Rate it yourself - /Services/opticians/LeaveReview/DefaultView.aspx?id=OP_5M8_11852__000001_BS494HJ,0,0,
Asda Wal-Mart Vision Centre,OP_5A3_12997__000002_BS345TL,OPT,Highwood Lane,Patchway,Bristol,Bristol,,BS34 5TL,Tel: 0117 9798289, - ,,,No ratings yet Rate it yourself - /Services/opticians/LeaveReview/DefaultView.aspx?id=OP_5A3_12997__000002_BS345TL,0,0,
Boots-Bristol - Patchway,OP_5A3_10555__000001_BS345PA,OPT,4 Coniston Road,Patchway,,Bristol,,BS34 5PA,Tel: 01179 692727, - ,,,No ratings yet Rate it yourself - /Services/opticians/LeaveReview/DefaultView.aspx?id=OP_5A3_10555__000001_BS345PA,0,0,
Boots-Bristol - Emerson Green,OP_BS167AE_46947,OPT,1a The Village,Emerson Way,,Bristol,Avon,BS16 7AE,Tel: 0117 970 8652, - ,,,3 ratings Rate it yourself - /Services/opticians/LeaveReview/DefaultView.aspx?id=OP_BS167AE_46947,,,
Tesco Opticians,OP_BS328EF_85642,OPT,,Bradley Stoke Centre,Bradley Stoke,Bristol,,BS32 8EF,Tel: 01454 847738, - ,,,No ratings yet Rate it yourself - /Services/opticians/LeaveReview/DefaultView.aspx?id=OP_BS328EF_85642,0,0,
Mike Harbord Opticians,OP_5A3_12504__000001_BS361JX,OPT,3 Whitegates,Flaxpits Lane,,Winterbourne,,BS36 1JX,Tel: 01454 775530, - ,,,2 ratings Rate it yourself - /Services/opticians/LeaveReview/DefaultView.aspx?id=OP_5A3_12504__000001_BS361JX,,,
Boots-Clevedon,OP_5M8_4612__000001_BS216LZ,OPT,9 Old Church Road,,,Clevedon,Avon,BS21 6LZ,Tel: 01275 877 877, - ,,,No ratings yet Rate it yourself - /Services/opticians/LeaveReview/DefaultView.aspx?id=OP_5M8_4612__000001_BS216LZ,0,0,
Spex Appeal Ltd,OP_5M8_8712__000001_BS216NN,OPT,29 Old Church Road,Clevedon,North Somerset,,,BS21 6NN,Tel: 01275 873559, - ,,,No ratings yet Rate it yourself - /Services/opticians/LeaveReview/DefaultView.aspx?id=OP_5M8_8712__000001_BS216NN,0,0,
Vision Express Opticians,OP_5M8_12104__000001_BS217NZ,OPT,20 Hill Road,,North Somerset,Clevedon,,BS21 7NZ,Tel: 01275 873536, - ,,,No ratings yet Rate it yourself - /Services/opticians/LeaveReview/DefaultView.aspx?id=OP_5M8_12104__000001_BS217NZ,0,0,
Tudball (Opticians) Ltd,OP_5M8_8889__000001_BS217PN,OPT,95 Hill Road,Clevedon,North Somerset,,,BS21 7PN,Tel: 01275 343353, - ,,,No ratings yet Rate it yourself - /Services/opticians/LeaveReview/DefaultView.aspx?id=OP_5M8_8889__000001_BS217PN,0,0,
Tudball (Opticians) Ltd,OP_5M8_2234__000001_BS206AH,OPT,,Tudball Opticians,95 Hill Road,CLEVEDON,,BS21 7PN,Tel: 01275 343 353, - ,,,No ratings yet Rate it yourself - /Services/opticians/LeaveReview/DefaultView.aspx?id=OP_5M8_2234__000001_BS206AH,0,0,
Department of Ophthalmology,OP_5FL_1469__000002_BA13NG,OPT,Royal United Hospital,Combe Park,Bath,,,BA1 3NG,Tel: 01225 824609, - ,,,No ratings yet Rate it yourself - /Services/opticians/LeaveReview/DefaultView.aspx?id=OP_5FL_1469__000002_BA13NG,0,0,
Royal United Hospital,OP_5FL_9076__000001_BA13NG,OPT,Eye Clinic,Combe Park,Bath,,,BA1 3NG,Tel: 01225 428331, - ,,,No ratings yet Rate it yourself - /Services/opticians/LeaveReview/DefaultView.aspx?id=OP_5FL_9076__000001_BA13NG,0,0,
Armstrong and North Opticians,OP_5FL_2841__000001_BA14BX,OPT,,13 Chelsea Road,Lower Weston,Bath,Avon,BA1 3DU,Tel: 01225 466110, - ,,,1 rating Rate it yourself - /Services/opticians/LeaveReview/DefaultView.aspx?id=OP_5FL_2841__000001_BA14BX,,,
Orriss & Low,OP_5M8_6588__000001_BS251AQ,OPT,2-4 Corner House,Corner House,Woodborough Road,Winscombe,Somerset,BS25 1AQ,Tel: 01934 843713, - ,,,No ratings yet Rate it yourself - /Services/opticians/LeaveReview/DefaultView.aspx?id=OP_5M8_6588__000001_BS251AQ,0,0,yes
Scrivens Opticians ,OP_5FL_575__000001_BA32DW,OPT,,26 High Street,Bath,Midsomer Norton,,BA3 2DW,Tel: 01761 414774, - ,,,No ratings yet Rate it yourself - /Services/opticians/LeaveReview/DefaultView.aspx?id=OP_5FL_575__000001_BA32DW,0,0,
Edwards Opticians Ltd,OP_5FL_14818__000001_BA32HW,OPT,2 Mansbrook House,15 High Street,,Midsomer Norton,,BA3 2HW,Tel: 01761 413212, - ,,,No ratings yet Rate it yourself - /Services/opticians/LeaveReview/DefaultView.aspx?id=OP_5FL_14818__000001_BA32HW,0,0,
Eye Tech Opticians,OP_5FL_8611__000001_BA32HQ,OPT,6 The Island,Midsomer Norton,Bath,,,BA3 2HQ,Tel: 01761 414136, - ,,,No ratings yet Rate it yourself - /Services/opticians/LeaveReview/DefaultView.aspx?id=OP_5FL_8611__000001_BA32HQ,0,0,
N K Opticians,CO - 3455__000002_BS273NA,OPT,Myrtle House,Bath Street,Cheddar,Somerset,,BS27 3AA,Tel: 01934 743723, - ,,,1 rating Rate it yourself - /Services/opticians/LeaveReview/DefaultView.aspx?id=CO - 3455__000002_BS273NA,,,
Bath Opticians,OP_5FL_4068__000002_BA23PN,OPT,Bath Opticians,57 Moorland Road,Oldfield Park,Bath,,BA2 3PJ,Tel: 01225 427353, - ,,,1 rating Rate it yourself - /Services/opticians/LeaveReview/DefaultView.aspx?id=OP_5FL_4068__000002_BA23PN,,,yes
Lovat Short Optometrists,OP_5FL_14817__000002_BA33PL,OPT,2 The Street,Radstock,,Bath,,BA3 3PL,Tel: 01761 432169, - ,,,No ratings yet Rate it yourself - /Services/opticians/LeaveReview/DefaultView.aspx?id=OP_5FL_14817__000002_BA33PL,0,0,
B A Vousden (Opticians) Ltd,OP_5FL_516__000001_BA15LJ,OPT,20 Milsom Place,Shires Yard,Bath,,,BA1 1BZ,Tel: 01225 464749, - ,,,No ratings yet Rate it yourself - /Services/opticians/LeaveReview/DefaultView.aspx?id=OP_5FL_516__000001_BA15LJ,0,0,
Specsavers Opticians,OP_5FL_8968__000001_BA11EQ,OPT,18 Westgate Street,,Bath,Avon,,BA1 1EQ,Tel: 01225 463 489, - ,,,No ratings yet Rate it yourself - /Services/opticians/LeaveReview/DefaultView.aspx?id=OP_5FL_8968__000001_BA11EQ,0,0,
Ellis & Killpatrick,OP_5FL_7095__000001_BA11BA,OPT,18 New Bond Street,,,Bath,,BA1 1BA,Tel: 01225 466954, - ,,,No ratings yet Rate it yourself - /Services/opticians/LeaveReview/DefaultView.aspx?id=OP_5FL_7095__000001_BA11BA,0,0,
Brad Abrahams Optometry ,2008151055,OPT,,Brad Abrahams Optometry,2 Upper Borough Walls,Bath,,BA1 1RG,Tel: 01225 444321, - ,,,1 rating Rate it yourself - /Services/opticians/LeaveReview/DefaultView.aspx?id=2008151055,,,