Organisation Name,NACS Code,Organisation Type,Address1,Address2,Address3,Address4,Address5,PostCode,Telephone Number,Opening time,Value  (Opening time),Banding Classification  (Opening time),NHS.UK users rating,Value  (NHS.UK users rating),Banding Classification  (NHS.UK users rating),Car parking (Is there car parking at this organisation?)
Peter Bainbridge Opticians,OP_5MR_341__000003_B974EY,OPT,18 Kingfisher Walk,Redditch,Worcestershire,,,B97 4EY,Tel: 01527 64691, - ,,,2 ratings Rate it yourself - /Services/opticians/LeaveReview/DefaultView.aspx?id=OP_5MR_341__000003_B974EY,,,
Boots-Redditch,OP_5MR_9389__000002_B974EY,OPT,7 Kingfisher Walk,,,Redditch,Worcestershire,B97 4EY,Tel: 01527 63068, - ,,,No ratings yet Rate it yourself - /Services/opticians/LeaveReview/DefaultView.aspx?id=OP_5MR_9389__000002_B974EY,0,0,yes
Vision Express (UK) Ltd,OP_5MR_9135__000001_B974HA,OPT,7 New Walk,Kingfisher Centre,Redditch,Worcestershire,,B97 4HA,Tel: 01527 69633, - ,,,No ratings yet Rate it yourself - /Services/opticians/LeaveReview/DefaultView.aspx?id=OP_5MR_9135__000001_B974HA,0,0,
Specsavers Opticians,OP_5MR_655__000001_B974YP,OPT,13 New Walk,Kingfisher Centre,Redditch,Worcestershire,,B97 4YP,Tel: 01527 595558, - ,,,No ratings yet Rate it yourself - /Services/opticians/LeaveReview/DefaultView.aspx?id=OP_5MR_655__000001_B974YP,0,0,
Asda Opticians,OPT_B98 7ER,OPT,,JINNAH ROAD,SMALLWOOD,REDDITCH,,B98 7ER,Tel: 01527 509344, - ,,,No ratings yet Rate it yourself - /Services/opticians/LeaveReview/DefaultView.aspx?id=OPT_B98 7ER,0,0,
Specsavers - Redditch Alvechurch,M2Y9H,OPT,,"Sainsburys, Abbey Trading Centre,Alvechurch Highway",,Redditch,,B97 6RF,Tel: 01527 913585, - ,,,No ratings yet Rate it yourself - /Services/opticians/LeaveReview/DefaultView.aspx?id=M2Y9H,0,0,
Winyates Opticians,0000050__000004_B980NR,OPT,17 Winyates Shopping Centre,Winyates,Redditch,Worcestershire,,B98 0NR,Tel: 01527 529010, - ,,,No ratings yet Rate it yourself - /Services/opticians/LeaveReview/DefaultView.aspx?id=0000050__000004_B980NR,0,0,
Home Eyecare,5MX063,OPT,,"Unit 8, 17 Winyates Centre",,Redditch,,B98 0NR,Tel: 01527 529010, - ,,,No ratings yet Rate it yourself - /Services/opticians/LeaveReview/DefaultView.aspx?id=5MX063,0,0,
J & D Mason Opticians ,OP_5PL_9067__000003_B487LA,OPT,23 The Square,"23 The Square,",Birmingham,Alvechurch,,B48 7LA,Tel: 0121 447 8682, - ,,,1 rating Rate it yourself - /Services/opticians/LeaveReview/DefaultView.aspx?id=OP_5PL_9067__000003_B487LA,,,
Lees & Thomas Optometrist,OP_5MQ_9995__000001_B807NJ,OPT,57 Alcester Road,,Studley,,,B80 7NJ,Tel: 01527 853932, - ,,,No ratings yet Rate it yourself - /Services/opticians/LeaveReview/DefaultView.aspx?id=OP_5MQ_9995__000001_B807NJ,0,0,
Barnt Green Opticians,OP_5MR_7851__000001_B458NF,OPT,12 Hewell Road,Barnt Green,,Birmingham,,B45 8NE,Tel: 0121 445 6015, - ,,,No ratings yet Rate it yourself - /Services/opticians/LeaveReview/DefaultView.aspx?id=OP_5MR_7851__000001_B458NF,0,0,
Boots-Bromsgrove,OP_5MR_276__000002_B618EX,OPT,64 High Street,Bromsgrove,,Worcestershire,Worcestershire,B61 8EX,Tel: 01527 872 583, - ,,,No ratings yet Rate it yourself - /Services/opticians/LeaveReview/DefaultView.aspx?id=OP_5MR_276__000002_B618EX,0,0,
Chapman Opticians,OP_5MR_8077__000002_B618AQ,OPT,103 High Street,,Bromsgrove,,,B61 8AE,Tel: 01527 836290, - ,,,1 rating Rate it yourself - /Services/opticians/LeaveReview/DefaultView.aspx?id=OP_5MR_8077__000002_B618AQ,,,
Specsavers Opticians,OP_5MR_12187__000001_B618DD,OPT,131 High Street,Bromsgrove,Worcestershire,,,B61 8AE,Tel: 01527 579 815, - ,,,2 ratings Rate it yourself - /Services/opticians/LeaveReview/DefaultView.aspx?id=OP_5MR_12187__000001_B618DD,,,
Hamptons Optical Ltd.,00000052__000001_B618DJ,OPT,Crown House,11 Crown Close,Bromsgrove,Worcestershire,,B61 8DJ,, - ,,,No ratings yet Rate it yourself - /Services/opticians/LeaveReview/DefaultView.aspx?id=00000052__000001_B618DJ,0,0,
Eyecare Opticians Parkside,B61 0AZ,OPT,BHI Parkside Medical Centre,Stourbridge Road,,Bromsgrove,,B61 0AZ,Tel: 01527 888599, - ,,,No ratings yet Rate it yourself - /Services/opticians/LeaveReview/DefaultView.aspx?id=B61 0AZ,0,0,
Spex4U Limited,OL5PL01__000005_B459JA,OPT,174 New Road,Rubery,,Birmingham,Worcestershire,B45 9JA,Tel: 0121 453 7179, - ,,,1 rating Rate it yourself - /Services/opticians/LeaveReview/DefaultView.aspx?id=OL5PL01__000005_B459JA,,,
Troth Opticians,00000051__000003_B459JR,OPT,135 New Road,Rubery,Birmingham,,,B45 9JR,Tel: 0121 453 2146, - ,,,No ratings yet Rate it yourself - /Services/opticians/LeaveReview/DefaultView.aspx?id=00000051__000003_B459JR,0,0,
Pabari Opticians Ltd,OP_5M1_4727__000002_B313JW,OPT,3 Alvechurch Road,West Heath,Birmingham,,,B31 3JW,Tel: 0121 477 5252, - ,,,No ratings yet Rate it yourself - /Services/opticians/LeaveReview/DefaultView.aspx?id=OP_5M1_4727__000002_B313JW,0,0,
Williams Optometrists,OP_5MR_9056__000002_B459JW,OPT,161 New Road,Rubery,Birmingham,,,B45 9JW,Tel: 0121 453 2581, - ,,,No ratings yet Rate it yourself - /Services/opticians/LeaveReview/DefaultView.aspx?id=OP_5MR_9056__000002_B459JW,0,0,
Pabari Opticians,00000055__000001_B475DX,OPT,Unit2 Drakes Cross Shopping Parade,,Wythall,Worcestershire,,B47 5HD,Tel: 01564 824482, - ,,,1 rating Rate it yourself - /Services/opticians/LeaveReview/DefaultView.aspx?id=00000055__000001_B475DX,,,
Michael Beaver Optician,OP_5MQ_11665__000001_B495AD,OPT,20 High Street,Alcester,Warwickshire,Alcester,,B49 5AD,Tel: 01789 763183, - ,,,No ratings yet Rate it yourself - /Services/opticians/LeaveReview/DefaultView.aspx?id=OP_5MQ_11665__000001_B495AD,0,0,
Specsavers - Alcester,TP9D3,OPT,,36 High Street,,Alcester,Warwickshire,B49 5AA,Tel: 01789764705, - ,,,No ratings yet Rate it yourself - /Services/opticians/LeaveReview/DefaultView.aspx?id=TP9D3,0,0,
Alcester Opticians,OP_5MQ_14436__000002_B495AF,OPT,65 High Street,Alcester,Warwickshire,,,B49 5AA,Tel: 01789 762692, - ,,,No ratings yet Rate it yourself - /Services/opticians/LeaveReview/DefaultView.aspx?id=OP_5MQ_14436__000002_B495AF,0,0,
J & D Mason Opticians,5M143__000001_B380SD,OPT,,2 The Green,Kings Norton,Birmingham,,B38 8SD,Tel: 0121 451 3485, - ,,,5 ratings Rate it yourself - /Services/opticians/LeaveReview/DefaultView.aspx?id=5M143__000001_B380SD,,,
Waller & Waller,OP_5MT_11085__000001_WR98DY,OPT,18 St. andrews Street,Droitwich,Worcestershire,,,WR9 8DY,Tel: 01905 772729, - ,,,No ratings yet Rate it yourself - /Services/opticians/LeaveReview/DefaultView.aspx?id=OP_5MT_11085__000001_WR98DY,0,0,
Specs Direct,5M147__000002_B312PA,OPT,871 Bristol Road South,Northfield,Birmingham,,,B31 2PA,Tel: 0121 477 7474, - ,,,No ratings yet Rate it yourself - /Services/opticians/LeaveReview/DefaultView.aspx?id=5M147__000002_B312PA,0,0,
Eyewise ,OP_5M1_2922__000002_B312JU,OPT,892 Bristol Road South,Northfield,Birmingham,,,B31 2NS,Tel: 0121 477 6550, - ,,,No ratings yet Rate it yourself - /Services/opticians/LeaveReview/DefaultView.aspx?id=OP_5M1_2922__000002_B312JU,0,0,
Virdi & Pepall Ltd,5M1105,OPT,,826 Bristol Road South,Northfield,Birmingham,,B31 2NS,Tel: 0121 475 4342, - ,,,5 ratings Rate it yourself - /Services/opticians/LeaveReview/DefaultView.aspx?id=5M1105,,,
Boots-Northfield,5M1089,OPT,816 Bristol Road South,,Northfield,Birmingham,,B31 2NS,Tel: 0121 475 1072, - ,,,No ratings yet Rate it yourself - /Services/opticians/LeaveReview/DefaultView.aspx?id=5M1089,0,0,
Boots-Droitwich,OP_5MT_11993__000003_WR98HE,OPT,52 St Andrews Square,,,Droitwich,Worcestershire,WR9 8HE,Tel: 01905 774 661, - ,,,No ratings yet Rate it yourself - /Services/opticians/LeaveReview/DefaultView.aspx?id=OP_5MT_11993__000003_WR98HE,0,0,
Specsavers Opticians,00000067__000005_WR98HE,OPT,10 St.andrews Square,,Droitwich,Worcestershire,,WR9 8HE,Tel: 01905 790660, - ,,,No ratings yet Rate it yourself - /Services/opticians/LeaveReview/DefaultView.aspx?id=00000067__000005_WR98HE,0,0,
The Factory Opticians,000000061__000004_WR98HE,OPT,St.andrews Square,,Droitwich,Worcestershire,,WR9 8HE,Tel: 01905 795541, - ,,,No ratings yet Rate it yourself - /Services/opticians/LeaveReview/DefaultView.aspx?id=000000061__000004_WR98HE,0,0,
Robert Ellin Opticians,OP_5MT_4223__000002_WR98QS,OPT,41 Ombersley Street East,,Droitwich,,,WR9 8QS,Tel: 01905 773054, - ,,,No ratings yet Rate it yourself - /Services/opticians/LeaveReview/DefaultView.aspx?id=OP_5MT_4223__000002_WR98QS,0,0,
Specsavers Opticians,OP_5M1_8153__000002_B312NN,OPT,,"Unit 3, 780-792 Bristol Road South",Northfield,Birmingham,,B31 2NN,Tel: 0121 476 4717, - ,,,No ratings yet Rate it yourself - /Services/opticians/LeaveReview/DefaultView.aspx?id=OP_5M1_8153__000002_B312NN,0,0,
Scrivens Ltd,OP_5M1_6295__000001_B312NG,OPT,731 Bristol Road South,Northfield,,Birmingham,West Midlands,B31 2NG,Tel: 0121 475 1152, - ,,,No ratings yet Rate it yourself - /Services/opticians/LeaveReview/DefaultView.aspx?id=OP_5M1_6295__000001_B312NG,0,0,
A Tissington,OP_5MQ_8857__000001_B955AU,OPT,133 High Street,Henley-In-Arden,Solihull,Warwickshire,,B95 5AU,Tel: 01564 792334, - ,,,No ratings yet Rate it yourself - /Services/opticians/LeaveReview/DefaultView.aspx?id=OP_5MQ_8857__000001_B955AU,0,0,
Penzer Opticians,OP_5M1_5811__000001_B145HG,OPT,1024 Alcester Road South,Maypole,Nr Kings Heath,Birmingham,,B14 5NG,Tel: 0121 430 5538, - ,,,1 rating Rate it yourself - /Services/opticians/LeaveReview/DefaultView.aspx?id=OP_5M1_5811__000001_B145HG,,,yes
Scrivens Ltd,OP_5M1_7540__000001_B303EG,OPT,37 Pershore Road South,Cotteridge,,Birmingham,West Midlands,B30 3EG,Tel: 0121 458 3335, - ,,,No ratings yet Rate it yourself - /Services/opticians/LeaveReview/DefaultView.aspx?id=OP_5M1_7540__000001_B303EG,0,0,
Vision Replublic,5M1098,OPT,,1003 Alcester Road South,Maypole,Birmingham,,B14 5JA,Tel: 0121 430 6572, - ,,,No ratings yet Rate it yourself - /Services/opticians/LeaveReview/DefaultView.aspx?id=5M1098,0,0,
Dickens Eye Clinic,DICKENS__000001_B901UB,OPT,39 Main Street,Dickens Heath,Solihull,West Midlands,,B90 1UB,Tel: 0121 744 5544, - ,,,2 ratings Rate it yourself - /Services/opticians/LeaveReview/DefaultView.aspx?id=DICKENS__000001_B901UB,,,
Eyecare Mobile Opticians Ltd,5QW049,OPT,,16 Watford Road,Cotteridge,Birmingham,,B30 1JA,Tel: 0800 633 5092, - ,,,No ratings yet Rate it yourself - /Services/opticians/LeaveReview/DefaultView.aspx?id=5QW049,0,0,
Eyeworld Optometrists,5MX053,OPT,,1863 Pershore Road,Cotteridge,Birmingham,,B30 3DJ,Tel: 0121 458 1359, - ,,,No ratings yet Rate it yourself - /Services/opticians/LeaveReview/DefaultView.aspx?id=5MX053,0,0,
Ashtree Eyecare Centre,5M1106,OPT,,1547 Pershore Road,Stirchley,Birmingham,,B30 2JH,Tel: 0121 458 4595, - ,,,No ratings yet Rate it yourself - /Services/opticians/LeaveReview/DefaultView.aspx?id=5M1106,0,0,
Lakis Stelios Stylianou,5M1011,OPT,,22 School Road,,Birmingham,,B14 4BJ,Tel: 0121 474 3359, - ,,,No ratings yet Rate it yourself - /Services/opticians/LeaveReview/DefaultView.aspx?id=5M1011,0,0,
Vincent Roberts Optometrist,OP_5M1_3786__000001_B146EB,OPT,267 Alcester Road South,Kings Heath,Birmingham,,,B14 6EB,Tel: 0121 441 2843, - ,,,4 ratings Rate it yourself - /Services/opticians/LeaveReview/DefaultView.aspx?id=OP_5M1_3786__000001_B146EB,,,
Maginnis Opticians (Optometrists) Ltd,OP_5M1_7062__000003_B302JR,OPT,1379 Pershore Road,Stirchley,Birmingham,,,B30 2JR,Tel: 0121 458 2920, - ,,,No ratings yet Rate it yourself - /Services/opticians/LeaveReview/DefaultView.aspx?id=OP_5M1_7062__000003_B302JR,0,0,
Myoptics Eye Clinic,I2T1M,OPT,,14 Curdale Road,Bartley Green,Birmingham,West Midlands,B32 4HB,Tel: 01214754920, - ,,,2 ratings Rate it yourself - /Services/opticians/LeaveReview/DefaultView.aspx?id=I2T1M,,,
Knights Ophthalmic Opticians,5M154__000001_B295QL,OPT,130 Castle Square,Weoley Castle,Birmingham,,,B29 5QL,Tel: 0121 411 1555, - ,,,1 rating Rate it yourself - /Services/opticians/LeaveReview/DefaultView.aspx?id=5M154__000001_B295QL,,,
Pike Opticians Ltd,OP_5D1_13856__000001_B903BB,OPT,,452 Stratford Road,Shirley,Solihull,,B90 4AQ,Tel: 0121 744 9093, - ,,,No ratings yet Rate it yourself - /Services/opticians/LeaveReview/DefaultView.aspx?id=OP_5D1_13856__000001_B903BB,0,0,
Waddam Opticians Ltd,OP_5M1_12038__000002_B280XB,OPT,278 Baldwins Lane,Hall Green,Birmingham,,,B28 0XB,Tel: 0121 745 3663, - ,,,No ratings yet Rate it yourself - /Services/opticians/LeaveReview/DefaultView.aspx?id=OP_5M1_12038__000002_B280XB,0,0,
Scrivens Ltd,OP_5M1_10750__000001_B295QG,OPT,167 Weoley Castle Road,Weoley Castle,,Birmingham,West Midlands,B29 5QH,Tel: 0121 427 1021, - ,,,No ratings yet Rate it yourself - /Services/opticians/LeaveReview/DefaultView.aspx?id=OP_5M1_10750__000001_B295QG,0,0,
Tesco Stores Ltd,OL/CO-1998/TAM__000001_B904EN,OPT,,1505 Stratford Road,Shirley,Solihull,,B90 4EN,Tel: 0121 253 7538, - ,,,No ratings yet Rate it yourself - /Services/opticians/LeaveReview/DefaultView.aspx?id=OL/CO-1998/TAM__000001_B904EN,0,0,
Sims Opticians,OP_5D1_11728__000002_B903BT,OPT,,1 Union Road,Solihull,Solihull,,B90 3BT,Tel: 0121 744 6036, - ,,,No ratings yet Rate it yourself - /Services/opticians/LeaveReview/DefaultView.aspx?id=OP_5D1_11728__000002_B903BT,0,0,
Homespecs,5QW052,OPT,,383 Stratford Road,Shirley,Birmingham,,B90 3BW,Tel: 0121 733 1232, - ,,,No ratings yet Rate it yourself - /Services/opticians/LeaveReview/DefaultView.aspx?id=5QW052,0,0,
Pabari Opticians,5M1068,OPT,,84 Raddlebarn Road,,Birmingham,,B29 6HH,, - ,,,No ratings yet Rate it yourself - /Services/opticians/LeaveReview/DefaultView.aspx?id=5M1068,0,0,
Eye C Healthcare (Domiciliary Only) BY APPOINTMENT ONLY  ,DOM04__000001_B904UZ,OPT,,11 Horton Grove,,Solihull,West Midlands,B90 4UZ,Tel: 07957 652170, - ,,,No ratings yet Rate it yourself - /Services/opticians/LeaveReview/DefaultView.aspx?id=DOM04__000001_B904UZ,0,0,
Boots-Kings Heath - Alcester Rd Sth,OP_5M1_3509__000001_B147JQ,OPT,51A Alcester Rd South,,Kings Heath,Birmingham,West Midlands,B14 7JQ,Tel: 0121 444 2376, - ,,,1 rating Rate it yourself - /Services/opticians/LeaveReview/DefaultView.aspx?id=OP_5M1_3509__000001_B147JQ,,,
Cox Opticians,5M1096,OPT,,57 Raddlebarn Road,Selly Oak,Birmingham,,B29 6HQ,Tel: 0121 472 7888, - ,,,No ratings yet Rate it yourself - /Services/opticians/LeaveReview/DefaultView.aspx?id=5M1096,0,0,
Scrivens Ltd,OP_5M1_5464__000002_B147LG,OPT,124 High Street,Kings Heath,,Birmingham,West Midlands,B14 7LG,Tel: 0121 444 2656, - ,,,No ratings yet Rate it yourself - /Services/opticians/LeaveReview/DefaultView.aspx?id=OP_5M1_5464__000002_B147LG,0,0,
Specsavers Opticians,OP_5M1_5794__000001_B147LG,OPT,,132 High Street,Kings Heath,Birmingham,,B14 7LG,Tel: 0121 441 1322, - ,,,No ratings yet Rate it yourself - /Services/opticians/LeaveReview/DefaultView.aspx?id=OP_5M1_5794__000001_B147LG,0,0,
Specsavers Opticians,TAM01__000004_B903AH,OPT,,207 Stratford Road,Shirley,Solihull,,B90 3AH,Tel: 0121 506 8650, - ,,,No ratings yet Rate it yourself - /Services/opticians/LeaveReview/DefaultView.aspx?id=TAM01__000004_B903AH,0,0,
Asda Opticians,OPT_B90 3GG,OPT,,STRATFORD ROAD,PARKGATE,SHIRLEY,,B90 3GG,Tel: 0121 296 3736, - ,,,No ratings yet Rate it yourself - /Services/opticians/LeaveReview/DefaultView.aspx?id=OPT_B90 3GG,0,0,
Portland Eyecare Services Ltd,5M152__000002_B147EG,OPT,,1 Institute Road,Birmingham,Birmingham,,B14 7EG,Tel: 0121 444 4838, - ,,,No ratings yet Rate it yourself - /Services/opticians/LeaveReview/DefaultView.aspx?id=5M152__000002_B147EG,0,0,
Asda Opticians,OPT_B29 5UP,OPT,,BARNSHILL,"51, BARNES HILL",BIRMINGHAM,,B29 5UP,Tel: 0121 296 0659, - ,,,No ratings yet Rate it yourself - /Services/opticians/LeaveReview/DefaultView.aspx?id=OPT_B29 5UP,0,0,
Boots-Birmingham- Shirley,OP_5D1_862__000001_B903AU,OPT,,199 Stratford Road,Shirley,Solihull,,B90 3AU,Tel: 0121 744 1207, - ,,,1 rating Rate it yourself - /Services/opticians/LeaveReview/DefaultView.aspx?id=OP_5D1_862__000001_B903AU,,,
Scrivens Opticians & Hearing Care,13022015_B90 3AU,OPT,,191 Stratford Road,,"Shirley, Solihull",,B90 3AU,, - ,,,No ratings yet Rate it yourself - /Services/opticians/LeaveReview/DefaultView.aspx?id=13022015_B90 3AU,0,0,
J & D Mason Opticians,5M144__000001_B296AU,OPT,,18 Farmhouse Way,Shirley,Solihull,,B90 4EH,Tel: 0121 705 8139, - ,,,No ratings yet Rate it yourself - /Services/opticians/LeaveReview/DefaultView.aspx?id=5M144__000001_B296AU,0,0,
The Eye Collective Selly Oak,S6Z1Q,OPT,,14 Selly Oak Shopping Park,Aston Webb,Birmingham,,B29 6SQ,Tel: 0121 472 0211, - ,,,No ratings yet Rate it yourself - /Services/opticians/LeaveReview/DefaultView.aspx?id=S6Z1Q,0,0,
Optical Eye Lusions,5M1017,OPT,,1514 Stratford Road,Hall Green,Birmingham,,B28 9ET,Tel: 0121 744 2805, - ,,,1 rating Rate it yourself - /Services/opticians/LeaveReview/DefaultView.aspx?id=5M1017,,,
Alan Tyler Opticians,5QW047,OPT,,11 Arden Buildings,Station Road,Solihull,,B93 8HH,Tel: 01564 772217, - ,,,No ratings yet Rate it yourself - /Services/opticians/LeaveReview/DefaultView.aspx?id=5QW047,0,0,
S W Optics Ltd,5PG183,OPT,,3 Libbards Gate,Solihull,West Midlands,,B91 3XQ,Tel: 0121 704 1429, - ,,,No ratings yet Rate it yourself - /Services/opticians/LeaveReview/DefaultView.aspx?id=5PG183,0,0,
Visioncraft (UK) Ltd,5PG194,OPT,,166 Streetsbrook Road,Shirley,Solihull,,B90 3PH,Tel: 0121 772 4424, - ,,,No ratings yet Rate it yourself - /Services/opticians/LeaveReview/DefaultView.aspx?id=5PG194,0,0,
Specs at Home (Midlands) Ltd,5MX105__000001_B280PH,OPT,249 Wake Green Rd,Moseley,Birmingham,B13 9XH,West Midlands,B13 9XH,Tel: 0121 769 2672, - ,,,No ratings yet Rate it yourself - /Services/opticians/LeaveReview/DefaultView.aspx?id=5MX105__000001_B280PH,0,0,
Pabari Opticians Ltd,OP_5M1_4726__000001_B138JG,OPT,14 St. Marys Row,Moseley,Birmingham,,,B13 8JG,Tel: 0121 449 0845, - ,,,No ratings yet Rate it yourself - /Services/opticians/LeaveReview/DefaultView.aspx?id=OP_5M1_4726__000001_B138JG,0,0,
Hagley Eyecare Studio,201220160917,OPT,,Unit 42 The Old Woodyard,,Hagley,,DY9 9LQ,, - ,,,2 ratings Rate it yourself - /Services/opticians/LeaveReview/DefaultView.aspx?id=201220160917,,,
Onkar Eye Society,5M1003,OPT,,5 St Mary's Row,Moseley,Birmingham,,B13 8HW,Tel: 0121 249 2071, - ,,,No ratings yet Rate it yourself - /Services/opticians/LeaveReview/DefaultView.aspx?id=5M1003,0,0,
S W Optics Ltd,5M1148__000002_B152TT,OPT,"University Of Birmingham, University Centre",Edgbaston,Birmingham,,,B15 2TT,Tel: 0121 414 2714, - ,,,4 ratings Rate it yourself - /Services/opticians/LeaveReview/DefaultView.aspx?id=5M1148__000002_B152TT,,,
Midlands Community Eyecare Limited,TP9FV,OPT,Kings Court,17 School Road,,Birmingham,West Midlands,B28 8JG,Tel: 0121 517 0218, - ,,,3 ratings Rate it yourself - /Services/opticians/LeaveReview/DefaultView.aspx?id=TP9FV,,,
Eye Society Opticians,OP_5HT_3430__000002_B633AW,OPT,,4 Peckingham Street,,Halesowen,West Midlands,B63 3AW,Tel: 0121 585 5347, - ,,,1 rating Rate it yourself - /Services/opticians/LeaveReview/DefaultView.aspx?id=OP_5HT_3430__000002_B633AW,,,
Boots-Halesowen,OP_5HT_690__000001_B633AS,OPT,2 Hagley Street,Halesowen,,West Midlands,,B63 3AS,Tel: 0121 550 1610, - ,,,2 ratings Rate it yourself - /Services/opticians/LeaveReview/DefaultView.aspx?id=OP_5HT_690__000001_B633AS,,,
Specsavers ,OP_5HT_14938__000002_B634AL,OPT,36 Hagley Mall,The Cornbow Centre,Halesowen,,,B63 4AL,Tel: 0121 504 4940, - ,,,No ratings yet Rate it yourself - /Services/opticians/LeaveReview/DefaultView.aspx?id=OP_5HT_14938__000002_B634AL,0,0,
Chapman & Myers Opticians,OP_5HT_437__000001_B634AB,OPT,14 Hagley Mall,The Cornbow Centre,,Halesowen,,B63 4AL,Tel: 0121 585 7065, - ,,,1 rating Rate it yourself - /Services/opticians/LeaveReview/DefaultView.aspx?id=OP_5HT_437__000001_B634AB,,,
Scrivens Ltd,OP_5HT_5770__000001_B634AL,OPT,5 Hagley Mall,The Cornbow Centre,,Halesowen,,B63 4AL,Tel: 0121 501 1010, - ,,,No ratings yet Rate it yourself - /Services/opticians/LeaveReview/DefaultView.aspx?id=OP_5HT_5770__000001_B634AL,0,0,
Michael Wolffe,5M140__000001_B138DH,OPT,22 Chantry Road,Moseley,Birmingham,Birmingham,,B13 8DH,Tel: 0121 449 1724, - ,,,No ratings yet Rate it yourself - /Services/opticians/LeaveReview/DefaultView.aspx?id=5M140__000001_B138DH,0,0,
ZMP:  Charles Barlow (domiciliary),OL/01-10826/5EY__000003_B946JG,OPT,171 Station Lane,Lapworth,Solihull,West Midlands,,B94 6JG,Tel: 0800 652 5505, - ,,,No ratings yet Rate it yourself - /Services/opticians/LeaveReview/DefaultView.aspx?id=OL/01-10826/5EY__000003_B946JG,0,0,
Eagle Eyes Opticians Ltd,SOUTH102__000003_B288AE,OPT,1132 Stratford Road,Hall Green,Birmingham,,,B28 8AE,Tel: 0121 777 8889, - ,,,No ratings yet Rate it yourself - /Services/opticians/LeaveReview/DefaultView.aspx?id=SOUTH102__000003_B288AE,0,0,
Bainbridge Opticians,5M1032,OPT,,174 High Street,Harborne,Birmingham,,B17 9PP,Tel: 0121 427 8201, - ,,,No ratings yet Rate it yourself - /Services/opticians/LeaveReview/DefaultView.aspx?id=5M1032,0,0,
Optical Clinic,B114DA_0001__000002_B114DA,OPT,837 Stratford Road,Sparkhill,Birmingham,West Midlands,,B11 4DA,Tel: 0121 777 2111, - ,,,No ratings yet Rate it yourself - /Services/opticians/LeaveReview/DefaultView.aspx?id=B114DA_0001__000002_B114DA,0,0,
Looks Opticians Ltd,OP_5M1_6928__000001_B179PN,OPT,154 High Street,Harborne,Birmingham,,,B17 9PN,Tel: 0121 427 3535, - ,,,No ratings yet Rate it yourself - /Services/opticians/LeaveReview/DefaultView.aspx?id=OP_5M1_6928__000001_B179PN,0,0,
Harborne VE LTD ,5M155__000001_B179NP,OPT,,144 High Street,Harborne,Birmingham,West Midlands,B17 9NP,Tel: 0121 428 4835, - ,,,2 ratings Rate it yourself - /Services/opticians/LeaveReview/DefaultView.aspx?id=5M155__000001_B179NP,,,
Specsavers,5M1108,OPT,,136 High Street,Harborne,Birmingham,,B17 9NN,Tel: 0121 426 0810, - ,,,No ratings yet Rate it yourself - /Services/opticians/LeaveReview/DefaultView.aspx?id=5M1108,0,0,
Maxton Saunders Ltd,5PG175,OPT,,842 Stratford Road,Sparkhill,Birmingham,,B11 4BS,Tel: 0121 777 4081, - ,,,1 rating Rate it yourself - /Services/opticians/LeaveReview/DefaultView.aspx?id=5PG175,,,
Brittain Opticians Ltd,5MX080,OPT,,97 High Street,Harborne,Birmingham,,B17 9NR,Tel: 0121 427 1007, - ,,,No ratings yet Rate it yourself - /Services/opticians/LeaveReview/DefaultView.aspx?id=5MX080,0,0,
Peter Bainbridge Optometrists,OP_5M1_10531__000001_B179PP,OPT,93 High Street,Harborne,,Birmingham,West Midlands,B17 9NR,Tel: 0121 427 8201, - ,,,3 ratings Rate it yourself - /Services/opticians/LeaveReview/DefaultView.aspx?id=OP_5M1_10531__000001_B179PP,,,
Robinson & Sproson,OP_5DR_12006__000001_DY90NW,OPT,143 - 145 Worcester Road,Hagley,West Midlands,Hagley,,DY9 0NW,Tel: 01562 882444, - ,,,No ratings yet Rate it yourself - /Services/opticians/LeaveReview/DefaultView.aspx?id=OP_5DR_12006__000001_DY90NW,0,0,
Low Vision Centre,5PG173,OPT,,62 Woodville Road,Harborne,Birmingham,,B17 9AT,Tel: 0121 478 5252, - ,,,No ratings yet Rate it yourself - /Services/opticians/LeaveReview/DefaultView.aspx?id=5PG173,0,0,
Vision Express (UK) Ltd,5QW005,OPT,,Touchwood Shopping Centre,,Solihull,,B91 3QE,Tel: 0121 704 7150, - ,,,No ratings yet Rate it yourself - /Services/opticians/LeaveReview/DefaultView.aspx?id=5QW005,0,0,
Eye Sight Centre Opticians,5PG165,OPT,,385 Ladypool Road,Balsall Heath,Birmingham,,B12 8LA,Tel: 0121 449 4530, - ,,,No ratings yet Rate it yourself - /Services/opticians/LeaveReview/DefaultView.aspx?id=5PG165,0,0,
Specsavers Opticians,OP_5D1_3685__000001_B913TA,OPT,,90 High Street,,Solihull,,B91 3TA,Tel: 0121 711 3411, - ,,,No ratings yet Rate it yourself - /Services/opticians/LeaveReview/DefaultView.aspx?id=OP_5D1_3685__000001_B913TA,0,0,
Mohammed Dilwar Khan,5MX65__000001_B128AR,OPT,,259 Stoney Lane,Balsall Heath,Birmingham,,B12 8AR,Tel: 0121 449 2111, - ,,,No ratings yet Rate it yourself - /Services/opticians/LeaveReview/DefaultView.aspx?id=5MX65__000001_B128AR,0,0,
Eyecon Opticians,TP830,OPT,,190b Stoney Lane,Ballsall Health,Birmingham,West Midlands,B12 8AN,Tel: 0121 449 2111, - ,,,No ratings yet Rate it yourself - /Services/opticians/LeaveReview/DefaultView.aspx?id=TP830,0,0,