Organisation Name,NACS Code,Organisation Type,Address1,Address2,Address3,Address4,Address5,PostCode,Telephone Number,Opening time,Value  (Opening time),Banding Classification  (Opening time),NHS.UK users rating,Value  (NHS.UK users rating),Banding Classification  (NHS.UK users rating),Car parking (Is there car parking at this organisation?)
Eyecare at Home,EYECAREATHOME1,OPT,208 Wharf lane,,,Solihull,West Midlands,B91 2UN,Tel: 0845 299 6069, - ,,,No ratings yet Rate it yourself - /Services/opticians/LeaveReview/DefaultView.aspx?id=EYECAREATHOME1,0,0,
Perspective Opticians ,OP_5D1_5333__000001_B913BH,OPT,56 Drury Lane,Mell Square,Solihull,Solihull,,B91 3BH,Tel: 0121 709 1000, - ,,,No ratings yet Rate it yourself - /Services/opticians/LeaveReview/DefaultView.aspx?id=OP_5D1_5333__000001_B913BH,0,0,
A B Optics,OP_5D1_13858__000001_B913DA,OPT,,681 Warwick Road,,Solihull,,B91 3DA,Tel: 0121 704 2615, - ,,,5 ratings Rate it yourself - /Services/opticians/LeaveReview/DefaultView.aspx?id=OP_5D1_13858__000001_B913DA,,,
Boots-Solihull,OP_5D1_3193__000001_B913AT,OPT,57 Mill Lane,,,Solihull,West Midlands,B91 3AT,Tel: 0121 705 2152, - ,,,No ratings yet Rate it yourself - /Services/opticians/LeaveReview/DefaultView.aspx?id=OP_5D1_3193__000001_B913AT,0,0,
Specsavers Opticians,OP_5D1_3685__000001_B913TA,OPT,,90 High Street,,Solihull,,B91 3TA,Tel: 0121 711 3411, - ,,,No ratings yet Rate it yourself - /Services/opticians/LeaveReview/DefaultView.aspx?id=OP_5D1_3685__000001_B913TA,0,0,
Vision Express (UK) Ltd,5QW005,OPT,,Touchwood Shopping Centre,,Solihull,,B91 3QE,Tel: 0121 704 7150, - ,,,No ratings yet Rate it yourself - /Services/opticians/LeaveReview/DefaultView.aspx?id=5QW005,0,0,
Eye Specialist Opticians,OP_5D1_13861__000002_B928JL,OPT,,83 Hobs Moat Road,,Solihull,,B92 8JL,Tel: 0121 742 6043, - ,,,1 rating Rate it yourself - /Services/opticians/LeaveReview/DefaultView.aspx?id=OP_5D1_13861__000002_B928JL,,,
Community Eyecare trading as Vision Call,OP_B920AJ_20418,OPT,463-465 Warwick Road,"Cleeves House, Hampton Court, 55 Marsh Lane, Hampton-in-Arden",,Solihull,,B92 0AJ,Tel: 01675 446 065, - ,,,No ratings yet Rate it yourself - /Services/opticians/LeaveReview/DefaultView.aspx?id=OP_B920AJ_20418,0,0,
Walford & Round,OP_5D1_8708__000002_B911BQ,OPT,,Dovehouse Parade,33 Warwick Road,Solihull,,B91 1BQ,Tel: 0121 706 4522, - ,,,No ratings yet Rate it yourself - /Services/opticians/LeaveReview/DefaultView.aspx?id=OP_5D1_8708__000002_B911BQ,0,0,
Boots-Sheldon,OP_5MY_2665__000002_B263JH,OPT,2236 Coventry Road,Sheldon,,Birmingham,,B26 3JH,Tel: 0121 743 3360, - ,,,No ratings yet Rate it yourself - /Services/opticians/LeaveReview/DefaultView.aspx?id=OP_5MY_2665__000002_B263JH,0,0,
S W Optics Ltd,5PG183,OPT,,3 Libbards Gate,Solihull,West Midlands,,B91 3XQ,Tel: 0121 704 1429, - ,,,No ratings yet Rate it yourself - /Services/opticians/LeaveReview/DefaultView.aspx?id=5PG183,0,0,
Bannister Opticians Ltd,OP_5D1_8378__000001_B930LE,OPT,,17 St. Johns Way,Knowle,Solihull,,B93 0LE,Tel: 01564 778206, - ,,,3 ratings Rate it yourself - /Services/opticians/LeaveReview/DefaultView.aspx?id=OP_5D1_8378__000001_B930LE,,,
Scrivens Ltd,OP_5MY_6315__000002_B263JB,OPT,2162 Coventry Road,Sheldon,,Birmingham,West Midlands,B26 3JB,Tel: 0121 743 2704, - ,,,No ratings yet Rate it yourself - /Services/opticians/LeaveReview/DefaultView.aspx?id=OP_5MY_6315__000002_B263JB,0,0,
Greys Opticians,OP_5D1_4664__000001_B93ONA,OPT,1642 High Street,Knowle,,Solihull,West Midlands,B93 0NA,Tel: 01564 773466, - ,,,No ratings yet Rate it yourself - /Services/opticians/LeaveReview/DefaultView.aspx?id=OP_5D1_4664__000001_B93ONA,0,0,
J & D Mason Opticians,5M144__000001_B296AU,OPT,,18 Farmhouse Way,Shirley,Solihull,,B90 4EH,Tel: 0121 705 8139, - ,,,No ratings yet Rate it yourself - /Services/opticians/LeaveReview/DefaultView.aspx?id=5M144__000001_B296AU,0,0,
Direct Vision Opticians at Pan Pharmacy,,OPT,Direct Vision Opticians,297-299 Church Road,Sheldon,Birmingham,West Midlands,B26 3YH,Tel: 0121 742 9599 (ext. 3), - ,,,N/A - Data not available,,,yes
Maginnis Opticians (Optometrists) Ltd,OP_5D1_4083__000001_B377AE,OPT,32a Holly Lane,Marston Green,Birmingham,,,B37 7AE,Tel: 0121 779 4242, - ,,,No ratings yet Rate it yourself - /Services/opticians/LeaveReview/DefaultView.aspx?id=OP_5D1_4083__000001_B377AE,0,0,
Visioncraft (UK) Ltd,5PG194,OPT,,166 Streetsbrook Road,Shirley,Solihull,,B90 3PH,Tel: 0121 772 4424, - ,,,No ratings yet Rate it yourself - /Services/opticians/LeaveReview/DefaultView.aspx?id=5PG194,0,0,
Complete Community Care,C/7200/5PK,OPT,Complete Community Care Birmingham,42 Ringswood Road,,Solihull,West Midlands,B92 7NH,Tel: 0121 439 6496, - ,,,No ratings yet Rate it yourself - /Services/opticians/LeaveReview/DefaultView.aspx?id=C/7200/5PK,0,0,
Eye C Healthcare (Domiciliary Only) BY APPOINTMENT ONLY  ,DOM04__000001_B904UZ,OPT,,11 Horton Grove,,Solihull,West Midlands,B90 4UZ,Tel: 07957 652170, - ,,,No ratings yet Rate it yourself - /Services/opticians/LeaveReview/DefaultView.aspx?id=DOM04__000001_B904UZ,0,0,
Manor Opticians,5PG120,OPT,,1752 Coventry Road,Sheldon,Birmingham,,B26 1PB,Tel: 0121 722 7226, - ,,,No ratings yet Rate it yourself - /Services/opticians/LeaveReview/DefaultView.aspx?id=5PG120,0,0,
Tesco Stores Ltd,OL/CO-1998/TAM__000001_B904EN,OPT,,1505 Stratford Road,Shirley,Solihull,,B90 4EN,Tel: 0121 253 7538, - ,,,No ratings yet Rate it yourself - /Services/opticians/LeaveReview/DefaultView.aspx?id=OL/CO-1998/TAM__000001_B904EN,0,0,
New Image Opticians,5PG152,OPT,,1120 Warwick Road,Acocks Green,Birmingham,,B27 6BL,Tel: 0121 707 9733, - ,,,1 rating Rate it yourself - /Services/opticians/LeaveReview/DefaultView.aspx?id=5PG152,,,
Sims Opticians,OP_5D1_11728__000002_B903BT,OPT,,1 Union Road,Solihull,Solihull,,B90 3BT,Tel: 0121 744 6036, - ,,,No ratings yet Rate it yourself - /Services/opticians/LeaveReview/DefaultView.aspx?id=OP_5D1_11728__000002_B903BT,0,0,
Homespecs,5QW052,OPT,,383 Stratford Road,Shirley,Birmingham,,B90 3BW,Tel: 0121 733 1232, - ,,,No ratings yet Rate it yourself - /Services/opticians/LeaveReview/DefaultView.aspx?id=5QW052,0,0,
Specsavers Opticians,TAM01__000004_B903AH,OPT,,207 Stratford Road,Shirley,Solihull,,B90 3AH,Tel: 0121 506 8650, - ,,,No ratings yet Rate it yourself - /Services/opticians/LeaveReview/DefaultView.aspx?id=TAM01__000004_B903AH,0,0,
Boots-Birmingham- Shirley,OP_5D1_862__000001_B903AU,OPT,,199 Stratford Road,Shirley,Solihull,,B90 3AU,Tel: 0121 744 1207, - ,,,1 rating Rate it yourself - /Services/opticians/LeaveReview/DefaultView.aspx?id=OP_5D1_862__000001_B903AU,,,
Scrivens Opticians & Hearing Care,13022015_B90 3AU,OPT,,191 Stratford Road,,"Shirley, Solihull",,B90 3AU,, - ,,,No ratings yet Rate it yourself - /Services/opticians/LeaveReview/DefaultView.aspx?id=13022015_B90 3AU,0,0,
Banks Opticians,5PG02__000005_B276RA,OPT,,1115A Warwick Road,Acocks Green,Birmingham,West Midlands,B27 6RA,Tel: 0121 706 6604, - ,,,No ratings yet Rate it yourself - /Services/opticians/LeaveReview/DefaultView.aspx?id=5PG02__000005_B276RA,0,0,
Pike Opticians Ltd,OP_5D1_13856__000001_B903BB,OPT,,452 Stratford Road,Shirley,Solihull,,B90 4AQ,Tel: 0121 744 9093, - ,,,No ratings yet Rate it yourself - /Services/opticians/LeaveReview/DefaultView.aspx?id=OP_5D1_13856__000001_B903BB,0,0,
Boots-Acocks Green,OP_5MY_2664__000002_B276BH,OPT,1082 Warwick Road,Acocks Green,,Birmingham,,B27 6BH,Tel: 0121 706 1386, - ,,,1 rating Rate it yourself - /Services/opticians/LeaveReview/DefaultView.aspx?id=OP_5MY_2664__000002_B276BH,,,
Asda Opticians,OPT_B90 3GG,OPT,,STRATFORD ROAD,PARKGATE,SHIRLEY,,B90 3GG,Tel: 0121 296 3736, - ,,,No ratings yet Rate it yourself - /Services/opticians/LeaveReview/DefaultView.aspx?id=OPT_B90 3GG,0,0,
Alan Tyler Opticians,5QW047,OPT,,11 Arden Buildings,Station Road,Solihull,,B93 8HH,Tel: 01564 772217, - ,,,No ratings yet Rate it yourself - /Services/opticians/LeaveReview/DefaultView.aspx?id=5QW047,0,0,
Optical Eye Lusions,5M1017,OPT,,1514 Stratford Road,Hall Green,Birmingham,,B28 9ET,Tel: 0121 744 2805, - ,,,1 rating Rate it yourself - /Services/opticians/LeaveReview/DefaultView.aspx?id=5M1017,,,
Krystal Vision,5MY26__000002_B261AD,OPT,,1592 Coventry Road,Yardley,Birmingham,,B26 1AL,Tel: 0121 707 7004, - ,,,No ratings yet Rate it yourself - /Services/opticians/LeaveReview/DefaultView.aspx?id=5MY26__000002_B261AD,0,0,
Tesco Opticians,5PG121,OPT,,Swan Shopping Centre,Coventry Road,Birmingham,,B26 1AD,Tel: 0121 601 3438, - ,,,1 rating Rate it yourself - /Services/opticians/LeaveReview/DefaultView.aspx?id=5PG121,,,
Specsavers Opticians,5QW048,OPT,,"Unit 34, 2-4 Greenwood Square",Chelmsley Wood Shopping Centre,Birmingham,,B37 5TR,Tel: 0121 329 5510, - ,,,No ratings yet Rate it yourself - /Services/opticians/LeaveReview/DefaultView.aspx?id=5QW048,0,0,
Specsavers,5PG117,OPT,,"Unit 3, The Swan Shopping Centre",Yardley,Birmingham,,B25 8UJ,Tel: 0121 765 5700, - ,,,No ratings yet Rate it yourself - /Services/opticians/LeaveReview/DefaultView.aspx?id=5PG117,0,0,
Alan Tyler Opticians,5PG01__000003_B277PS,OPT,,291 Fox Hollies Road,,Birmingham,West Midlands,B27 7PS,Tel: 0121 706 3998, - ,,,2 ratings Rate it yourself - /Services/opticians/LeaveReview/DefaultView.aspx?id=5PG01__000003_B277PS,,,
Scrivens Opticians & Hearing Care,5PG126,OPT,,146 Church Road,Yardley,Birmingham,,B25 8UT,Tel: 0121 784 8022, - ,,,No ratings yet Rate it yourself - /Services/opticians/LeaveReview/DefaultView.aspx?id=5PG126,0,0,
Boots-Birmingham - Yardley,OP_5MY_9735__000002_B258LP,OPT,1321 Coventry Road,Yardley,,Birmingham,,B25 8LP,Tel: 0121 707 9177, - ,,,No ratings yet Rate it yourself - /Services/opticians/LeaveReview/DefaultView.aspx?id=OP_5MY_9735__000002_B258LP,0,0,
Midlands Community Eyecare Limited,TP9FV,OPT,Kings Court,17 School Road,,Birmingham,West Midlands,B28 8JG,Tel: 0121 517 0218, - ,,,3 ratings Rate it yourself - /Services/opticians/LeaveReview/DefaultView.aspx?id=TP9FV,,,
Waddam Opticians Ltd,OP_5M1_12038__000002_B280XB,OPT,278 Baldwins Lane,Hall Green,Birmingham,,,B28 0XB,Tel: 0121 745 3663, - ,,,No ratings yet Rate it yourself - /Services/opticians/LeaveReview/DefaultView.aspx?id=OP_5M1_12038__000002_B280XB,0,0,
Scrivens Ltd,OP_5MY_5456__000002_B339SB,OPT,300 Kitts Green Road,Lea Hall,,Birmingham,West Midlands,B33 9SB,Tel: 0121 783 3159, - ,,,No ratings yet Rate it yourself - /Services/opticians/LeaveReview/DefaultView.aspx?id=OP_5MY_5456__000002_B339SB,0,0,
Eagle Eyes Opticians Ltd,SOUTH102__000003_B288AE,OPT,1132 Stratford Road,Hall Green,Birmingham,,,B28 8AE,Tel: 0121 777 8889, - ,,,No ratings yet Rate it yourself - /Services/opticians/LeaveReview/DefaultView.aspx?id=SOUTH102__000003_B288AE,0,0,
Maginnis Opticians (Optometrists) Ltd,OP_5D1_4086__000001_CV77ER,OPT,384 Kenilworth Road,Balsall Common,Coventry,,,CV7 7ER,Tel: 01676 532180, - ,,,1 rating Rate it yourself - /Services/opticians/LeaveReview/DefaultView.aspx?id=OP_5D1_4086__000001_CV77ER,,,
Dickens Eye Clinic,DICKENS__000001_B901UB,OPT,39 Main Street,Dickens Heath,Solihull,West Midlands,,B90 1UB,Tel: 0121 744 5544, - ,,,2 ratings Rate it yourself - /Services/opticians/LeaveReview/DefaultView.aspx?id=DICKENS__000001_B901UB,,,
Vision Call Midlands,01259__000003_B112JP,OPT,463-465 Warwick Road,Tylesley,Tylesley,,,B11 2JP,Tel: 0121 708 1349, - ,,,No ratings yet Rate it yourself - /Services/opticians/LeaveReview/DefaultView.aspx?id=01259__000003_B112JP,0,0,
Ian Michael Hadfield,OP_5D1_13860__000001_B376BB,OPT,,37 The Parade,Kingshurst,Birmingham,,B37 6BB,Tel: 0121 770 3226, - ,,,No ratings yet Rate it yourself - /Services/opticians/LeaveReview/DefaultView.aspx?id=OP_5D1_13860__000001_B376BB,0,0,
Specs at Home (Midlands) Ltd,5MX105__000001_B280PH,OPT,249 Wake Green Rd,Moseley,Birmingham,B13 9XH,West Midlands,B13 9XH,Tel: 0121 769 2672, - ,,,No ratings yet Rate it yourself - /Services/opticians/LeaveReview/DefaultView.aspx?id=5MX105__000001_B280PH,0,0,
Asda Optician,OPT_B10 0HH,OPT,,SMALL HEATH,"859, COVENTRY ROAD",BIRMINGHAM,,B10 0HH,Tel: 0121 7664810, - ,,,No ratings yet Rate it yourself - /Services/opticians/LeaveReview/DefaultView.aspx?id=OPT_B10 0HH,0,0,
Optical Clinic,B114DA_0001__000002_B114DA,OPT,837 Stratford Road,Sparkhill,Birmingham,West Midlands,,B11 4DA,Tel: 0121 777 2111, - ,,,No ratings yet Rate it yourself - /Services/opticians/LeaveReview/DefaultView.aspx?id=B114DA_0001__000002_B114DA,0,0,
Maxton Saunders Ltd,5PG175,OPT,,842 Stratford Road,Sparkhill,Birmingham,,B11 4BS,Tel: 0121 777 4081, - ,,,1 rating Rate it yourself - /Services/opticians/LeaveReview/DefaultView.aspx?id=5PG175,,,
Vision Replublic Opticians,5PG129,OPT,,15 Ownall Road,Shard End,Birmingham,,B34 7AH,Tel: 0121 439 7979, - ,,,No ratings yet Rate it yourself - /Services/opticians/LeaveReview/DefaultView.aspx?id=5PG129,0,0,
20-20 Vision,5PG131,OPT,,226 Warwick Road,Acocks Green,Birmingham,,B11 2ND,Tel: 0121 772 7709, - ,,,No ratings yet Rate it yourself - /Services/opticians/LeaveReview/DefaultView.aspx?id=5PG131,0,0,
Cook Eyecare Ltd,COOKS__000001_B347HR,OPT,,6 Hurst Lane,Castle Bromwich,Birmingham,,B34 7HR,Tel: 0121 747 3847, - ,,,2 ratings Rate it yourself - /Services/opticians/LeaveReview/DefaultView.aspx?id=COOKS__000001_B347HR,,,
Visioncraft (UK) Ltd,OP_B95PU_34397,OPT,,41 Yardley Green Road,Bordesley Green,Birmingham,,B9 5PU,Tel: 0121 772 4424, - ,,,No ratings yet Rate it yourself - /Services/opticians/LeaveReview/DefaultView.aspx?id=OP_B95PU_34397,0,0,
Eye Centre (Birmingham) Ltd,5PG04__000004_B112NB,OPT,,202 Warwick Road,Greet,Birmingham,,B11 2NB,Tel: 0121 772 2505, - ,,,No ratings yet Rate it yourself - /Services/opticians/LeaveReview/DefaultView.aspx?id=5PG04__000004_B112NB,0,0,
Lakis Stelios Stylianou,5M1011,OPT,,22 School Road,,Birmingham,,B14 4BJ,Tel: 0121 474 3359, - ,,,No ratings yet Rate it yourself - /Services/opticians/LeaveReview/DefaultView.aspx?id=5M1011,0,0,
A S Gill Optometrists,5MX59__000003_B114LP,OPT,537 Stratford Road,Sparkhill,Birmingham,Birmingham,,B11 4LP,Tel: 0121 766 5491, - ,,,No ratings yet Rate it yourself - /Services/opticians/LeaveReview/DefaultView.aspx?id=5MX59__000003_B114LP,0,0,
A S Gill Optometrists,5PG159,OPT,,537 Stratford Road,Sparkhill,Birmingham,,B11 4LP,Tel: 0121 766 5491, - ,,,No ratings yet Rate it yourself - /Services/opticians/LeaveReview/DefaultView.aspx?id=5PG159,0,0,
Scrivens Opticians,OP_5MP_453__000002_B463AG,OPT,91 High Street,Coleshill,Birmingham,,,B46 3AG,Tel: 01675 464507, - ,,,No ratings yet Rate it yourself - /Services/opticians/LeaveReview/DefaultView.aspx?id=OP_5MP_453__000002_B463AG,0,0,
Eye Sight Centre Opticians,5MX099,OPT,,485 Stratford Road,Sparkhill,Birmingham,,B11 4LE,Tel: 0121 771 1277, - ,,,No ratings yet Rate it yourself - /Services/opticians/LeaveReview/DefaultView.aspx?id=5MX099,0,0,
Eyesavers ,5PG151,OPT,,467 Bordesley Green,Bordesley Green,Birmingham,,B9 5XF,Tel: 0121 771 4488, - ,,,No ratings yet Rate it yourself - /Services/opticians/LeaveReview/DefaultView.aspx?id=5PG151,0,0,
Eyecare Opticians,B10 0LL_11111,OPT,,503a Coventry Road,Small Heath,Birmingham,West Midlands,B10 0LL,Tel: 0121 773 2129, - ,,,No ratings yet Rate it yourself - /Services/opticians/LeaveReview/DefaultView.aspx?id=B10 0LL_11111,0,0,
Banks Opticians,5PG162,OPT,,467 Stratford Road,Sparkhill,Birmingham,West Midlands,B11 4LD,Tel: 0121 773 2047, - ,,,No ratings yet Rate it yourself - /Services/opticians/LeaveReview/DefaultView.aspx?id=5PG162,0,0,
Mahendra Mohanlal Davda,OP_5MX_8213__000001_B100UN,OPT,,554a Coventry Road,Small Heath,Birmingham,,B10 0UN,Tel: 0121 772 2902, - ,,,No ratings yet Rate it yourself - /Services/opticians/LeaveReview/DefaultView.aspx?id=OP_5MX_8213__000001_B100UN,0,0,
ZMP:  Charles Barlow (domiciliary),OL/01-10826/5EY__000003_B946JG,OPT,171 Station Lane,Lapworth,Solihull,West Midlands,,B94 6JG,Tel: 0800 652 5505, - ,,,No ratings yet Rate it yourself - /Services/opticians/LeaveReview/DefaultView.aspx?id=OL/01-10826/5EY__000003_B946JG,0,0,
Rightspex Opticians,5PG154,OPT,,329 Green Lane,Small Heath,Birmingham,,B9 5PW,Tel: 0121 773 6690, - ,,,1 rating Rate it yourself - /Services/opticians/LeaveReview/DefaultView.aspx?id=5PG154,,,
Home Eye Clinic Ltd,C/3004__000005_B82LX,OPT,Ward End,,Birmingham,,,B8 2LX,Tel: 0121 3266624, - ,,,No ratings yet Rate it yourself - /Services/opticians/LeaveReview/DefaultView.aspx?id=C/3004__000005_B82LX,0,0,
Mikah Opticians,5MX096,OPT,,941 Alum Rock Road,Ward End,Birmingham,,B8 2LX,Tel: 0121 246 3777, - ,,,No ratings yet Rate it yourself - /Services/opticians/LeaveReview/DefaultView.aspx?id=5MX096,0,0,
Supa Spex Opticians,5MX122,OPT,,14 Muntz Street,,Birmingham,,B10 9SN,Tel: 0121 448 7176, - ,,,No ratings yet Rate it yourself - /Services/opticians/LeaveReview/DefaultView.aspx?id=5MX122,0,0,
Eyeworld Opticians,5PG155,OPT,,678 Alum Rock Road,Pelham,Birmingham,,B8 3NU,Tel: 0121 328 4328, - ,,,No ratings yet Rate it yourself - /Services/opticians/LeaveReview/DefaultView.aspx?id=5PG155,0,0,
Eyecon Opticians,TP830,OPT,,190b Stoney Lane,Ballsall Health,Birmingham,West Midlands,B12 8AN,Tel: 0121 449 2111, - ,,,No ratings yet Rate it yourself - /Services/opticians/LeaveReview/DefaultView.aspx?id=TP830,0,0,
Mohammed Dilwar Khan,5MX65__000001_B128AR,OPT,,259 Stoney Lane,Balsall Heath,Birmingham,,B12 8AR,Tel: 0121 449 2111, - ,,,No ratings yet Rate it yourself - /Services/opticians/LeaveReview/DefaultView.aspx?id=5MX65__000001_B128AR,0,0,
Colin Lee Opticians,5PG150,OPT,12 Fox & Goose Shopping Centre,Washwood Heath Road,Ward End,Birmingham,,B8 2EP,Tel: 0121 784 5888, - ,,,No ratings yet Rate it yourself - /Services/opticians/LeaveReview/DefaultView.aspx?id=5PG150,0,0,
Eurospex Opticians Ltd,OP_5MX_10352__000002_B100UF,OPT,386 Coventry Road,Small Heath,Birmingham,,,B10 0UF,Tel: 0121 773 7327, - ,,,No ratings yet Rate it yourself - /Services/opticians/LeaveReview/DefaultView.aspx?id=OP_5MX_10352__000002_B100UF,0,0,
The Eye Clinic,5MX124,OPT,Sparkbrook Community and Health Centre,34 Grantham Road,B11 1LU,Birmingham,,B11 1LU,Tel: 0121 464 9860, - ,,,1 rating Rate it yourself - /Services/opticians/LeaveReview/DefaultView.aspx?id=5MX124,,,
Eye Sight Centre Opticians,5PG165,OPT,,385 Ladypool Road,Balsall Heath,Birmingham,,B12 8LA,Tel: 0121 449 4530, - ,,,No ratings yet Rate it yourself - /Services/opticians/LeaveReview/DefaultView.aspx?id=5PG165,0,0,
Opticare Ophthalmic Opticians,5MX70__000001_B128JS,OPT,150a Ladypool Road,Sparkbrook,Birmingham,,,B12 8JS,Tel: 0121 771 3222, - ,,,1 rating Rate it yourself - /Services/opticians/LeaveReview/DefaultView.aspx?id=5MX70__000001_B128JS,,,
Eyespec,OPT_B100XE_1,OPT,,340 Coventry Road,Small Heath,Birmingham,,B10 0XE,Tel: 0121 772 1526, - ,,,1 rating Rate it yourself - /Services/opticians/LeaveReview/DefaultView.aspx?id=OPT_B100XE_1,,,
Specs Direct (Ward End) Ltd,5PG156,OPT,,659 Washwood Heath Road,Washwood Heath,Birmingham,,B8 2HJ,Tel: 0121 328 2964, - ,,,4 ratings Rate it yourself - /Services/opticians/LeaveReview/DefaultView.aspx?id=5PG156,,,
Portland Eye Care Services Ltd,5MX72__000001_B100SN,OPT,,345 Coventry Road,Small Heath,Birmingham,,B10 0SN,Tel: 0121 772 1442, - ,,,No ratings yet Rate it yourself - /Services/opticians/LeaveReview/DefaultView.aspx?id=5MX72__000001_B100SN,0,0,
T. Cox Opticians,5MX079,OPT,T. Cox Opticians,565 Washwood Heath Road,Ward End,Birmingham,,B8 2HB,Tel: 0121 327 1814, - ,,,No ratings yet Rate it yourself - /Services/opticians/LeaveReview/DefaultView.aspx?id=5MX079,0,0,
Vision Replublic,5M1098,OPT,,1003 Alcester Road South,Maypole,Birmingham,,B14 5JA,Tel: 0121 430 6572, - ,,,No ratings yet Rate it yourself - /Services/opticians/LeaveReview/DefaultView.aspx?id=5M1098,0,0,
Portland Eyecare Services Ltd,5M152__000002_B147EG,OPT,,1 Institute Road,Birmingham,Birmingham,,B14 7EG,Tel: 0121 444 4838, - ,,,No ratings yet Rate it yourself - /Services/opticians/LeaveReview/DefaultView.aspx?id=5M152__000002_B147EG,0,0,
Penzer Opticians,OP_5M1_5811__000001_B145HG,OPT,1024 Alcester Road South,Maypole,Nr Kings Heath,Birmingham,,B14 5NG,Tel: 0121 430 5538, - ,,,1 rating Rate it yourself - /Services/opticians/LeaveReview/DefaultView.aspx?id=OP_5M1_5811__000001_B145HG,,,yes
Pabari Opticians Ltd,OP_5M1_4726__000001_B138JG,OPT,14 St. Marys Row,Moseley,Birmingham,,,B13 8JG,Tel: 0121 449 0845, - ,,,No ratings yet Rate it yourself - /Services/opticians/LeaveReview/DefaultView.aspx?id=OP_5M1_4726__000001_B138JG,0,0,
Vincent Roberts Optometrist,OP_5M1_3786__000001_B146EB,OPT,267 Alcester Road South,Kings Heath,Birmingham,,,B14 6EB,Tel: 0121 441 2843, - ,,,4 ratings Rate it yourself - /Services/opticians/LeaveReview/DefaultView.aspx?id=OP_5M1_3786__000001_B146EB,,,
Onkar Eye Society,5M1003,OPT,,5 St Mary's Row,Moseley,Birmingham,,B13 8HW,Tel: 0121 249 2071, - ,,,No ratings yet Rate it yourself - /Services/opticians/LeaveReview/DefaultView.aspx?id=5M1003,0,0,
Boots-Kings Heath - Alcester Rd Sth,OP_5M1_3509__000001_B147JQ,OPT,51A Alcester Rd South,,Kings Heath,Birmingham,West Midlands,B14 7JQ,Tel: 0121 444 2376, - ,,,1 rating Rate it yourself - /Services/opticians/LeaveReview/DefaultView.aspx?id=OP_5M1_3509__000001_B147JQ,,,
The I Clinic,OP_B83BH_30203,OPT,,227 Alum Rock Road,Alum Rock,Birmingham,,B8 3BH,Tel: 0121 326 9008, - ,,,No ratings yet Rate it yourself - /Services/opticians/LeaveReview/DefaultView.aspx?id=OP_B83BH_30203,0,0,
Specsavers Opticians,OP_5M1_5794__000001_B147LG,OPT,,132 High Street,Kings Heath,Birmingham,,B14 7LG,Tel: 0121 441 1322, - ,,,No ratings yet Rate it yourself - /Services/opticians/LeaveReview/DefaultView.aspx?id=OP_5M1_5794__000001_B147LG,0,0,
Scrivens Ltd,OP_5M1_5464__000002_B147LG,OPT,124 High Street,Kings Heath,,Birmingham,West Midlands,B14 7LG,Tel: 0121 444 2656, - ,,,No ratings yet Rate it yourself - /Services/opticians/LeaveReview/DefaultView.aspx?id=OP_5M1_5464__000002_B147LG,0,0,
Shifa Eye Clinic,5MX117,OPT,,512-514 Moseley Road,Balsall Heath,Birmingham,,B12 9AH,Tel: 0121 440 6065, - ,,,No ratings yet Rate it yourself - /Services/opticians/LeaveReview/DefaultView.aspx?id=5MX117,0,0,
Euro Spex Opticians Ltd,OP_5MY_10353__000002_B81HU,OPT,158 Alum Rock Road,Saltley,,Birmingham,,B8 1HU,Tel: 0121 326 8181, - ,,,No ratings yet Rate it yourself - /Services/opticians/LeaveReview/DefaultView.aspx?id=OP_5MY_10353__000002_B81HU,0,0,
Onkar Eye Care Opticians,5MY33__000002_B81NH,OPT,151 Alum Rock Road,Saltley,,Birmingham,,B8 1NH,Tel: 0121 327 0620, - ,,,1 rating Rate it yourself - /Services/opticians/LeaveReview/DefaultView.aspx?id=5MY33__000002_B81NH,,,
S W Optics Ltd,5MY32__000003_B368TY,OPT,140 Bromford Drive,Bromford,Birmingham,,,B36 8TY,Tel: 0121 749 2660, - ,,,No ratings yet Rate it yourself - /Services/opticians/LeaveReview/DefaultView.aspx?id=5MY32__000003_B368TY,0,0,
Sodha Optometrists,5MY34__000001_B87ND,OPT,95 Alum Rock Road,Alum Rock,Birmingham,,,B8 1ND,Tel: 0121 326 0334, - ,,,No ratings yet Rate it yourself - /Services/opticians/LeaveReview/DefaultView.aspx?id=5MY34__000001_B87ND,0,0,
Pabari Opticians,00000055__000001_B475DX,OPT,Unit2 Drakes Cross Shopping Parade,,Wythall,Worcestershire,,B47 5HD,Tel: 01564 824482, - ,,,1 rating Rate it yourself - /Services/opticians/LeaveReview/DefaultView.aspx?id=00000055__000001_B475DX,,,
Michael Wolffe,5M140__000001_B138DH,OPT,22 Chantry Road,Moseley,Birmingham,Birmingham,,B13 8DH,Tel: 0121 449 1724, - ,,,No ratings yet Rate it yourself - /Services/opticians/LeaveReview/DefaultView.aspx?id=5M140__000001_B138DH,0,0,
Home Eye Clinic Ltd,OP_B81AE_46764,OPT,,"Unit 2, Urban House",,Birmingham,West Midlands,B8 1AE,Tel: 0800 6122145, - ,,,No ratings yet Rate it yourself - /Services/opticians/LeaveReview/DefaultView.aspx?id=OP_B81AE_46764,0,0,
Boots-Birmingham - Erdington Fort ,OP_5MY_6131__000002_B249QS,OPT,Unit 8 Fort Retail Park,20 Fort Parkway,Erdington,Birmingham,West Midlands,B24 9FP,Tel: 01213 826673, - ,,,No ratings yet Rate it yourself - /Services/opticians/LeaveReview/DefaultView.aspx?id=OP_5MY_6131__000002_B249QS,0,0,