Organisation Name,NACS Code,Organisation Type,Address1,Address2,Address3,Address4,Address5,PostCode,Telephone Number,Opening time,Value  (Opening time),Banding Classification  (Opening time),NHS.UK users rating,Value  (NHS.UK users rating),Banding Classification  (NHS.UK users rating),Car parking (Is there car parking at this organisation?)
Andrew Martin & Associates,5MW27__000001_B742UD,OPT,244 Lichfield Road,,Sutton Coldfield,West Midlands,,B74 2UD,Tel: 0121 308 1886, - ,,,No ratings yet Rate it yourself - /Services/opticians/LeaveReview/DefaultView.aspx?id=5MW27__000001_B742UD,0,0,
Boots Opticians,TP87W,OPT,,Unit 4 Mulberry Walk,,Sutton Coldfield,,B74 2UG,, - ,,,No ratings yet Rate it yourself - /Services/opticians/LeaveReview/DefaultView.aspx?id=TP87W,0,0,
Malcom Gray & Associates,5PG122,OPT,,336 Lichfield Road,,Sutton Coldfield,,B74 4BH,Tel: 0121 308 4255, - ,,,No ratings yet Rate it yourself - /Services/opticians/LeaveReview/DefaultView.aspx?id=5PG122,0,0,
Eye Centre Opticians,5MW24__000001_B757DX,OPT,,53c Reddicap Heath Road,,Sutton Coldfield,,B75 7DX,Tel: 0121 378 4724, - ,,,No ratings yet Rate it yourself - /Services/opticians/LeaveReview/DefaultView.aspx?id=5MW24__000001_B757DX,0,0,
Specsavers Opticians,OP_5MW_1958__000001_B721XX,OPT,"Unit 4, Red Rose Centre",57b Lower Parade,,Sutton Coldfield,West Midlands,B72 1XX,Tel: 0121 354 4143, - ,,,1 rating Rate it yourself - /Services/opticians/LeaveReview/DefaultView.aspx?id=OP_5MW_1958__000001_B721XX,,,
Boots Opticians Professional Services Ltd,OP_5MW_7022__000006_B721PD,OPT,44-46 The Parade,Gracechurch Shopping Centre,,Sutton Coldfield,,B72 1PD,Tel: 0121 354 9856, - ,,,No ratings yet Rate it yourself - /Services/opticians/LeaveReview/DefaultView.aspx?id=OP_5MW_7022__000006_B721PD,0,0,
Boots-Birmingham - Sutton Coldfield,OP_5MW_9692__000005_B721PD,OPT,24 The Parade,44-46 Gracechurch Shopping Centre,,Sutton Coldfield,West Midlands,B72 1PD,Tel: 0121 354 4177, - ,,,No ratings yet Rate it yourself - /Services/opticians/LeaveReview/DefaultView.aspx?id=OP_5MW_9692__000005_B721PD,0,0,
Vision Express,OP_5MW_6348__000001_B721PA,OPT,198 Gracechurch Centre,Sutton Coldfield,,West Midlands,,B72 1PA,Tel: 0121 321 3353, - ,,,No ratings yet Rate it yourself - /Services/opticians/LeaveReview/DefaultView.aspx?id=OP_5MW_6348__000001_B721PA,0,0,
Gurmail Singh Gangar,OP_5MW_8140__000001_B721QY,OPT,,2 South Parade,,Sutton Coldfield,,B72 1QY,Tel: 0121 354 3124, - ,,,No ratings yet Rate it yourself - /Services/opticians/LeaveReview/DefaultView.aspx?id=OP_5MW_8140__000001_B721QY,0,0,
Scrivens Ltd,OP_5MW_10794__000002_B721PU,OPT,115 Parade,,,Sutton Coldfield,West Midlands,B72 1PU,Tel: 0121 354 4534, - ,,,No ratings yet Rate it yourself - /Services/opticians/LeaveReview/DefaultView.aspx?id=OP_5MW_10794__000002_B721PU,0,0,
Neil Berry Optometrists,OP_5MW_2323__000001_B721RR,OPT,Neil Berry Optometrists,6 Holland Street,,Sutton Coldfield,West Midlands,B72 1RR,Tel: 0121 355 6895, - ,,,No ratings yet Rate it yourself - /Services/opticians/LeaveReview/DefaultView.aspx?id=OP_5MW_2323__000001_B721RR,0,0,
Andrew Martin Optometrist Ltd,5MW224__000003_B735TJ,OPT,66 Boldmere Road,Boldmere,Sutton Coldfield,West Midlands,,B73 5TJ,Tel: 0121 354 6411, - ,,,No ratings yet Rate it yourself - /Services/opticians/LeaveReview/DefaultView.aspx?id=5MW224__000003_B735TJ,0,0,yes
Charles Morris Optometrists,OP_5MW_8335__000001_B761QN,OPT,28 Walmley Road,Walmley,,Sutton Coldfield,,B76 1QN,Tel: 0121 351 2344, - ,,,No ratings yet Rate it yourself - /Services/opticians/LeaveReview/DefaultView.aspx?id=OP_5MW_8335__000001_B761QN,0,0,
Tesco Opticians ,5PG157,OPT,,11 Princess Alice Drive,,Sutton Coldfield,,B73 6RB,Tel: 0345 601 3479, - ,,,No ratings yet Rate it yourself - /Services/opticians/LeaveReview/DefaultView.aspx?id=5PG157,0,0,
Ward (Opthalmic Opticians) Ltd,OP_5MW_12170__000001_B735BA,OPT,85a Chester Road,Sutton Coldfield,West Midlands,,,B73 5BA,Tel: 0121 354 8168, - ,,,No ratings yet Rate it yourself - /Services/opticians/LeaveReview/DefaultView.aspx?id=OP_5MW_12170__000001_B735BA,0,0,
Lad & Turner Optical Practice,OP_5MW_8465__000001_B721YG,OPT,8 The Lanes shopping centre,340 Birmingham Road,Wylde Green,sutton coldfield,West Midlands,B72 1YG,Tel: 01213505872, - ,,,No ratings yet Rate it yourself - /Services/opticians/LeaveReview/DefaultView.aspx?id=OP_5MW_8465__000001_B721YG,0,0,
A B Optics Ltd,5PG123,OPT,,360 Birmingham Road,Wylde Green,Sutton Coldfield,,B72 1YH,Tel: 0121 384 5743, - ,,,4 ratings Rate it yourself - /Services/opticians/LeaveReview/DefaultView.aspx?id=5PG123,,,
Asda Opticians,5MW23__000002_B768XL,OPT,Walmley Ash Road,Minworth,,Sutton Coldfield,,B76 1XL,Tel: 0121 313 7157, - ,,,1 rating Rate it yourself - /Services/opticians/LeaveReview/DefaultView.aspx?id=5MW23__000002_B768XL,,,
Scrivens Ltd,5MX108__000004_B449HH,OPT,,635 Kingstanding Road,Kingstanding,Birmingham,West Midlands,B44 9SU,Tel: 0121 354 2100, - ,,,No ratings yet Rate it yourself - /Services/opticians/LeaveReview/DefaultView.aspx?id=5MX108__000004_B449HH,0,0,
Vernon Walker Opticians Ltd,5MX109__000005_B449HH,OPT,,unit 21,The Kingstanding Centre,Birmingham,,B44 9HH,Tel: 0121 354 2992, - ,,,No ratings yet Rate it yourself - /Services/opticians/LeaveReview/DefaultView.aspx?id=5MX109__000005_B449HH,0,0,
The Spectacle Company,5MX106__000002_B449ST,OPT,766 Kingstanding Road,Kingstanding,Birmingham,,,B44 9ST,Tel: 0121 355 5639, - ,,,3 ratings Rate it yourself - /Services/opticians/LeaveReview/DefaultView.aspx?id=5MX106__000002_B449ST,,,
Ward ( Ophthalmic Opticians) Ltd,OP_5MY_13858__000001_B236QU,OPT,202 Sutton New Road,Erdington,,Birmingham,,B23 6QU,Tel: 0121 373 6897, - ,,,No ratings yet Rate it yourself - /Services/opticians/LeaveReview/DefaultView.aspx?id=OP_5MY_13858__000001_B236QU,0,0,
C R Beeson,OP_5DQ_1360__000001_WS78XF,OPT,"Longlea, Lichfield Road",Hopwas,Tamworth,,,B78 3AG,Tel: 01827 56541, - ,,,No ratings yet Rate it yourself - /Services/opticians/LeaveReview/DefaultView.aspx?id=OP_5DQ_1360__000001_WS78XF,0,0,
Colin Beeson Optometrists,OP_5MP_2271__000001_B781HN,OPT,Village Vision,Lichfield Road,Hopwas,Tamworth,,B78 3AG,Tel: 01827 311517, - ,,,1 rating Rate it yourself - /Services/opticians/LeaveReview/DefaultView.aspx?id=OP_5MP_2271__000001_B781HN,,,
R J Owen Opticians,5MW29__000001_B440QU,OPT,10 Warren Farm Road,Kingstanding,Birmingham,,,B44 0QU,Tel: 0121 373 5790, - ,,,No ratings yet Rate it yourself - /Services/opticians/LeaveReview/DefaultView.aspx?id=5MW29__000001_B440QU,0,0,
Scrivens Ltd,OP_5MW_10748__000001_B448PL,OPT,231 Hawthorn Road,Kingstanding,,Birmingham,West Midlands,B44 8PL,Tel: 0121 373 1447, - ,,,No ratings yet Rate it yourself - /Services/opticians/LeaveReview/DefaultView.aspx?id=OP_5MW_10748__000001_B448PL,0,0,
Salisbury Jones Ltd,OP_5MW_9189__000001_B448QT,OPT,103 Hawthorn Road,Kingstanding,,Birmingham,,B44 8QT,Tel: 0121 373 2556, - ,,,No ratings yet Rate it yourself - /Services/opticians/LeaveReview/DefaultView.aspx?id=OP_5MW_9189__000001_B448QT,0,0,
Specsavers Opticians,OP_5MY_7640__000002_B236RS,OPT,138B High Street,Erdington,,Birmingham,,B23 6RS,Tel: 0121 382 1477, - ,,,No ratings yet Rate it yourself - /Services/opticians/LeaveReview/DefaultView.aspx?id=OP_5MY_7640__000002_B236RS,0,0,
Realeyes Opticians ,OP_5MY_9140__000001_B236TE,OPT,169 High Street,Erdington,,Birmingham,,B23 6SY,Tel: 0121 373 0368, - ,,,1 rating Rate it yourself - /Services/opticians/LeaveReview/DefaultView.aspx?id=OP_5MY_9140__000001_B236TE,,,yes
Direct Vision Opticians,TP8Y2,OPT,Direct Vision Opticians,122 Hillingford Avenue,Great Barr,Birmingham,West Midlands,B43 7JU,Tel: 0121 325 0665, - ,,,No ratings yet Rate it yourself - /Services/opticians/LeaveReview/DefaultView.aspx?id=TP8Y2,0,0,yes
Bainbridge Optometrists,OP_5MY_8779__000002_B236SN,OPT,240 High Street,Erdington,,Birmingham,,B23 6SN,Tel: 0121 377 7459, - ,,,No ratings yet Rate it yourself - /Services/opticians/LeaveReview/DefaultView.aspx?id=OP_5MY_8779__000002_B236SN,0,0,
Scrivens Ltd,OP_5MY_10763__000001_B236SN,OPT,246 High Street,Erdington,,Birmingham,West Midlands,B23 6SN,Tel: 0121 373 0680, - ,,,No ratings yet Rate it yourself - /Services/opticians/LeaveReview/DefaultView.aspx?id=OP_5MY_10763__000001_B236SN,0,0,
Neil Berry Opticians,OP_5MY_2324__000001_B249LY,OPT,556 Holly Lane,Erdington,,Birmingham,,B24 9LY,Tel: 0121 377 7393, - ,,,No ratings yet Rate it yourself - /Services/opticians/LeaveReview/DefaultView.aspx?id=OP_5MY_2324__000001_B249LY,0,0,
Portland Eye Care Ltd,OP_5M3_12436__000002_WS98LY,OPT,8 Croft Parade,Aldridge,Walsall,,,WS9 8LY,Tel: 01922 452279, - ,,,No ratings yet Rate it yourself - /Services/opticians/LeaveReview/DefaultView.aspx?id=OP_5M3_12436__000002_WS98LY,0,0,
P & J Hamer Opticians,OP_5M3_5790__000001_WS98NS,OPT,57 Portland Road,57 Portland Road,,Walsall,,WS9 8NS,Tel: 01922 455664, - ,,,1 rating Rate it yourself - /Services/opticians/LeaveReview/DefaultView.aspx?id=OP_5M3_5790__000001_WS98NS,,,
Colin Lee Opticians,OP_5M3_7850__000002_WS98QP,OPT,7-9 Anchor Parade,Aldridge,,Walsall,,WS9 8QP,Tel: 01922 454151, - ,,,2 ratings Rate it yourself - /Services/opticians/LeaveReview/DefaultView.aspx?id=OP_5M3_7850__000002_WS98QP,,,
Ados Sightcare Ltd,01-17616/5PK/C__000001_B448JG,OPT,1 Ridgewood Gardens,Great Barr,Birmingham,,,B44 8JG,Tel: 0121 384 2771, - ,,,No ratings yet Rate it yourself - /Services/opticians/LeaveReview/DefaultView.aspx?id=01-17616/5PK/C__000001_B448JG,0,0,
Scrivens Opticians & Hearing Care,OP_5M3_10824__000001_WS98PT,OPT,35 Anchor Road,45 Anchor Road,,Aldridge,,WS9 8PT,Tel: 01922 452305, - ,,,No ratings yet Rate it yourself - /Services/opticians/LeaveReview/DefaultView.aspx?id=OP_5M3_10824__000001_WS98PT,0,0,
Banks Opticians,OP_5MY_10216__000001_B237JG,OPT,511 Slade Road,Erdington,Birmingham,West Midlands,,B23 7JG,Tel: 0121 373 0435, - ,,,No ratings yet Rate it yourself - /Services/opticians/LeaveReview/DefaultView.aspx?id=OP_5MY_10216__000001_B237JG,0,0,
Matthew Spencer,5PG174,OPT,,11 Shipley Fields,Erdington,Birmingham,,B24 9BW,Tel: 0121 382 8183, - ,,,No ratings yet Rate it yourself - /Services/opticians/LeaveReview/DefaultView.aspx?id=5PG174,0,0,
Asda Opticians,7784/CO-2058__000002_B783HD,OPT,Ventura Road,Tamworth,,Staffordshire,,B78 3HD,Tel: 01827 302212, - ,,,No ratings yet Rate it yourself - /Services/opticians/LeaveReview/DefaultView.aspx?id=7784/CO-2058__000002_B783HD,0,0,
Boots-Tamworth - Ventura Park,OP_5DQ_7038__000001_B797LG,OPT,Ventura Retail Park,,,Tamworth,Staffordshire,B78 3JD,Tel: 01827 56241, - ,,,2 ratings Rate it yourself - /Services/opticians/LeaveReview/DefaultView.aspx?id=OP_5DQ_7038__000001_B797LG,,,
Specs Direct,5PG14__000001_B237RJ,OPT,184 Slade Road,Erdington,Birmingham,,,B23 7RJ,Tel: 0121 384 2828, - ,,,No ratings yet Rate it yourself - /Services/opticians/LeaveReview/DefaultView.aspx?id=5PG14__000001_B237RJ,0,0,
Boots-Birmingham - Erdington Fort ,OP_5MY_6131__000002_B249QS,OPT,Unit 8 Fort Retail Park,20 Fort Parkway,Erdington,Birmingham,West Midlands,B24 9FP,Tel: 01213 826673, - ,,,No ratings yet Rate it yourself - /Services/opticians/LeaveReview/DefaultView.aspx?id=OP_5MY_6131__000002_B249QS,0,0,
Vision Express (UK) Ltd,5PG15__000001_B249FP,OPT,Unit9a The Fort Shopping Park,Erdington,,Birmingham,,B24 9FP,Tel: 0121 384 3110, - ,,,1 rating Rate it yourself - /Services/opticians/LeaveReview/DefaultView.aspx?id=5PG15__000001_B249FP,,,
Zeidan Eye Care Centre,OP_5DQ_14956__000001_B787AB,OPT,1a Silver Street,Tamworth,Staffordshire,,,B79 7NH,Tel: 01827 54411, - ,,,No ratings yet Rate it yourself - /Services/opticians/LeaveReview/DefaultView.aspx?id=OP_5DQ_14956__000001_B787AB,0,0,
Philip Howard Opticans,OP_5DQ_879__000001_B797LR,OPT,23 Market Street,Tamworth,Staffordshire,,,B79 7LR,Tel: 01827 59863, - ,,,1 rating Rate it yourself - /Services/opticians/LeaveReview/DefaultView.aspx?id=OP_5DQ_879__000001_B797LR,,,
Portland Opticians,OP_5DQ_6416__000001_B797DE,OPT,1 Middle Entry,Tamworth,Staffordshire,Tamworth,,B79 7NJ,Tel: 01827 61600, - ,,,No ratings yet Rate it yourself - /Services/opticians/LeaveReview/DefaultView.aspx?id=OP_5DQ_6416__000001_B797DE,0,0,
"I M HADFIELD BSc, FCOptom, OPTOMETRISTS",5MX107__000002_B422HN,OPT,,162 Beecehes Road,Birmingham,Birmingham,,B42 2HN,Tel: 0121 357 1748, - ,,,1 rating Rate it yourself - /Services/opticians/LeaveReview/DefaultView.aspx?id=5MX107__000002_B422HN,,,
Specsavers Opticians,OP_5DQ_14954__000001_B783HD,OPT,Unit 19,The Ankerside Centre,George Street,Tamworth,,B79 7LG,Tel: 01827 60622, - ,,,No ratings yet Rate it yourself - /Services/opticians/LeaveReview/DefaultView.aspx?id=OP_5DQ_14954__000001_B783HD,0,0,
Vision Express,OP_5DQ_14955__000003_B797LG,OPT,45 Ankerside Shopping Centre,George Street,Tamworth,,,B79 7LG,Tel: 01827 316 300, - ,,,No ratings yet Rate it yourself - /Services/opticians/LeaveReview/DefaultView.aspx?id=OP_5DQ_14955__000003_B797LG,0,0,
Boots-Tamworth - Ankerside Centre,OP_5DQ_6619__000002_B797LG,OPT,9 Ankerside Shopping Centre,,,Tamworth,Staffordshire,B79 7LG,Tel: 01827 62923, - ,,,No ratings yet Rate it yourself - /Services/opticians/LeaveReview/DefaultView.aspx?id=OP_5DQ_6619__000002_B797LG,0,0,
S W Optics Ltd,5MY32__000003_B368TY,OPT,140 Bromford Drive,Bromford,Birmingham,,,B36 8TY,Tel: 0121 749 2660, - ,,,No ratings yet Rate it yourself - /Services/opticians/LeaveReview/DefaultView.aspx?id=5MY32__000003_B368TY,0,0,
Eye Society Corporation Ltd,7801A__000006_B797LQ,OPT,44 Ankerside Shopping Centre,George Street,Tamworth,Staffordshire,,B79 7LQ,Tel: 01827 52526, - ,,,1 rating Rate it yourself - /Services/opticians/LeaveReview/DefaultView.aspx?id=7801A__000006_B797LQ,,,
Jenks Opticians,OP_5DQ_14705__000001_B797LJ,OPT,31 George Street,Tamworth,Staffordshire,,,B79 7LJ,Tel: 01827 62792, - ,,,1 rating Rate it yourself - /Services/opticians/LeaveReview/DefaultView.aspx?id=OP_5DQ_14705__000001_B797LJ,,,
Park Hall Opticians,OP_RL170914_01-19420,OPT,Gillity Village Shops,15 Liskeard Road,Park Hall,Walsall,,WS5 3EY,Tel: 01922 614 205, - ,,,1 rating Rate it yourself - /Services/opticians/LeaveReview/DefaultView.aspx?id=OP_RL170914_01-19420,,,
Gurdeep Singh Dhinsa,5MX062,OPT,,24 Beacon Road,,Walsall,,WS5 3LF,Tel: 0121 357 3477, - ,,,No ratings yet Rate it yourself - /Services/opticians/LeaveReview/DefaultView.aspx?id=5MX062,0,0,
Costco,OPT_B75SA_1,OPT,,100 Watson Road,Nechells,Birmingham,,B7 5SA,Tel: 0121 326 3515, - ,,,1 rating Rate it yourself - /Services/opticians/LeaveReview/DefaultView.aspx?id=OPT_B75SA_1,,,
Eye Express,5MX016,OPT,909 Walsall Road,Great Barr,,Birmingham,,B42 1TN,Tel: 0121 357 6465, - ,,,No ratings yet Rate it yourself - /Services/opticians/LeaveReview/DefaultView.aspx?id=5MX016,0,0,
Colin Lee (Opticians) Ltd,OP_5MJ_9813__000002_B421TQ,OPT,Scott Arms Shopping Centre,964 Walsall Road,Great Barr,,,B42 1TQ,Tel: 0121 357 7890, - ,,,No ratings yet Rate it yourself - /Services/opticians/LeaveReview/DefaultView.aspx?id=OP_5MJ_9813__000002_B421TQ,0,0,
Syed Hassan Abbas Abdi,OP_5MX_01__000001_B66SP,OPT,,403 Witton Road,Aston,Birmingham,,B6 6SP,Tel: 0121 356 9390, - ,,,No ratings yet Rate it yourself - /Services/opticians/LeaveReview/DefaultView.aspx?id=OP_5MX_01__000001_B66SP,0,0,
Shah-Jallal Opticians,5MX113,OPT,,420 Witton Road,,Birmingham,,B6 6PP,, - ,,,No ratings yet Rate it yourself - /Services/opticians/LeaveReview/DefaultView.aspx?id=5MX113,0,0,
Cook Eyecare Ltd,COOKS__000001_B347HR,OPT,,6 Hurst Lane,Castle Bromwich,Birmingham,,B34 7HR,Tel: 0121 747 3847, - ,,,2 ratings Rate it yourself - /Services/opticians/LeaveReview/DefaultView.aspx?id=COOKS__000001_B347HR,,,
Eye Express,5MX090,OPT,,"Unit 32, One Stop Shopping Centre",Perry Barr,Birmingham,,B42 1AA,Tel: 0121 356 7115, - ,,,No ratings yet Rate it yourself - /Services/opticians/LeaveReview/DefaultView.aspx?id=5MX090,0,0,
Mahendra Mohanlal Davda ,OP_5MX_8215__000001_B66PD,OPT,,364 Witton Road,Aston,Birmingham,,B6 6PD,Tel: 0121 327 7792, - ,,,No ratings yet Rate it yourself - /Services/opticians/LeaveReview/DefaultView.aspx?id=OP_5MX_8215__000001_B66PD,0,0,
Eyes & Vision,5MX023,OPT,,280 Wellington,,Birmingham,,B20 2QL,, - ,,,No ratings yet Rate it yourself - /Services/opticians/LeaveReview/DefaultView.aspx?id=5MX023,0,0,
Colin Lee Opticians,5PG150,OPT,12 Fox & Goose Shopping Centre,Washwood Heath Road,Ward End,Birmingham,,B8 2EP,Tel: 0121 784 5888, - ,,,No ratings yet Rate it yourself - /Services/opticians/LeaveReview/DefaultView.aspx?id=5PG150,0,0,
Scrivens Ltd,OP_5MJ_5454__000001_B421NN,OPT,1-2 International House,Old Walsall Road,,Hamstead,West Midlands,B42 1NN,Tel: 0121 357 3182, - ,,,No ratings yet Rate it yourself - /Services/opticians/LeaveReview/DefaultView.aspx?id=OP_5MJ_5454__000001_B421NN,0,0,
Hamstead Eyecare,01-19254-201213,OPT,4 International House,Old Walsall Road,Great Barr,Birmingham,,B42 1NN,Tel: 0121 679 4493, - ,,,2 ratings Rate it yourself - /Services/opticians/LeaveReview/DefaultView.aspx?id=01-19254-201213,,,
Silver Court Opticians,OP_5M3_2035__000001_WS86ED,OPT,High Street,Brownhills,,Walsall,,WS8 6HA,Tel: 01543 372504, - ,,,No ratings yet Rate it yourself - /Services/opticians/LeaveReview/DefaultView.aspx?id=OP_5M3_2035__000001_WS86ED,0,0,
Vision Replublic Opticians,5PG129,OPT,,15 Ownall Road,Shard End,Birmingham,,B34 7AH,Tel: 0121 439 7979, - ,,,No ratings yet Rate it yourself - /Services/opticians/LeaveReview/DefaultView.aspx?id=5PG129,0,0,
Roots Opticians,5MX73__000002_B66HZ,OPT,168 Trinity Road,Aston,Birmingham,,,B6 6HZ,Tel: 0121 328 5700, - ,,,No ratings yet Rate it yourself - /Services/opticians/LeaveReview/DefaultView.aspx?id=5MX73__000002_B66HZ,0,0,
T. Cox Opticians,5MX079,OPT,T. Cox Opticians,565 Washwood Heath Road,Ward End,Birmingham,,B8 2HB,Tel: 0121 327 1814, - ,,,No ratings yet Rate it yourself - /Services/opticians/LeaveReview/DefaultView.aspx?id=5MX079,0,0,
Vision Express (UK) Ltd,OP_5DQ_4932__000001_WS136NN,OPT,"Unit 35, Bakers Lane",Three Spires Shopping Centre,12 Gresley Row,Lichfield,Staffordshire,WS13 6NN,Tel: 01543 417272, - ,,,No ratings yet Rate it yourself - /Services/opticians/LeaveReview/DefaultView.aspx?id=OP_5DQ_4932__000001_WS136NN,0,0,
Specs Direct (Ward End) Ltd,5PG156,OPT,,659 Washwood Heath Road,Washwood Heath,Birmingham,,B8 2HJ,Tel: 0121 328 2964, - ,,,4 ratings Rate it yourself - /Services/opticians/LeaveReview/DefaultView.aspx?id=5PG156,,,
Boots-Lichfield,OP_5DQ_332__000001_WS136NF,OPT,2 Bakers Lane,,,Lichfield,Staffordshire,WS13 6NF,Tel: 01543 252086, - ,,,No ratings yet Rate it yourself - /Services/opticians/LeaveReview/DefaultView.aspx?id=OP_5DQ_332__000001_WS136NF,0,0,
D G Arthur & Partner,OP_5DQ_14953__000001_WS136JX,OPT,9 Market Street,Lichfield,Staffordshire,,,WS13 6JX,Tel: 01543 251130, - ,,,No ratings yet Rate it yourself - /Services/opticians/LeaveReview/DefaultView.aspx?id=OP_5DQ_14953__000001_WS136JX,0,0,
Home Eye Clinic Ltd,C/3004__000005_B82LX,OPT,Ward End,,Birmingham,,,B8 2LX,Tel: 0121 3266624, - ,,,No ratings yet Rate it yourself - /Services/opticians/LeaveReview/DefaultView.aspx?id=C/3004__000005_B82LX,0,0,
Mikah Opticians,5MX096,OPT,,941 Alum Rock Road,Ward End,Birmingham,,B8 2LX,Tel: 0121 246 3777, - ,,,No ratings yet Rate it yourself - /Services/opticians/LeaveReview/DefaultView.aspx?id=5MX096,0,0,
Specsavers Opticians,OP_5DQ_357__000001_WS136LA,OPT,Specsavers Opticians,41-43 Market Street,,Lichfield,Staffordshire,WS13 6LA,Tel: 01543 417517, - ,,,No ratings yet Rate it yourself - /Services/opticians/LeaveReview/DefaultView.aspx?id=OP_5DQ_357__000001_WS136LA,0,0,
Colin Lee Opticians (Lichfield),OP_5DQ_14951__000002_WS136LA,OPT,33 Market Street,Lichfield,Staffordshire,,,WS13 6LA,Tel: 01543 254645, - ,,,No ratings yet Rate it yourself - /Services/opticians/LeaveReview/DefaultView.aspx?id=OP_5DQ_14951__000002_WS136LA,0,0,
Tesco Opticians (Lichfield),OPL/5900/5PK__000003_WS136DZ,OPT,,Church Street,Lichfield,Staffordshire,,WS13 6DZ,Tel: 0845 601 3479, - ,,,No ratings yet Rate it yourself - /Services/opticians/LeaveReview/DefaultView.aspx?id=OPL/5900/5PK__000003_WS136DZ,0,0,
Frames 4 U,OP_5M3_12441__000001_WS86HH,OPT,50 High Street,Brownhills,,Walsall,,WS8 6EL,Tel: 01543 373731, - ,,,1 rating Rate it yourself - /Services/opticians/LeaveReview/DefaultView.aspx?id=OP_5M3_12441__000001_WS86HH,,,
Boots-Brownhills,OP_5M3_6340__000001_WS86EL,OPT,42 High Street,Brownhills,,Walsall,West Midlands,WS8 6EL,Tel: 01543 372 696, - ,,,No ratings yet Rate it yourself - /Services/opticians/LeaveReview/DefaultView.aspx?id=OP_5M3_6340__000001_WS86EL,0,0,
MW Phillips Opticians,TP95F,OPT,MW Phillips Opticians,29 Ellerbeck,,"Stoneydelph, Tamworth",Staffordshire,B77 4JA,Tel: 01827 896464, - ,,,No ratings yet Rate it yourself - /Services/opticians/LeaveReview/DefaultView.aspx?id=TP95F,0,0,yes
MW Phillips Opticians,TP95F,OPT,,30 Ellerbeck,Wilnecote,"Stonydelph, Tamworth",Staffordshire,B77 4JA,Tel: 01827 795 161, - ,,,No ratings yet Rate it yourself - /Services/opticians/LeaveReview/DefaultView.aspx?id=TP95F,0,0,
Specsavers Opticians,OP_WS86EQ_29574,OPT,,"Unit 1, 12 - 28 High Street",,Brownhills,,WS8 6EQ,Tel: 01543 363790, - ,,,No ratings yet Rate it yourself - /Services/opticians/LeaveReview/DefaultView.aspx?id=OP_WS86EQ_29574,0,0,
Ian Michael Hadfield,OP_5D1_13860__000001_B376BB,OPT,,37 The Parade,Kingshurst,Birmingham,,B37 6BB,Tel: 0121 770 3226, - ,,,No ratings yet Rate it yourself - /Services/opticians/LeaveReview/DefaultView.aspx?id=OP_5D1_13860__000001_B376BB,0,0,
NVision Eyecare,01-21451,OPT,,205 Birchfield Road,,Birmingham,,B19 1LL,Tel: 0121 554 5786, - ,,,No ratings yet Rate it yourself - /Services/opticians/LeaveReview/DefaultView.aspx?id=01-21451,0,0,
Cox Opticians,5MX106,OPT,,20 Victoria Road,Aston,Birmingham,,B6 5HA,Tel: 0121 507 0812, - ,,,No ratings yet Rate it yourself - /Services/opticians/LeaveReview/DefaultView.aspx?id=5MX106,0,0,
Eyeworld Opticians,5PG155,OPT,,678 Alum Rock Road,Pelham,Birmingham,,B8 3NU,Tel: 0121 328 4328, - ,,,No ratings yet Rate it yourself - /Services/opticians/LeaveReview/DefaultView.aspx?id=5PG155,0,0,
Euro Spex Opticians Ltd,OP_5MY_10353__000002_B81HU,OPT,158 Alum Rock Road,Saltley,,Birmingham,,B8 1HU,Tel: 0121 326 8181, - ,,,No ratings yet Rate it yourself - /Services/opticians/LeaveReview/DefaultView.aspx?id=OP_5MY_10353__000002_B81HU,0,0,
Sodha Optometrists,5MY34__000001_B87ND,OPT,95 Alum Rock Road,Alum Rock,Birmingham,,,B8 1ND,Tel: 0121 326 0334, - ,,,No ratings yet Rate it yourself - /Services/opticians/LeaveReview/DefaultView.aspx?id=5MY34__000001_B87ND,0,0,
Onkar Eye Care Opticians,5MY33__000002_B81NH,OPT,151 Alum Rock Road,Saltley,,Birmingham,,B8 1NH,Tel: 0121 327 0620, - ,,,1 rating Rate it yourself - /Services/opticians/LeaveReview/DefaultView.aspx?id=5MY33__000002_B81NH,,,
The I Clinic,OP_B83BH_30203,OPT,,227 Alum Rock Road,Alum Rock,Birmingham,,B8 3BH,Tel: 0121 326 9008, - ,,,No ratings yet Rate it yourself - /Services/opticians/LeaveReview/DefaultView.aspx?id=OP_B83BH_30203,0,0,
Jonathan Walker & Associates,OP_5M3_12439__000001_WS13AA,OPT,74 Lysways Street,,,Walsall,,WS1 3AB,Tel: 01922 643988, - ,,,No ratings yet Rate it yourself - /Services/opticians/LeaveReview/DefaultView.aspx?id=OP_5M3_12439__000001_WS13AA,0,0,
Focus Eye Clinic,5MX109,OPT,,65 Rupert Street,Nechells,Birmingham,,B7 5DT,Tel: 0121 359 2666, - ,,,No ratings yet Rate it yourself - /Services/opticians/LeaveReview/DefaultView.aspx?id=5MX109,0,0,
Gallery Opticians,5MX66__000002_B192TJ,OPT,52e Lozels Road,Lozells,Birmingham,,,B19 2TJ,Tel: 0121 554 2563, - ,,,7 ratings Rate it yourself - /Services/opticians/LeaveReview/DefaultView.aspx?id=5MX66__000002_B192TJ,,,
Scrivens Ltd,OP_5MY_5456__000002_B339SB,OPT,300 Kitts Green Road,Lea Hall,,Birmingham,West Midlands,B33 9SB,Tel: 0121 783 3159, - ,,,No ratings yet Rate it yourself - /Services/opticians/LeaveReview/DefaultView.aspx?id=OP_5MY_5456__000002_B339SB,0,0,