Organisation Name,NACS Code,Organisation Type,Address1,Address2,Address3,Address4,Address5,PostCode,Telephone Number,Opening time,Value  (Opening time),Banding Classification  (Opening time),NHS.UK users rating,Value  (NHS.UK users rating),Banding Classification  (NHS.UK users rating),Car parking (Is there car parking at this organisation?)
Spex4U Limited,OL5PL01__000005_B459JA,OPT,174 New Road,Rubery,,Birmingham,Worcestershire,B45 9JA,Tel: 0121 453 7179, - ,,,1 rating Rate it yourself - /Services/opticians/LeaveReview/DefaultView.aspx?id=OL5PL01__000005_B459JA,,,
Williams Optometrists,OP_5MR_9056__000002_B459JW,OPT,161 New Road,Rubery,Birmingham,,,B45 9JW,Tel: 0121 453 2581, - ,,,No ratings yet Rate it yourself - /Services/opticians/LeaveReview/DefaultView.aspx?id=OP_5MR_9056__000002_B459JW,0,0,
Troth Opticians,00000051__000003_B459JR,OPT,135 New Road,Rubery,Birmingham,,,B45 9JR,Tel: 0121 453 2146, - ,,,No ratings yet Rate it yourself - /Services/opticians/LeaveReview/DefaultView.aspx?id=00000051__000003_B459JR,0,0,
Barnt Green Opticians,OP_5MR_7851__000001_B458NF,OPT,12 Hewell Road,Barnt Green,,Birmingham,,B45 8NE,Tel: 0121 445 6015, - ,,,No ratings yet Rate it yourself - /Services/opticians/LeaveReview/DefaultView.aspx?id=OP_5MR_7851__000001_B458NF,0,0,
Pabari Opticians Ltd,OP_5M1_4727__000002_B313JW,OPT,3 Alvechurch Road,West Heath,Birmingham,,,B31 3JW,Tel: 0121 477 5252, - ,,,No ratings yet Rate it yourself - /Services/opticians/LeaveReview/DefaultView.aspx?id=OP_5M1_4727__000002_B313JW,0,0,
Specs Direct,5M147__000002_B312PA,OPT,871 Bristol Road South,Northfield,Birmingham,,,B31 2PA,Tel: 0121 477 7474, - ,,,No ratings yet Rate it yourself - /Services/opticians/LeaveReview/DefaultView.aspx?id=5M147__000002_B312PA,0,0,
Boots-Northfield,5M1089,OPT,816 Bristol Road South,,Northfield,Birmingham,,B31 2NS,Tel: 0121 475 1072, - ,,,No ratings yet Rate it yourself - /Services/opticians/LeaveReview/DefaultView.aspx?id=5M1089,0,0,
Eyewise ,OP_5M1_2922__000002_B312JU,OPT,892 Bristol Road South,Northfield,Birmingham,,,B31 2NS,Tel: 0121 477 6550, - ,,,No ratings yet Rate it yourself - /Services/opticians/LeaveReview/DefaultView.aspx?id=OP_5M1_2922__000002_B312JU,0,0,
Virdi & Pepall Ltd,5M1105,OPT,,826 Bristol Road South,Northfield,Birmingham,,B31 2NS,Tel: 0121 475 4342, - ,,,5 ratings Rate it yourself - /Services/opticians/LeaveReview/DefaultView.aspx?id=5M1105,,,
Specsavers Opticians,OP_5M1_8153__000002_B312NN,OPT,,"Unit 3, 780-792 Bristol Road South",Northfield,Birmingham,,B31 2NN,Tel: 0121 476 4717, - ,,,No ratings yet Rate it yourself - /Services/opticians/LeaveReview/DefaultView.aspx?id=OP_5M1_8153__000002_B312NN,0,0,
Scrivens Ltd,OP_5M1_6295__000001_B312NG,OPT,731 Bristol Road South,Northfield,,Birmingham,West Midlands,B31 2NG,Tel: 0121 475 1152, - ,,,No ratings yet Rate it yourself - /Services/opticians/LeaveReview/DefaultView.aspx?id=OP_5M1_6295__000001_B312NG,0,0,
J & D Mason Opticians ,OP_5PL_9067__000003_B487LA,OPT,23 The Square,"23 The Square,",Birmingham,Alvechurch,,B48 7LA,Tel: 0121 447 8682, - ,,,1 rating Rate it yourself - /Services/opticians/LeaveReview/DefaultView.aspx?id=OP_5PL_9067__000003_B487LA,,,
Myoptics Eye Clinic,I2T1M,OPT,,14 Curdale Road,Bartley Green,Birmingham,West Midlands,B32 4HB,Tel: 01214754920, - ,,,2 ratings Rate it yourself - /Services/opticians/LeaveReview/DefaultView.aspx?id=I2T1M,,,
J & D Mason Opticians,5M143__000001_B380SD,OPT,,2 The Green,Kings Norton,Birmingham,,B38 8SD,Tel: 0121 451 3485, - ,,,5 ratings Rate it yourself - /Services/opticians/LeaveReview/DefaultView.aspx?id=5M143__000001_B380SD,,,
Eyecare Opticians Parkside,B61 0AZ,OPT,BHI Parkside Medical Centre,Stourbridge Road,,Bromsgrove,,B61 0AZ,Tel: 01527 888599, - ,,,No ratings yet Rate it yourself - /Services/opticians/LeaveReview/DefaultView.aspx?id=B61 0AZ,0,0,
Chapman Opticians,OP_5MR_8077__000002_B618AQ,OPT,103 High Street,,Bromsgrove,,,B61 8AE,Tel: 01527 836290, - ,,,1 rating Rate it yourself - /Services/opticians/LeaveReview/DefaultView.aspx?id=OP_5MR_8077__000002_B618AQ,,,
Specsavers Opticians,OP_5MR_12187__000001_B618DD,OPT,131 High Street,Bromsgrove,Worcestershire,,,B61 8AE,Tel: 01527 579 815, - ,,,2 ratings Rate it yourself - /Services/opticians/LeaveReview/DefaultView.aspx?id=OP_5MR_12187__000001_B618DD,,,
Scrivens Ltd,OP_5M1_7540__000001_B303EG,OPT,37 Pershore Road South,Cotteridge,,Birmingham,West Midlands,B30 3EG,Tel: 0121 458 3335, - ,,,No ratings yet Rate it yourself - /Services/opticians/LeaveReview/DefaultView.aspx?id=OP_5M1_7540__000001_B303EG,0,0,
Eyecare Mobile Opticians Ltd,5QW049,OPT,,16 Watford Road,Cotteridge,Birmingham,,B30 1JA,Tel: 0800 633 5092, - ,,,No ratings yet Rate it yourself - /Services/opticians/LeaveReview/DefaultView.aspx?id=5QW049,0,0,
Boots-Bromsgrove,OP_5MR_276__000002_B618EX,OPT,64 High Street,Bromsgrove,,Worcestershire,Worcestershire,B61 8EX,Tel: 01527 872 583, - ,,,No ratings yet Rate it yourself - /Services/opticians/LeaveReview/DefaultView.aspx?id=OP_5MR_276__000002_B618EX,0,0,
Eyeworld Optometrists,5MX053,OPT,,1863 Pershore Road,Cotteridge,Birmingham,,B30 3DJ,Tel: 0121 458 1359, - ,,,No ratings yet Rate it yourself - /Services/opticians/LeaveReview/DefaultView.aspx?id=5MX053,0,0,
Hamptons Optical Ltd.,00000052__000001_B618DJ,OPT,Crown House,11 Crown Close,Bromsgrove,Worcestershire,,B61 8DJ,, - ,,,No ratings yet Rate it yourself - /Services/opticians/LeaveReview/DefaultView.aspx?id=00000052__000001_B618DJ,0,0,
Knights Ophthalmic Opticians,5M154__000001_B295QL,OPT,130 Castle Square,Weoley Castle,Birmingham,,,B29 5QL,Tel: 0121 411 1555, - ,,,1 rating Rate it yourself - /Services/opticians/LeaveReview/DefaultView.aspx?id=5M154__000001_B295QL,,,
Scrivens Ltd,OP_5M1_10750__000001_B295QG,OPT,167 Weoley Castle Road,Weoley Castle,,Birmingham,West Midlands,B29 5QH,Tel: 0121 427 1021, - ,,,No ratings yet Rate it yourself - /Services/opticians/LeaveReview/DefaultView.aspx?id=OP_5M1_10750__000001_B295QG,0,0,
Asda Opticians,OPT_B29 5UP,OPT,,BARNSHILL,"51, BARNES HILL",BIRMINGHAM,,B29 5UP,Tel: 0121 296 0659, - ,,,No ratings yet Rate it yourself - /Services/opticians/LeaveReview/DefaultView.aspx?id=OPT_B29 5UP,0,0,
Ashtree Eyecare Centre,5M1106,OPT,,1547 Pershore Road,Stirchley,Birmingham,,B30 2JH,Tel: 0121 458 4595, - ,,,No ratings yet Rate it yourself - /Services/opticians/LeaveReview/DefaultView.aspx?id=5M1106,0,0,
Maginnis Opticians (Optometrists) Ltd,OP_5M1_7062__000003_B302JR,OPT,1379 Pershore Road,Stirchley,Birmingham,,,B30 2JR,Tel: 0121 458 2920, - ,,,No ratings yet Rate it yourself - /Services/opticians/LeaveReview/DefaultView.aspx?id=OP_5M1_7062__000003_B302JR,0,0,
Eye Society Opticians,OP_5HT_3430__000002_B633AW,OPT,,4 Peckingham Street,,Halesowen,West Midlands,B63 3AW,Tel: 0121 585 5347, - ,,,1 rating Rate it yourself - /Services/opticians/LeaveReview/DefaultView.aspx?id=OP_5HT_3430__000002_B633AW,,,
Boots-Halesowen,OP_5HT_690__000001_B633AS,OPT,2 Hagley Street,Halesowen,,West Midlands,,B63 3AS,Tel: 0121 550 1610, - ,,,2 ratings Rate it yourself - /Services/opticians/LeaveReview/DefaultView.aspx?id=OP_5HT_690__000001_B633AS,,,
Pabari Opticians,5M1068,OPT,,84 Raddlebarn Road,,Birmingham,,B29 6HH,, - ,,,No ratings yet Rate it yourself - /Services/opticians/LeaveReview/DefaultView.aspx?id=5M1068,0,0,
Scrivens Ltd,OP_5HT_5770__000001_B634AL,OPT,5 Hagley Mall,The Cornbow Centre,,Halesowen,,B63 4AL,Tel: 0121 501 1010, - ,,,No ratings yet Rate it yourself - /Services/opticians/LeaveReview/DefaultView.aspx?id=OP_5HT_5770__000001_B634AL,0,0,
Chapman & Myers Opticians,OP_5HT_437__000001_B634AB,OPT,14 Hagley Mall,The Cornbow Centre,,Halesowen,,B63 4AL,Tel: 0121 585 7065, - ,,,1 rating Rate it yourself - /Services/opticians/LeaveReview/DefaultView.aspx?id=OP_5HT_437__000001_B634AB,,,
Specsavers ,OP_5HT_14938__000002_B634AL,OPT,36 Hagley Mall,The Cornbow Centre,Halesowen,,,B63 4AL,Tel: 0121 504 4940, - ,,,No ratings yet Rate it yourself - /Services/opticians/LeaveReview/DefaultView.aspx?id=OP_5HT_14938__000002_B634AL,0,0,
Cox Opticians,5M1096,OPT,,57 Raddlebarn Road,Selly Oak,Birmingham,,B29 6HQ,Tel: 0121 472 7888, - ,,,No ratings yet Rate it yourself - /Services/opticians/LeaveReview/DefaultView.aspx?id=5M1096,0,0,
The Eye Collective Selly Oak,S6Z1Q,OPT,,14 Selly Oak Shopping Park,Aston Webb,Birmingham,,B29 6SQ,Tel: 0121 472 0211, - ,,,No ratings yet Rate it yourself - /Services/opticians/LeaveReview/DefaultView.aspx?id=S6Z1Q,0,0,
Pabari Opticians,00000055__000001_B475DX,OPT,Unit2 Drakes Cross Shopping Parade,,Wythall,Worcestershire,,B47 5HD,Tel: 01564 824482, - ,,,1 rating Rate it yourself - /Services/opticians/LeaveReview/DefaultView.aspx?id=00000055__000001_B475DX,,,
Penzer Opticians,OP_5M1_5811__000001_B145HG,OPT,1024 Alcester Road South,Maypole,Nr Kings Heath,Birmingham,,B14 5NG,Tel: 0121 430 5538, - ,,,1 rating Rate it yourself - /Services/opticians/LeaveReview/DefaultView.aspx?id=OP_5M1_5811__000001_B145HG,,,yes
Vision Replublic,5M1098,OPT,,1003 Alcester Road South,Maypole,Birmingham,,B14 5JA,Tel: 0121 430 6572, - ,,,No ratings yet Rate it yourself - /Services/opticians/LeaveReview/DefaultView.aspx?id=5M1098,0,0,
Vincent Roberts Optometrist,OP_5M1_3786__000001_B146EB,OPT,267 Alcester Road South,Kings Heath,Birmingham,,,B14 6EB,Tel: 0121 441 2843, - ,,,4 ratings Rate it yourself - /Services/opticians/LeaveReview/DefaultView.aspx?id=OP_5M1_3786__000001_B146EB,,,
Specsavers - Redditch Alvechurch,M2Y9H,OPT,,"Sainsburys, Abbey Trading Centre,Alvechurch Highway",,Redditch,,B97 6RF,Tel: 01527 913585, - ,,,No ratings yet Rate it yourself - /Services/opticians/LeaveReview/DefaultView.aspx?id=M2Y9H,0,0,
C Cacoullis,OP_5HT_10204__000001_B629BB,OPT,68 Halesowen Road,Halesowen,West Midlands,,,B62 9BB,Tel: 0121 422 3356, - ,,,No ratings yet Rate it yourself - /Services/opticians/LeaveReview/DefaultView.aspx?id=OP_5HT_10204__000001_B629BB,0,0,
Dalvinder Singh Sidhu,5PG164,OPT,,29 Halesowen Road,Halesowen,West Midlands,,B62 9AB,Tel: 0121 454 6569, - ,,,No ratings yet Rate it yourself - /Services/opticians/LeaveReview/DefaultView.aspx?id=5PG164,0,0,
Scrivens Ltd,OP_5MG_5453__000001_B680DJ,OPT,496 Hagley Road West,Quinton,Oldbury,Smethwick,West Midlands,B68 0DJ,Tel: 0121 422 3007, - ,,,No ratings yet Rate it yourself - /Services/opticians/LeaveReview/DefaultView.aspx?id=OP_5MG_5453__000001_B680DJ,0,0,
Hagley Eyecare Studio,201220160917,OPT,,Unit 42 The Old Woodyard,,Hagley,,DY9 9LQ,, - ,,,2 ratings Rate it yourself - /Services/opticians/LeaveReview/DefaultView.aspx?id=201220160917,,,
Low Vision Centre,5PG173,OPT,,62 Woodville Road,Harborne,Birmingham,,B17 9AT,Tel: 0121 478 5252, - ,,,No ratings yet Rate it yourself - /Services/opticians/LeaveReview/DefaultView.aspx?id=5PG173,0,0,
Bainbridge Opticians,5M1032,OPT,,174 High Street,Harborne,Birmingham,,B17 9PP,Tel: 0121 427 8201, - ,,,No ratings yet Rate it yourself - /Services/opticians/LeaveReview/DefaultView.aspx?id=5M1032,0,0,
Looks Opticians Ltd,OP_5M1_6928__000001_B179PN,OPT,154 High Street,Harborne,Birmingham,,,B17 9PN,Tel: 0121 427 3535, - ,,,No ratings yet Rate it yourself - /Services/opticians/LeaveReview/DefaultView.aspx?id=OP_5M1_6928__000001_B179PN,0,0,
Harborne VE LTD ,5M155__000001_B179NP,OPT,,144 High Street,Harborne,Birmingham,West Midlands,B17 9NP,Tel: 0121 428 4835, - ,,,2 ratings Rate it yourself - /Services/opticians/LeaveReview/DefaultView.aspx?id=5M155__000001_B179NP,,,
Specsavers,5M1108,OPT,,136 High Street,Harborne,Birmingham,,B17 9NN,Tel: 0121 426 0810, - ,,,No ratings yet Rate it yourself - /Services/opticians/LeaveReview/DefaultView.aspx?id=5M1108,0,0,
Peter Bainbridge Opticians,OP_5MR_341__000003_B974EY,OPT,18 Kingfisher Walk,Redditch,Worcestershire,,,B97 4EY,Tel: 01527 64691, - ,,,2 ratings Rate it yourself - /Services/opticians/LeaveReview/DefaultView.aspx?id=OP_5MR_341__000003_B974EY,,,
Boots-Redditch,OP_5MR_9389__000002_B974EY,OPT,7 Kingfisher Walk,,,Redditch,Worcestershire,B97 4EY,Tel: 01527 63068, - ,,,No ratings yet Rate it yourself - /Services/opticians/LeaveReview/DefaultView.aspx?id=OP_5MR_9389__000002_B974EY,0,0,yes
Boots-Kings Heath - Alcester Rd Sth,OP_5M1_3509__000001_B147JQ,OPT,51A Alcester Rd South,,Kings Heath,Birmingham,West Midlands,B14 7JQ,Tel: 0121 444 2376, - ,,,1 rating Rate it yourself - /Services/opticians/LeaveReview/DefaultView.aspx?id=OP_5M1_3509__000001_B147JQ,,,
Specsavers Opticians,OP_5MR_655__000001_B974YP,OPT,13 New Walk,Kingfisher Centre,Redditch,Worcestershire,,B97 4YP,Tel: 01527 595558, - ,,,No ratings yet Rate it yourself - /Services/opticians/LeaveReview/DefaultView.aspx?id=OP_5MR_655__000001_B974YP,0,0,
S W Optics Ltd,5M1148__000002_B152TT,OPT,"University Of Birmingham, University Centre",Edgbaston,Birmingham,,,B15 2TT,Tel: 0121 414 2714, - ,,,4 ratings Rate it yourself - /Services/opticians/LeaveReview/DefaultView.aspx?id=5M1148__000002_B152TT,,,
Peter Bainbridge Optometrists,OP_5M1_10531__000001_B179PP,OPT,93 High Street,Harborne,,Birmingham,West Midlands,B17 9NR,Tel: 0121 427 8201, - ,,,3 ratings Rate it yourself - /Services/opticians/LeaveReview/DefaultView.aspx?id=OP_5M1_10531__000001_B179PP,,,
Brittain Opticians Ltd,5MX080,OPT,,97 High Street,Harborne,Birmingham,,B17 9NR,Tel: 0121 427 1007, - ,,,No ratings yet Rate it yourself - /Services/opticians/LeaveReview/DefaultView.aspx?id=5MX080,0,0,
Vision Express (UK) Ltd,OP_5MR_9135__000001_B974HA,OPT,7 New Walk,Kingfisher Centre,Redditch,Worcestershire,,B97 4HA,Tel: 01527 69633, - ,,,No ratings yet Rate it yourself - /Services/opticians/LeaveReview/DefaultView.aspx?id=OP_5MR_9135__000001_B974HA,0,0,
Specsavers Opticians,OP_5M1_5794__000001_B147LG,OPT,,132 High Street,Kings Heath,Birmingham,,B14 7LG,Tel: 0121 441 1322, - ,,,No ratings yet Rate it yourself - /Services/opticians/LeaveReview/DefaultView.aspx?id=OP_5M1_5794__000001_B147LG,0,0,
Scrivens Ltd,OP_5M1_5464__000002_B147LG,OPT,124 High Street,Kings Heath,,Birmingham,West Midlands,B14 7LG,Tel: 0121 444 2656, - ,,,No ratings yet Rate it yourself - /Services/opticians/LeaveReview/DefaultView.aspx?id=OP_5M1_5464__000002_B147LG,0,0,
Portland Eyecare Services Ltd,5M152__000002_B147EG,OPT,,1 Institute Road,Birmingham,Birmingham,,B14 7EG,Tel: 0121 444 4838, - ,,,No ratings yet Rate it yourself - /Services/opticians/LeaveReview/DefaultView.aspx?id=5M152__000002_B147EG,0,0,
Lakis Stelios Stylianou,5M1011,OPT,,22 School Road,,Birmingham,,B14 4BJ,Tel: 0121 474 3359, - ,,,No ratings yet Rate it yourself - /Services/opticians/LeaveReview/DefaultView.aspx?id=5M1011,0,0,
Asda Opticians,OPT_B98 7ER,OPT,,JINNAH ROAD,SMALLWOOD,REDDITCH,,B98 7ER,Tel: 01527 509344, - ,,,No ratings yet Rate it yourself - /Services/opticians/LeaveReview/DefaultView.aspx?id=OPT_B98 7ER,0,0,
Robinson & Sproson,OP_5DR_12006__000001_DY90NW,OPT,143 - 145 Worcester Road,Hagley,West Midlands,Hagley,,DY9 0NW,Tel: 01562 882444, - ,,,No ratings yet Rate it yourself - /Services/opticians/LeaveReview/DefaultView.aspx?id=OP_5DR_12006__000001_DY90NW,0,0,
Ocean Optical,OP_5MG_10351__000001_B664BL,OPT,641 Bearwood Road,,Smethwick,BEARWOOD,,B66 4BL,Tel: 0121 429 3711, - ,,,1 rating Rate it yourself - /Services/opticians/LeaveReview/DefaultView.aspx?id=OP_5MG_10351__000001_B664BL,,,
The Vision Centre,OP_5MG_6643__000001_B664BT,OPT,546 Bearwood Road,,Smethwick,,,B66 4BT,Tel: 0121 420 1705, - ,,,No ratings yet Rate it yourself - /Services/opticians/LeaveReview/DefaultView.aspx?id=OP_5MG_6643__000001_B664BT,0,0,
Eyecare Mobile Opticians Ltd,5MX066,OPT,,546 Bearwood Road,Smethwick,Birmingham,,B66 4BT,Tel: 0121 429 7752, - ,,,No ratings yet Rate it yourself - /Services/opticians/LeaveReview/DefaultView.aspx?id=5MX066,0,0,
Eyes & Vision,OP_5MH_13683__000001_B650HP,OPT,1 Market Place,High Street,Rowley Regis,,,B65 0HP,Tel: 0121 559 5552, - ,,,No ratings yet Rate it yourself - /Services/opticians/LeaveReview/DefaultView.aspx?id=OP_5MH_13683__000001_B650HP,0,0,
Scrivens Ltd,OP_5MG_7977__000002_B664BH,OPT,Bearwood Shopping Centre,575 Bearwood Road,,Smethwick,West Midlands,B66 4BH,Tel: 0121 420 1089, - ,,,No ratings yet Rate it yourself - /Services/opticians/LeaveReview/DefaultView.aspx?id=OP_5MG_7977__000002_B664BH,0,0,
Eyeland,OP_5MH_13682__000001_B650DT,OPT,4 High Street,,Rowley Regis,,,B65 0DT,Tel: 0121 559 1054, - ,,,No ratings yet Rate it yourself - /Services/opticians/LeaveReview/DefaultView.aspx?id=OP_5MH_13682__000001_B650DT,0,0,
Rileys Opticians,OP_5MH_959__000002_B650DR,OPT,38-39 High Street,,,Rowley Regis,,B65 0DR,Tel: 0121 559 1314, - ,,,No ratings yet Rate it yourself - /Services/opticians/LeaveReview/DefaultView.aspx?id=OP_5MH_959__000002_B650DR,0,0,
JK Opticians,OP_5MG_8449__000001_B650JN,OPT,8 Oldbury Road,,Rowley Regis,Birmingham,,B65 0JN,Tel: 0121 559 6041, - ,,,No ratings yet Rate it yourself - /Services/opticians/LeaveReview/DefaultView.aspx?id=OP_5MG_8449__000001_B650JN,0,0,
Michael Wolffe,5M140__000001_B138DH,OPT,22 Chantry Road,Moseley,Birmingham,Birmingham,,B13 8DH,Tel: 0121 449 1724, - ,,,No ratings yet Rate it yourself - /Services/opticians/LeaveReview/DefaultView.aspx?id=5M140__000001_B138DH,0,0,
Bainbridge Optometrists,5MX049,OPT,,502 Bearwood Road,Smethwick,Birmingham,,B66 4BX,Tel: 0121 429 6006, - ,,,No ratings yet Rate it yourself - /Services/opticians/LeaveReview/DefaultView.aspx?id=5MX049,0,0,
Pabari Opticians Ltd,OP_5M1_4726__000001_B138JG,OPT,14 St. Marys Row,Moseley,Birmingham,,,B13 8JG,Tel: 0121 449 0845, - ,,,No ratings yet Rate it yourself - /Services/opticians/LeaveReview/DefaultView.aspx?id=OP_5M1_4726__000001_B138JG,0,0,
Onkar Eye Society,5M1003,OPT,,5 St Mary's Row,Moseley,Birmingham,,B13 8HW,Tel: 0121 249 2071, - ,,,No ratings yet Rate it yourself - /Services/opticians/LeaveReview/DefaultView.aspx?id=5M1003,0,0,
Boots-Birmingham - Hagley Rd,5M1099,OPT,,235-237 Hagley Road,Edgbaston,Birmingham,West Midlands,B16 9RR,Tel: 0121 454 3355, - ,,,2 ratings Rate it yourself - /Services/opticians/LeaveReview/DefaultView.aspx?id=5M1099,,,
Peter Ian McLauchlan,5M151__000003_B169HN,OPT,17 Portland Road,Edgbaston,Birmingham,,,B16 9HN,Tel: 0121 454 6307, - ,,,No ratings yet Rate it yourself - /Services/opticians/LeaveReview/DefaultView.aspx?id=5M151__000003_B169HN,0,0,
Robert Hill Opticians,OP_5HT_8972__000001_DY98LB,OPT,39 High Street,Lye,,Stourbridge,West Midlands,DY9 8LF,Tel: 01384 422270, - ,,,3 ratings Rate it yourself - /Services/opticians/LeaveReview/DefaultView.aspx?id=OP_5HT_8972__000001_DY98LB,,,
Sanjeev Singh Sanghera,5MX083,OPT,,39 High Street,Lye,Stourbridge,,DY9 8LF,Tel: 01384 422270, - ,,,No ratings yet Rate it yourself - /Services/opticians/LeaveReview/DefaultView.aspx?id=5MX083,0,0,
Eye Society,OP_5MH_10164__000002_B645HH,OPT,33 High Street,,Cradley Heath,,,B64 5HL,Tel: 01384 633336, - ,,,No ratings yet Rate it yourself - /Services/opticians/LeaveReview/DefaultView.aspx?id=OP_5MH_10164__000002_B645HH,0,0,
RJ Eye Centre,5MX129,OPT,,204 Edward Road,Balsall Heath,Birmingham,,B12 9LY,Tel: 0121 448 0677, - ,,,No ratings yet Rate it yourself - /Services/opticians/LeaveReview/DefaultView.aspx?id=5MX129,0,0,
Arnold Opticians,OP_5MH_10243__000001_B645HG,OPT,17-18 High Street,,Cradley Heath,,,B64 5HG,Tel: 01384 561969, - ,,,No ratings yet Rate it yourself - /Services/opticians/LeaveReview/DefaultView.aspx?id=OP_5MH_10243__000001_B645HG,0,0,
R Meredith,OP_5MH_7811__000001_B645HP,OPT,6 High Street,,Cradley Heath,,,B64 5HP,Tel: 01384 566 770, - ,,,No ratings yet Rate it yourself - /Services/opticians/LeaveReview/DefaultView.aspx?id=OP_5MH_7811__000001_B645HP,0,0,
D Wright,OP_5MH_3944__000001_B646HU,OPT,178 Halesowen Road,,Cradley Heath,,,B64 6HU,Tel: 01384 568622, - ,,,No ratings yet Rate it yourself - /Services/opticians/LeaveReview/DefaultView.aspx?id=OP_5MH_3944__000001_B646HU,0,0,
Dickens Eye Clinic,DICKENS__000001_B901UB,OPT,39 Main Street,Dickens Heath,Solihull,West Midlands,,B90 1UB,Tel: 0121 744 5544, - ,,,2 ratings Rate it yourself - /Services/opticians/LeaveReview/DefaultView.aspx?id=DICKENS__000001_B901UB,,,
Waddam Opticians Ltd,OP_5M1_12038__000002_B280XB,OPT,278 Baldwins Lane,Hall Green,Birmingham,,,B28 0XB,Tel: 0121 745 3663, - ,,,No ratings yet Rate it yourself - /Services/opticians/LeaveReview/DefaultView.aspx?id=OP_5M1_12038__000002_B280XB,0,0,
Home Eyecare,5MX063,OPT,,"Unit 8, 17 Winyates Centre",,Redditch,,B98 0NR,Tel: 01527 529010, - ,,,No ratings yet Rate it yourself - /Services/opticians/LeaveReview/DefaultView.aspx?id=5MX063,0,0,
Winyates Opticians,0000050__000004_B980NR,OPT,17 Winyates Shopping Centre,Winyates,Redditch,Worcestershire,,B98 0NR,Tel: 01527 529010, - ,,,No ratings yet Rate it yourself - /Services/opticians/LeaveReview/DefaultView.aspx?id=0000050__000004_B980NR,0,0,
Eye Sight Centre Opticians,5PG165,OPT,,385 Ladypool Road,Balsall Heath,Birmingham,,B12 8LA,Tel: 0121 449 4530, - ,,,No ratings yet Rate it yourself - /Services/opticians/LeaveReview/DefaultView.aspx?id=5PG165,0,0,
Specs at Home (Midlands) Ltd,5MX105__000001_B280PH,OPT,249 Wake Green Rd,Moseley,Birmingham,B13 9XH,West Midlands,B13 9XH,Tel: 0121 769 2672, - ,,,No ratings yet Rate it yourself - /Services/opticians/LeaveReview/DefaultView.aspx?id=5MX105__000001_B280PH,0,0,
Shifa Eye Clinic,5MX117,OPT,,512-514 Moseley Road,Balsall Heath,Birmingham,,B12 9AH,Tel: 0121 440 6065, - ,,,No ratings yet Rate it yourself - /Services/opticians/LeaveReview/DefaultView.aspx?id=5MX117,0,0,
Eye Opticians Ltd,5MX63__000004_B151LD,OPT,,44 Islington Row,Edgbaston,Birmingham,,B15 1LD,Tel: 0121 456 5676, - ,,,No ratings yet Rate it yourself - /Services/opticians/LeaveReview/DefaultView.aspx?id=5MX63__000004_B151LD,0,0,
Julian Hill Opticians,OP_5HT_4772__000002_DY81QU,OPT,108 Hagley Road,Oldswinford,Stourbridge,,,DY8 1QU,Tel: 01384 374 232, - ,,,1 rating Rate it yourself - /Services/opticians/LeaveReview/DefaultView.aspx?id=OP_5HT_4772__000002_DY81QU,,,
Mohammed Dilwar Khan,5MX65__000001_B128AR,OPT,,259 Stoney Lane,Balsall Heath,Birmingham,,B12 8AR,Tel: 0121 449 2111, - ,,,No ratings yet Rate it yourself - /Services/opticians/LeaveReview/DefaultView.aspx?id=5MX65__000001_B128AR,0,0,
Eyecon Opticians,TP830,OPT,,190b Stoney Lane,Ballsall Health,Birmingham,West Midlands,B12 8AN,Tel: 0121 449 2111, - ,,,No ratings yet Rate it yourself - /Services/opticians/LeaveReview/DefaultView.aspx?id=TP830,0,0,
Spectrum Opticians,OP_5MG_2442__000001_B664JW,OPT,14 Waterloo Road,,Smethwick,,,B66 4JW,Tel: 0121 565 4505, - ,,,No ratings yet Rate it yourself - /Services/opticians/LeaveReview/DefaultView.aspx?id=OP_5MG_2442__000001_B664JW,0,0,
Peter E Waite (Optometrist),5MX71__000003_B120YR,OPT,,8 Horton Square,Highgate,Birmingham,,B12 0YR,Tel: 0121 440 1636, - ,,,No ratings yet Rate it yourself - /Services/opticians/LeaveReview/DefaultView.aspx?id=5MX71__000003_B120YR,0,0,
Cape Opticians,OP_5MG_10220__000001_B664SG,OPT,79 Cape Hill,,Smethwick,,,B66 4SG,Tel: 0121 558 0148, - ,,,No ratings yet Rate it yourself - /Services/opticians/LeaveReview/DefaultView.aspx?id=OP_5MG_10220__000001_B664SG,0,0,
Eyecare Opticians,5112 ,OPT,,"Bank Buildings, Langley High Street",,"Langley, Oldbury",,B69 4SN,Tel: 0121 552 4698, - ,,,No ratings yet Rate it yourself - /Services/opticians/LeaveReview/DefaultView.aspx?id=5112,0,0,
Optical Clinic,B114DA_0001__000002_B114DA,OPT,837 Stratford Road,Sparkhill,Birmingham,West Midlands,,B11 4DA,Tel: 0121 777 2111, - ,,,No ratings yet Rate it yourself - /Services/opticians/LeaveReview/DefaultView.aspx?id=B114DA_0001__000002_B114DA,0,0,
Opticare Ophthalmic Opticians,5MX70__000001_B128JS,OPT,150a Ladypool Road,Sparkbrook,Birmingham,,,B12 8JS,Tel: 0121 771 3222, - ,,,1 rating Rate it yourself - /Services/opticians/LeaveReview/DefaultView.aspx?id=5MX70__000001_B128JS,,,
Maxton Saunders Ltd,5PG175,OPT,,842 Stratford Road,Sparkhill,Birmingham,,B11 4BS,Tel: 0121 777 4081, - ,,,1 rating Rate it yourself - /Services/opticians/LeaveReview/DefaultView.aspx?id=5PG175,,,