Organisation Name,NACS Code,Organisation Type,Address1,Address2,Address3,Address4,Address5,PostCode,Telephone Number,Opening time,Value  (Opening time),Banding Classification  (Opening time),NHS.UK users rating,Value  (NHS.UK users rating),Banding Classification  (NHS.UK users rating),Car parking (Is there car parking at this organisation?)
Helmsley Opticians,OP_5KK_2458__000001_YO625B,OPT,10/12 Bondgate,10/12 Bondgate,Helmsley,York,North Yorkshire,YO62 5BR,Tel: 01439 770929, - ,,,No ratings yet Rate it yourself - /Services/opticians/LeaveReview/DefaultView.aspx?id=OP_5KK_2458__000001_YO625B,0,0,
K Malyn Opticians,01-12658,OPT,,91 Long Street,,"Easingwold, York",North Yorkshire,YO61 3HY,Tel: 01347 824131, - ,,,No ratings yet Rate it yourself - /Services/opticians/LeaveReview/DefaultView.aspx?id=01-12658,0,0,
Page Opticians,OP_5E2_8050__000001_YO613JA,OPT,134 Long Street,Easingwold,York,,,YO61 3JA,Tel: 01347 822172, - ,,,No ratings yet Rate it yourself - /Services/opticians/LeaveReview/DefaultView.aspx?id=OP_5E2_8050__000001_YO613JA,0,0,
Row Opticians,OP_5KH_8808__000001_YO71AA,OPT,4 Millgate,,Thirsk,,,YO7 1AA,Tel: 01845 523093, - ,,,No ratings yet Rate it yourself - /Services/opticians/LeaveReview/DefaultView.aspx?id=OP_5KH_8808__000001_YO71AA,0,0,
E G E Hall Opticians,OP_5KH_8543__000002_YO71HQ,OPT,13 Market Place,,,Thirsk,,YO7 1HQ,Tel: 01845 525996, - ,,,No ratings yet Rate it yourself - /Services/opticians/LeaveReview/DefaultView.aspx?id=OP_5KH_8543__000002_YO71HQ,0,0,
Cooper & Barr Opticians,TP8RH,OPT,,21 Market Place,,Thirsk,,YO7 1HD,Tel: 01845 202007, - ,,,No ratings yet Rate it yourself - /Services/opticians/LeaveReview/DefaultView.aspx?id=TP8RH,0,0,
Haxby Opticians,OP_5E2_5121__000001_YO323SA,OPT,,6 Ryedale Court,York,Haxby,,YO32 3SA,Tel: 01904 761216, - ,,,No ratings yet Rate it yourself - /Services/opticians/LeaveReview/DefaultView.aspx?id=OP_5E2_5121__000001_YO323SA,0,0,
Robinsons Opticians,OP_5KK_3255__000001_YO177JE,OPT,9 Newbiggin,,Malton,,,YO17 7JE,Tel: 01653 692283, - ,,,3 ratings Rate it yourself - /Services/opticians/LeaveReview/DefaultView.aspx?id=OP_5KK_3255__000001_YO177JE,,,
Scrivens Ltd,OP_5KK_5473__000002_YO177LX,OPT,40 Market Place,,,Malton,Yorkshire,YO17 7LY,Tel: 01653 692052, - ,,,No ratings yet Rate it yourself - /Services/opticians/LeaveReview/DefaultView.aspx?id=OP_5KK_5473__000002_YO177LX,0,0,
Glen Opticians,CO-3860,OPT,,21 Wheelgate,,Malton,North Yorkshire,YO17 7HT,Tel: 01653 600058, - ,,,No ratings yet Rate it yourself - /Services/opticians/LeaveReview/DefaultView.aspx?id=CO-3860,0,0,
Specsavers Opticians,OP_5KK_12540__000001_YO177DT,OPT,Specsavers,10 Castlegate,,Malton,,YO17 7DT,Tel: 01653 692784, - ,,,No ratings yet Rate it yourself - /Services/opticians/LeaveReview/DefaultView.aspx?id=OP_5KK_12540__000001_YO177DT,0,0,
The Vale Opticians,OP_5KJ_12411__000002_YO519AW,OPT,22 High Street,,York,Boroughbridge,,YO51 9AW,Tel: 01423 323450, - ,,,No ratings yet Rate it yourself - /Services/opticians/LeaveReview/DefaultView.aspx?id=OP_5KJ_12411__000002_YO519AW,0,0,
Robinson Opticians Ltd,OP_5KK_1041__000002_YO187DP,OPT,14 Eastgate Square,,Pickering,,,YO18 7DP,Tel: 01751 472737, - ,,,No ratings yet Rate it yourself - /Services/opticians/LeaveReview/DefaultView.aspx?id=OP_5KK_1041__000002_YO187DP,0,0,
Boots-York - Clifton Moor,YO30 4XZ_18270,OPT,,7-8 Stirling Road,,Clifton Moor Centre,Yorkshire,YO30 4XZ,Tel: 01904 690337, - ,,,No ratings yet Rate it yourself - /Services/opticians/LeaveReview/DefaultView.aspx?id=YO30 4XZ_18270,0,0,
Groves Opticians ,OP_5E2_14410__000002_YO304RZ,OPT,Tower Court Health Centre,Oakdale Road,Clifton Moor,,,YO30 4RZ,Tel: 01904 479555, - ,,,No ratings yet Rate it yourself - /Services/opticians/LeaveReview/DefaultView.aspx?id=OP_5E2_14410__000002_YO304RZ,0,0,
Asda Opticians,OPT_YO32 9LF,OPT,,JOCKEY LANE,MONKS CROSS,YORK,,YO32 9LF,Tel: 01904 689412, - ,,,No ratings yet Rate it yourself - /Services/opticians/LeaveReview/DefaultView.aspx?id=OPT_YO32 9LF,0,0,
Alexander Optometrists,01-122315,OPT,,145-146 High Street,,Northallerton,,DL7 8PE,Tel: 01609 760606, - ,,,No ratings yet Rate it yourself - /Services/opticians/LeaveReview/DefaultView.aspx?id=01-122315,0,0,
McBride Opticians,OP_5KH_14774__000001_DL78SE,OPT,4 South Parade,Northallerton,North Yorkshire,,,DL7 8SE,Tel: 01609 772989, - ,,,No ratings yet Rate it yourself - /Services/opticians/LeaveReview/DefaultView.aspx?id=OP_5KH_14774__000001_DL78SE,0,0,
Boots-Northallerton - High St,OP_5E2_14406__000002_DL78PP,OPT,84 High Street,,North Yorkshire,Northallerton,,DL7 8PP,Tel: 01609 772150, - ,,,No ratings yet Rate it yourself - /Services/opticians/LeaveReview/DefaultView.aspx?id=OP_5E2_14406__000002_DL78PP,0,0,
Spectacle Warehouse,OP_5KH_11785__000001_DL78PP,OPT,108 High Street,,Northallerton,,,DL7 8PP,Tel: 01609 777225, - ,,,No ratings yet Rate it yourself - /Services/opticians/LeaveReview/DefaultView.aspx?id=OP_5KH_11785__000001_DL78PP,0,0,
Boots-Northallerton - High St (in Boots UK),OP_5KH_1596__000002_DL78LW,OPT,203-204 High Street,,,Northallerton,North Yorkshire,DL7 8LW,Tel: 01609 777461, - ,,,No ratings yet Rate it yourself - /Services/opticians/LeaveReview/DefaultView.aspx?id=OP_5KH_1596__000002_DL78LW,0,0,
Boots-York - Parliament St,OP_5E2_11397__000001_YO18RS,OPT,22 Parliament Street,,York,North Yorkshire,,YO1 8RS,Tel: 01904 638827, - ,,,1 rating Rate it yourself - /Services/opticians/LeaveReview/DefaultView.aspx?id=OP_5E2_11397__000001_YO18RS,,,
Optical Express,OP_5E2_13079__000001_YO19NJ,OPT,16 Parliament Street,,,York,North Yorkshire,YO1 8SG,Tel: 0800 023 2020, - ,,,No ratings yet Rate it yourself - /Services/opticians/LeaveReview/DefaultView.aspx?id=OP_5E2_13079__000001_YO19NJ,0,0,
Vision Value Opticians,OP_5E2_4282__000001_YO18SG,OPT,21 Parliament Street,,York,,,YO1 8SG,Tel: 01904 637763, - ,,,No ratings yet Rate it yourself - /Services/opticians/LeaveReview/DefaultView.aspx?id=OP_5E2_4282__000001_YO18SG,0,0,
Boots-York - Coney St,OP_5E2_11218__000002_YO19NH,OPT,43 Coney Street,,York,York,Yorkshire,YO1 9QL,Tel: 01904 642617, - ,,,No ratings yet Rate it yourself - /Services/opticians/LeaveReview/DefaultView.aspx?id=OP_5E2_11218__000002_YO19NH,0,0,
Viewpoint,OP_5E2_14411__000001_YO18BA,OPT,,9 Feasegate,,York,,YO1 8SH,Tel: 01904 667000, - ,,,1 rating Rate it yourself - /Services/opticians/LeaveReview/DefaultView.aspx?id=OP_5E2_14411__000001_YO18BA,,,
Vision Express (UK) Ltd,OP_5E2_10037__000001_YO18SE,OPT,8-10 Parliament Street,,York,,,YO1 8SE,Tel: 01904 541104, - ,,,No ratings yet Rate it yourself - /Services/opticians/LeaveReview/DefaultView.aspx?id=OP_5E2_10037__000001_YO18SE,0,0,
Specsavers Opticians,OP_5E2_7514__000001_YO19QX,OPT,15 Low Ousegate,,York,,,YO1 9QX,Tel: 01904 655611, - ,,,No ratings yet Rate it yourself - /Services/opticians/LeaveReview/DefaultView.aspx?id=OP_5E2_7514__000001_YO19QX,0,0,
Binnington & Thurling Opticians,OP_5E2_10869__000001_YO16JH,OPT,17 Micklegate,,York,,,YO1 6JH,Tel: 01904 653297, - ,,,No ratings yet Rate it yourself - /Services/opticians/LeaveReview/DefaultView.aspx?id=OP_5E2_10869__000001_YO16JH,0,0,
VisionCare Optometry with Ruth Perrott,OP_5E2_3755__000002_YO244LZ,OPT,30 York Road,Acomb,,York,,YO24 4LZ,Tel: 01904 784040, - ,,,1 rating Rate it yourself - /Services/opticians/LeaveReview/DefaultView.aspx?id=OP_5E2_3755__000002_YO244LZ,,,
David Dowley Eyecare Opticians,OP_5E2_13997__000002_YO243BL,OPT,50 York Road,Acomb`,,York,North Yorkshire,YO24 4LZ,Tel: 01904 788811, - ,,,1 rating Rate it yourself - /Services/opticians/LeaveReview/DefaultView.aspx?id=OP_5E2_13997__000002_YO243BL,,,
Rayner Opticians,OP_5E2_10720__000003_YO244LZ,OPT,,50a York Road,Acomb,York,Yorkshire,YO24 4LZ,Tel: 01904 785233, - ,,,No ratings yet Rate it yourself - /Services/opticians/LeaveReview/DefaultView.aspx?id=OP_5E2_10720__000003_YO244LZ,0,0,
Coverdales Opticians,OP_5E2_7362__000001_YO19TY,OPT,53 Walmgate,,York,,,YO1 9TY,Tel: 01904 631793, - ,,,No ratings yet Rate it yourself - /Services/opticians/LeaveReview/DefaultView.aspx?id=OP_5E2_7362__000001_YO19TY,0,0,
Rae & Rae Opticians,OP_5E2_6184__000001_YO231NA,OPT,33 Bishopthorpe Road,,York,York,,YO23 1NA,Tel: 01904 611553, - ,,,2 ratings Rate it yourself - /Services/opticians/LeaveReview/DefaultView.aspx?id=OP_5E2_6184__000001_YO231NA,,,
Peacock & Row Opticians,OP_5KJ_1160__000001_HG41AG,OPT,,2 Moss Arcade,Ripon,Ripon,,HG4 1AG,Tel: 01765 603484, - ,,,No ratings yet Rate it yourself - /Services/opticians/LeaveReview/DefaultView.aspx?id=OP_5KJ_1160__000001_HG41AG,0,0,
Scrivens,OP_5KJ_9181__000001_HG41BP,OPT,"Unit 1, 8 The Arcade",Market Place,,Ripon,Yorkshire(North Riding),HG4 1BP,Tel: 01765 602820, - ,,,No ratings yet Rate it yourself - /Services/opticians/LeaveReview/DefaultView.aspx?id=OP_5KJ_9181__000001_HG41BP,0,0,
Specsavers,OP_5KJ_2638__000001_HG41DY,OPT,,28-29 Market Place West,Ripon,North Yorkshire,,HG4 1BN,Tel: 01765 694777, - ,,,1 rating Rate it yourself - /Services/opticians/LeaveReview/DefaultView.aspx?id=OP_5KJ_2638__000001_HG41DY,,,
Cowen & Morgan,OP_5KJ_11943__000001_HG42BQ,OPT,22 Westgate,,Ripon,,,HG4 2BQ,Tel: 01765 600561, - ,,,No ratings yet Rate it yourself - /Services/opticians/LeaveReview/DefaultView.aspx?id=OP_5KJ_11943__000001_HG42BQ,0,0,
Tesco Opticians,OPT_YO241LW_6,OPT,Askham Bar,Tadcaster Rd,,York,,YO24 1LW,Tel: 0345 601 3479, - ,,,No ratings yet Rate it yourself - /Services/opticians/LeaveReview/DefaultView.aspx?id=OPT_YO241LW_6,0,0,
Tesco Opticians,OPT_YO241LW_4,OPT,,"Askham Bar, Tadcaster Rd",,York,,YO24 1LW,, - ,,,No ratings yet Rate it yourself - /Services/opticians/LeaveReview/DefaultView.aspx?id=OPT_YO241LW_4,0,0,
Cooper & Barr Opticians,OP_5KH_2940__000001_TS95AD,OPT,,35 High Street,Stokesley,Middlesbrough,,TS9 5AD,Tel: 01642 710832, - ,,,No ratings yet Rate it yourself - /Services/opticians/LeaveReview/DefaultView.aspx?id=OP_5KH_2940__000001_TS95AD,0,0,yes
KINGSTON WHITE OPTICIANS,OP-12353-5NV__000001_HG50ER,OPT,2 Park  Place,,Knaresborough,,,HG5 0ER,, - ,,,No ratings yet Rate it yourself - /Services/opticians/LeaveReview/DefaultView.aspx?id=OP-12353-5NV__000001_HG50ER,0,0,
Darryl Taylor Opticians,OP_5KJ_9963__000001_HG50EA,OPT,84 High Street,,Knaresborough,,,HG5 0EA,Tel: 01423 862142, - ,,,No ratings yet Rate it yourself - /Services/opticians/LeaveReview/DefaultView.aspx?id=OP_5KJ_9963__000001_HG50EA,0,0,
Samantha Parker Optometrist,OP_5KJ_12955__000002_HG50ET,OPT,13 Market Place,,Knaresborough,,,HG5 8AL,Tel: 01423 866475, - ,,,No ratings yet Rate it yourself - /Services/opticians/LeaveReview/DefaultView.aspx?id=OP_5KJ_12955__000002_HG50ET,0,0,
P S Rutter,OP_5KH_3577__000001_DL82BJ,OPT,7 Southend,,,Bedale,Yorkshire(North Riding),DL8 2BJ,Tel: 01677 424142, - ,,,1 rating Rate it yourself - /Services/opticians/LeaveReview/DefaultView.aspx?id=OP_5KH_3577__000001_DL82BJ,,,
Christopher Nixon Optometrists,OP_5KJ_4191__000001_HG27LQ,OPT,Kinnersley House,35 High Street,"Starbeck, Harrogate",,,HG2 7LQ,Tel: 01423 885764, - ,,,No ratings yet Rate it yourself - /Services/opticians/LeaveReview/DefaultView.aspx?id=OP_5KJ_4191__000001_HG27LQ,0,0,
Specsavers Opticians,OP_5J6_4803__000002_LS226FL,OPT,The Horsefair Centre,,,Wetherby,,LS22 6FL,Tel: 01937 545 370, - ,,,No ratings yet Rate it yourself - /Services/opticians/LeaveReview/DefaultView.aspx?id=OP_5J6_4803__000002_LS226FL,0,0,
Cameron Beaumont Opticians,CO-5155,OPT,,2-4 North Street,,Wetherby,Yorkshire,LS22 6NN,Tel: 01937 585742, - ,,,No ratings yet Rate it yourself - /Services/opticians/LeaveReview/DefaultView.aspx?id=CO-5155,0,0,
Appleson Optometrists,OP_5HJ_14027__000001_LS226LN,OPT,Appleson Optometrists / Wetherby Eye Clinic,43 Market Place,Wetherby,Leeds,,LS22 6LN,Tel: 01937 583278, - ,,,171 ratings Rate it yourself - /Services/opticians/LeaveReview/DefaultView.aspx?id=OP_5HJ_14027__000001_LS226LN,,,
Mackenzie Shaw Ltd,OP_5HJ_4077__000001_LS224LL,OPT,14 Westgate,,Wetherby,,,LS22 6LL,Tel: 01937 583185, - ,,,1 rating Rate it yourself - /Services/opticians/LeaveReview/DefaultView.aspx?id=OP_5HJ_4077__000001_LS224LL,,,
Vision Express (UK) Ltd,OP_5HJ_6604__000001_LS224NE,OPT,,25A Market Place,,Wetherby,West Yorkshire,LS22 6LQ,Tel: 01937 581142, - ,,,No ratings yet Rate it yourself - /Services/opticians/LeaveReview/DefaultView.aspx?id=OP_5HJ_6604__000001_LS224NE,0,0,
Boots-Wetherby,LDS194__000004_LS226LQ,OPT,25B Market Place,,,Wetherby,West Yorkshire,LS22 6LQ,Tel: 01937 588635, - ,,,1 rating Rate it yourself - /Services/opticians/LeaveReview/DefaultView.aspx?id=LDS194__000004_LS226LQ,,,
Eyecatchers,OP_5KJ_5664__000001_HG14LF,OPT,87a Skipton Road,,Harrogate,,,HG1 4LF,Tel: 01423 568083, - ,,,3 ratings Rate it yourself - /Services/opticians/LeaveReview/DefaultView.aspx?id=OP_5KJ_5664__000001_HG14LF,,,yes
Asda Opticians,OPT_HG1 5DE,OPT,,BOWER ROAD,,HARROGATE,,HG1 5DE,Tel: 01423 704 512, - ,,,1 rating Rate it yourself - /Services/opticians/LeaveReview/DefaultView.aspx?id=OPT_HG1 5DE,,,
Specsavers Opticians Harrogate,TP6N1,OPT,18 Beulah Street,18 BEULAH STREET,Harrogate,Harrogate,,HG1 1QH,Tel: 01423 564515, - ,,,4 ratings Rate it yourself - /Services/opticians/LeaveReview/DefaultView.aspx?id=TP6N1,,,
Andrew Morgan Optometrist,OP_5HJ_14030__000002_LS236BW,OPT,170 High Street,Boston Spa,Leeds,,,LS23 6BW,Tel: 01937 849933, - ,,,2 ratings Rate it yourself - /Services/opticians/LeaveReview/DefaultView.aspx?id=OP_5HJ_14030__000002_LS236BW,,,
Boots-Harrogate - Cambridge St (in Boots UK),HG1 1RX_19172,OPT,,26 - 28 Cambridge Street,,Harrogate,,HG1 1RX,Tel: 01423 530 335, - ,,,1 rating Rate it yourself - /Services/opticians/LeaveReview/DefaultView.aspx?id=HG1 1RX_19172,,,
M&S Opticians,,OPT,M&S,18-20 Cambridge Street,,Harrogate,,HG1 1RX,Tel: 01423 802696, - ,,,N/A - Data not available,,,
Catherine Veen Opticians,OP_5KJ_8782__000001_HG11EB,OPT,6 Victoria Avenue,,,Harrogate,,HG1 1ED,Tel: 01423 520888, - ,,,1 rating Rate it yourself - /Services/opticians/LeaveReview/DefaultView.aspx?id=OP_5KJ_8782__000001_HG11EB,,,
Vision Express (UK) Ltd,OP_5KJ_10948__000002_HG11RH,OPT,5-5a Prospect Crescent,,Harrogate,,,HG1 1RH,Tel: 01423 523477, - ,,,No ratings yet Rate it yourself - /Services/opticians/LeaveReview/DefaultView.aspx?id=OP_5KJ_10948__000002_HG11RH,0,0,
Moorhouse Opticians Ltd,OP_5E2_2897__000001_LS249JB,OPT,13 Westgate,,Tadcaster,,,LS24 9JB,Tel: 01937 832257, - ,,,No ratings yet Rate it yourself - /Services/opticians/LeaveReview/DefaultView.aspx?id=OP_5E2_2897__000001_LS249JB,0,0,
M Procter,OP_5KJ_12429__000001_HG12QU,OPT,3 Parliament Street,,Harrogate,Harrogate,,HG1 2QU,Tel: 01423 531700, - ,,,No ratings yet Rate it yourself - /Services/opticians/LeaveReview/DefaultView.aspx?id=OP_5KJ_12429__000001_HG12QU,0,0,
Page & Smith Opticians,OP_5KJ_3115__000001_HG12TG,OPT,,4 Royal Parade,Harrogate,Harrogate,Yorkshire(North Riding),HG1 2SZ,Tel: 01423 562 616, - ,,,No ratings yet Rate it yourself - /Services/opticians/LeaveReview/DefaultView.aspx?id=OP_5KJ_3115__000001_HG12TG,0,0,
Scrivens Opticians,OP_5E4_10770__000001_YO422DG,OPT,4 George Street,,Pocklington,E Yorkshire,,YO42 2DG,Tel: 01759 303150, - ,,,No ratings yet Rate it yourself - /Services/opticians/LeaveReview/DefaultView.aspx?id=OP_5E4_10770__000001_YO422DG,0,0,
Specsavers ,OP_5KM__000004_TS80TJ,OPT,Unit 9 Parkway Shopping Centre,Coulby Newham,Middlesbrough,,,TS8 0TJ,Tel: 01642 579 010, - ,,,No ratings yet Rate it yourself - /Services/opticians/LeaveReview/DefaultView.aspx?id=OP_5KM__000004_TS80TJ,0,0,
Specsavers,TP730,OPT,,17-21 Market Place,,Pocklington,,YO42 2AS,, - ,,,No ratings yet Rate it yourself - /Services/opticians/LeaveReview/DefaultView.aspx?id=TP730,0,0,
Stokeld & Stephens Opticians,OP_5KM_2580__000002_TS78DX,OPT,42 Stokesley Road,Marton-In-Cleveland,Middlesbrough,,,TS7 8DX,Tel: 01642 322386, - ,,,No ratings yet Rate it yourself - /Services/opticians/LeaveReview/DefaultView.aspx?id=OP_5KM_2580__000002_TS78DX,0,0,
Wade Optometry Ltd,OP_5KN_3759__000002_TS146AF,OPT,85 Westgate,.,Guisborough,.,,TS14 6AF,Tel: 01287 639257, - ,,,No ratings yet Rate it yourself - /Services/opticians/LeaveReview/DefaultView.aspx?id=OP_5KN_3759__000002_TS146AF,0,0,
Specsavers Opticians,OP_5KN_13810__000001_TS146AF,OPT,Unit 3,71 Westgate,Guisborough,,,TS14 6AF,Tel: 01287 610383, - ,,,No ratings yet Rate it yourself - /Services/opticians/LeaveReview/DefaultView.aspx?id=OP_5KN_13810__000001_TS146AF,0,0,
S H Reily Opticians,OP_5KN_13812__000001_TS146QD,OPT,5 Chaloner Street,,,Guisborough,,TS14 6QD,Tel: 01287 632740, - ,,,No ratings yet Rate it yourself - /Services/opticians/LeaveReview/DefaultView.aspx?id=OP_5KN_13812__000001_TS146QD,0,0,
Wade Optometry Ltd,OP_5E1_8665__000001_TS159BW,OPT,35 High Street,.,Yarm,.,,TS15 9BW,Tel: 01642 790990, - ,,,No ratings yet Rate it yourself - /Services/opticians/LeaveReview/DefaultView.aspx?id=OP_5E1_8665__000001_TS159BW,0,0,
Vision Express,TS15 9AH,OPT,,64 High Street,,Yarm,,TS15 9AH,, - ,,,No ratings yet Rate it yourself - /Services/opticians/LeaveReview/DefaultView.aspx?id=TS15 9AH,0,0,
Hepworth Opticians,TS17 0WA,OPT,,Myton Park,26 Myton Road,Ingleby Barwick,Yorkshire(North Riding),TS17 0WA,Tel: 01642 767734, - ,,,5 ratings Rate it yourself - /Services/opticians/LeaveReview/DefaultView.aspx?id=TS17 0WA,,,
Henderson Opticians,OP_5E1_9456__000001_TS159AY,OPT,Winpenny House,135 High Street,Yarm,,,TS15 9AY,Tel: 01642 783340, - ,,,No ratings yet Rate it yourself - /Services/opticians/LeaveReview/DefaultView.aspx?id=OP_5E1_9456__000001_TS159AY,0,0,
McCormick & Gorman Opticians,OP_5E1_4148__000002_TS170RR,OPT,17 Greenside,Lowfields,Ingleby Barwick,,,TS17 0RR,Tel: 01642 764441, - ,,,No ratings yet Rate it yourself - /Services/opticians/LeaveReview/DefaultView.aspx?id=OP_5E1_4148__000002_TS170RR,0,0,
Asda Opticians,OPT_TS17 9EN,OPT,,ALLENSWAY,,THORNABY,,TS17 9EN,Tel: 01642 768420, - ,,,1 rating Rate it yourself - /Services/opticians/LeaveReview/DefaultView.aspx?id=OPT_TS17 9EN,,,
Mellis Eyecare,OP_5E1_14946__000001_TS170DD,OPT,Thornaby Medical Centre,Trenchard Avenue,Thornaby,Stockton-on-Tees,Cleveland,TS17 0DD,Tel: 01642 751048, - ,,,No ratings yet Rate it yourself - /Services/opticians/LeaveReview/DefaultView.aspx?id=OP_5E1_14946__000001_TS170DD,0,0,
Morton T D,OP_5E1_13806__000001_TS179EX,OPT,6 St Peters Houe,Thornaby Town Centre,,Thornaby,,TS17 9FF,Tel: 01642 760042, - ,,,No ratings yet Rate it yourself - /Services/opticians/LeaveReview/DefaultView.aspx?id=OP_5E1_13806__000001_TS179EX,0,0,
E G E Hall Opticians Ltd,OP_5KM_8823__000001_TS69JA,OPT,164 High Street,Eston,Middlesbrough,Middlesbrough,,TS6 9JA,Tel: 01642 466155, - ,,,No ratings yet Rate it yourself - /Services/opticians/LeaveReview/DefaultView.aspx?id=OP_5KM_8823__000001_TS69JA,0,0,
McCormick & Gorman Opticians,OP_5KM_4518__000001_TS55DY,OPT,7 Oxford Road,,Middlesbrough,,,TS5 5DY,Tel: 01642 814745, - ,,,No ratings yet Rate it yourself - /Services/opticians/LeaveReview/DefaultView.aspx?id=OP_5KM_4518__000001_TS55DY,0,0,
Home Visit Eyecare Ltd,OP_TS134PW_34241,OPT,,24 Zetland Road,,Loftus,,TS13 4PW,, - ,,,No ratings yet Rate it yourself - /Services/opticians/LeaveReview/DefaultView.aspx?id=OP_TS134PW_34241,0,0,
Loftus Optical,TS13 4PW,OPT,,24 Zetland Road,,Loftus,,TS13 4PW,, - ,,,6 ratings Rate it yourself - /Services/opticians/LeaveReview/DefaultView.aspx?id=TS13 4PW,,,
Rayner Opticians,OP_5KK_10738__000001_YO211DY,OPT,,3-4 Wellington Road,,Whitby,North Yorkshire,YO21 1DY,Tel: 01947 603358, - ,,,No ratings yet Rate it yourself - /Services/opticians/LeaveReview/DefaultView.aspx?id=OP_5KK_10738__000001_YO211DY,0,0,
"Wilkinson, S & C L",OP_5J9_00/131__000001_DL11PB,OPT,4 Stonebridge,,Darlington,County Durham,,DL1 1PB,Tel: 01325 463 479, - ,,,No ratings yet Rate it yourself - /Services/opticians/LeaveReview/DefaultView.aspx?id=OP_5J9_00/131__000001_DL11PB,0,0,
Vision Express (UK) Ltd,OP_5J9_1173__000001_DL11LS,OPT,Unit 53,Cornmill Centre,Darlington,County Durham,,DL1 1LS,Tel: 01325 363877, - ,,,No ratings yet Rate it yourself - /Services/opticians/LeaveReview/DefaultView.aspx?id=OP_5J9_1173__000001_DL11LS,0,0,
Specsavers Opticians,OP_5J9_00/194__000004_DL37QW,OPT,32 High Row,,Darlington,County Durham,,DL3 7QW,Tel: 01325 461155, - ,,,1 rating Rate it yourself - /Services/opticians/LeaveReview/DefaultView.aspx?id=OP_5J9_00/194__000004_DL37QW,,,
Boots-Darlington,OP_5J9_7098__000003_DL37QW,OPT,24A High Row,,,Darlington,Durham,DL3 7QW,Tel: 01325 466 019, - ,,,No ratings yet Rate it yourself - /Services/opticians/LeaveReview/DefaultView.aspx?id=OP_5J9_7098__000003_DL37QW,0,0,
Wade Optometry Ltd,OP_5J9_8666__000001_DL37LP,OPT,26 Post House Wynd,Darlington,County Durham,.,,DL3 7LP,Tel: 01325 355482, - ,,,No ratings yet Rate it yourself - /Services/opticians/LeaveReview/DefaultView.aspx?id=OP_5J9_8666__000001_DL37LP,0,0,
Cooper & Leatherbarrow,OP_5J9_5655__000001_DL37AF,OPT,10 Duke Street,,,Darlington,Durham,DL3 7AF,Tel: 01325 463267, - ,,,1 rating Rate it yourself - /Services/opticians/LeaveReview/DefaultView.aspx?id=OP_5J9_5655__000001_DL37AF,,,yes
Brosgill Opticians,OP_5HL_12901__000001_LS16BE,OPT,,55 Street Lane,Roundhay,Leeds,West Yorkshire,LS8 1AP,Tel: 0113 266 3818, - ,,,No ratings yet Rate it yourself - /Services/opticians/LeaveReview/DefaultView.aspx?id=OP_5HL_12901__000001_LS16BE,0,0,yes
Harrison Eye Care,OPT_LS178AE_1,OPT,,141 Shadwell Lane,,Leeds,,LS17 8AE,, - ,,,1 rating Rate it yourself - /Services/opticians/LeaveReview/DefaultView.aspx?id=OPT_LS178AE_1,,,
Edwards Opticians,OP_5E4_9059__000001_YO43AF,OPT,17-19 Southgate,,Market Weighton,E Yorkshire,,YO43 3AF,Tel: 01430 873288, - ,,,No ratings yet Rate it yourself - /Services/opticians/LeaveReview/DefaultView.aspx?id=OP_5E4_9059__000001_YO43AF,0,0,
The Village Optician,DL3 9EL,OPT,,47 West Auckland Road,Cockerton,Darlington,,DL3 9EL,Tel: 01325 489 684, - ,,,2 ratings Rate it yourself - /Services/opticians/LeaveReview/DefaultView.aspx?id=DL3 9EL,,,
James Daly Opticians,OP_5HJ_14024__000002_LS176PY,OPT,398 Harrogate Road,Moortown,Leeds,Leeds,,LS17 6PY,Tel: 0113 288 8820, - ,,,2 ratings Rate it yourself - /Services/opticians/LeaveReview/DefaultView.aspx?id=OP_5HJ_14024__000002_LS176PY,,,
S D Smaje Opticians,OP_5HJ_8775__000001_LS176LD,OPT,2 The Corner House,Harrogate Road,Leeds,,,LS17 6LD,Tel: 0113 269 1334, - ,,,No ratings yet Rate it yourself - /Services/opticians/LeaveReview/DefaultView.aspx?id=OP_5HJ_8775__000001_LS176LD,0,0,
Paul Khoo Opticians,OP114555HM__000002_LS167NR,OPT,,467 Otley Road,Adel,Leeds,,LS16 7NR,Tel: 0113 261 0088, - ,,,No ratings yet Rate it yourself - /Services/opticians/LeaveReview/DefaultView.aspx?id=OP114555HM__000002_LS167NR,0,0,
Asda Stores Ltd,OP_LS167RY_34331,OPT,,Holt Road,,Leeds,,LS16 7RY,Tel: 0113 2699 720, - ,,,No ratings yet Rate it yourself - /Services/opticians/LeaveReview/DefaultView.aspx?id=OP_LS167RY_34331,0,0,
iVision Opticians,OP_5HM_418__000001_LS213AL,OPT,,2A Boroughgate,Otley,Leeds,,LS21 3AL,Tel: 01943 462423, - ,,,No ratings yet Rate it yourself - /Services/opticians/LeaveReview/DefaultView.aspx?id=OP_5HM_418__000001_LS213AL,0,0,
Fink Eyewear ,D-8561,OPT,,8 Market Street,,Leeds,,LS21 3AF,, - ,,,No ratings yet Rate it yourself - /Services/opticians/LeaveReview/DefaultView.aspx?id=D-8561,0,0,
Nicole Bowden Optics Ltd,OP_5HM_14026__000001_LS213AQ,OPT,26 Market Place,Otley,,Leeds,West Yorkshire,LS21 3AQ,Tel: 01943 462114, - ,,,No ratings yet Rate it yourself - /Services/opticians/LeaveReview/DefaultView.aspx?id=OP_5HM_14026__000001_LS213AQ,0,0,
Specsavers,LS21 3HN__000002_LS213HN,OPT,7-9 Kirkgate,Otley,Leeds,West Yorkshire,,LS21 3HN,Tel: 01943 858440, - ,,,No ratings yet Rate it yourself - /Services/opticians/LeaveReview/DefaultView.aspx?id=LS21 3HN__000002_LS213HN,0,0,
L Gaunt Opticians,OP_5HM_14023__000002_LS167SR,OPT,Ireland Wood Surgery,Iveson Approach,,Leeds,,LS16 6FR,Tel: 0113 267 9547, - ,,,No ratings yet Rate it yourself - /Services/opticians/LeaveReview/DefaultView.aspx?id=OP_5HM_14023__000002_LS167SR,0,0,