Organisation Name,NACS Code,Organisation Type,Address1,Address2,Address3,Address4,Address5,PostCode,Telephone Number,Opening time,Value  (Opening time),Banding Classification  (Opening time),NHS.UK users rating,Value  (NHS.UK users rating),Banding Classification  (NHS.UK users rating),Car parking (Is there car parking at this organisation?)
"Wardale, Williams Opticians",OP_5JW_4463__000001_CO106ET,OPT,Wardale Williams,50 Gainsborough Street,,Sudbury,Suffolk,CO10 2ET,Tel: 01787 372492, - ,,,No ratings yet Rate it yourself - /Services/opticians/LeaveReview/DefaultView.aspx?id=OP_5JW_4463__000001_CO106ET,0,0,yes
Sage Opticians,A8L6S,OPT,,20 Market Hill,,"Sudbury, Suffolk",,CO10 2EA,Tel: 01787 323775, - ,,,No ratings yet Rate it yourself - /Services/opticians/LeaveReview/DefaultView.aspx?id=A8L6S,0,0,
Specsavers Opticians,OP_5JW_468730__000002_CO102EA,OPT,6a Market Hill,,Sudbury,Suffolk,,CO10 2EA,Tel: 01787 468730, - ,,,No ratings yet Rate it yourself - /Services/opticians/LeaveReview/DefaultView.aspx?id=OP_5JW_468730__000002_CO102EA,0,0,
Boots-Sudbury - North St,OP_5JW_863__000002_CO106RB,OPT,9 North Street,,,Sudbury,Suffolk,CO10 1RB,Tel: 01787 372590, - ,,,No ratings yet Rate it yourself - /Services/opticians/LeaveReview/DefaultView.aspx?id=OP_5JW_863__000002_CO106RB,0,0,
Simon Kleyn Opticians,OP_TAG_13386__000001_CO62QX,OPT,,106,High Street,Earls Colne,Essex,CO6 2QX,Tel: 01787223213, - ,,,1 rating Rate it yourself - /Services/opticians/LeaveReview/DefaultView.aspx?id=OP_TAG_13386__000001_CO62QX,,,
Mark G Walker Opticians,167800__000002_CO62DQ,OPT,Viaduct Lodge,Colchester Road,Chappel,Essex,,CO6 2DQ,Tel: 01206 243427, - ,,,No ratings yet Rate it yourself - /Services/opticians/LeaveReview/DefaultView.aspx?id=167800__000002_CO62DQ,0,0,
Community Primary Opth Clinic,OP_TAG_U/K__000001_CO92DL,OPT,78 Hedingham Road,,Halstead,Essex,,CO9 2DL,Tel: 01787 291010, - ,,,No ratings yet Rate it yourself - /Services/opticians/LeaveReview/DefaultView.aspx?id=OP_TAG_U/K__000001_CO92DL,0,0,
Wardale Williams Opticians,OP_TAG_9147__000001_CO92AP,OPT,Wardale Williams,28 High Street,,Halstead,Essex,CO9 2AP,Tel: 01787 472209, - ,,,2 ratings Rate it yourself - /Services/opticians/LeaveReview/DefaultView.aspx?id=OP_TAG_9147__000001_CO92AP,,,
Billson Opticians,OP_TAG_10093__000001_CO92JG,OPT,82 High Street,,Halstead,Essex,,CO9 2JG,Tel: 01787 472847, - ,,,No ratings yet Rate it yourself - /Services/opticians/LeaveReview/DefaultView.aspx?id=OP_TAG_10093__000001_CO92JG,0,0,
Medical Eye Centre,OP_5JW_2729__000001_CO109HZ,OPT,"Lotus Cottage, Hall Street",Long Melford,Sudbury,,,CO10 9HZ,Tel: 01787 377741, - ,,,No ratings yet Rate it yourself - /Services/opticians/LeaveReview/DefaultView.aspx?id=OP_5JW_2729__000001_CO109HZ,0,0,
Dawson Domiciliary,OP_5JV_13702__000004_CO30NR,OPT,49 London Road,Stanway,Colchester,,,CO3 0NR,Tel: 01206 575835, - ,,,No ratings yet Rate it yourself - /Services/opticians/LeaveReview/DefaultView.aspx?id=OP_5JV_13702__000004_CO30NR,0,0,
Coggeshall Eye Centre,OL/01-16076/TAG__000002_CO61TS,OPT,15 Market Hill,Coggeshall,Colchester,Essex,,CO6 1TS,Tel: 01376 337242, - ,,,No ratings yet Rate it yourself - /Services/opticians/LeaveReview/DefaultView.aspx?id=OL/01-16076/TAG__000002_CO61TS,0,0,
Asda Opticians,OPT_CO4 5TU,OPT,,TURNER RISE,,COLCHESTER,,CO4 5TU,Tel: 01206 840502, - ,,,1 rating Rate it yourself - /Services/opticians/LeaveReview/DefaultView.aspx?id=OPT_CO4 5TU,,,
Tesco Opticians,CO-1998-B__000001_CO49ED,OPT,Highwoods Square,,Colchester,Essex,,CO4 9ED,Tel: 0345 601 3479, - ,,,2 ratings Rate it yourself - /Services/opticians/LeaveReview/DefaultView.aspx?id=CO-1998-B__000001_CO49ED,,,
The Vision Training Clinic,OP_5GM_4782__000001_CO33NB,OPT,The Vision Training Clinic (CPOC Building),Essex County Hospital,Lexden Road,Colchester,Essex,CO3 3NB,Tel: 01206 744669, - ,,,No ratings yet Rate it yourself - /Services/opticians/LeaveReview/DefaultView.aspx?id=OP_5GM_4782__000001_CO33NB,0,0,
Bethell & Clark,OP_5GM_46__000001_CO11NX,OPT,5 Head Street,,Colchester,Essex,,CO1 1NX,Tel: 01206 573892, - ,,,No ratings yet Rate it yourself - /Services/opticians/LeaveReview/DefaultView.aspx?id=OP_5GM_46__000001_CO11NX,0,0,
Owen Aves,OP_5GM_677__000001_CO33EN,OPT,31 Crouch Street,,Colchester,Essex,,CO3 3EN,Tel: 01206 575693, - ,,,No ratings yet Rate it yourself - /Services/opticians/LeaveReview/DefaultView.aspx?id=OP_5GM_677__000001_CO33EN,0,0,
Premiere Specs Centre,OP_5GM_4553__000002_CO11JJ,OPT,35b Sir Isaacs Walk,,Colchester,Essex,,CO1 1JJ,Tel: 01206 574700, - ,,,No ratings yet Rate it yourself - /Services/opticians/LeaveReview/DefaultView.aspx?id=OP_5GM_4553__000002_CO11JJ,0,0,
Optical Revolution,OP_5GM_13847__000001_CO11DH,OPT,18 Red Lion Yard,,Colchester,Essex,,CO1 1DX,Tel: 01206 369020, - ,,,2 ratings Rate it yourself - /Services/opticians/LeaveReview/DefaultView.aspx?id=OP_5GM_13847__000001_CO11DH,,,
Boots-Colchester - Culver Walk,OP_5GM_599__000001_CO11XJ,OPT,6 Culver Walk,Lion Walk Shopping Centre,Colchester,Colchester,Essex,CO1 1XJ,Tel: 01206 574 038, - ,,,No ratings yet Rate it yourself - /Services/opticians/LeaveReview/DefaultView.aspx?id=OP_5GM_599__000001_CO11XJ,0,0,
Vision Express Opticians,OP_5GM_13308__000001_CO11PL,OPT,11 Culver Walk,Lion Walk Shopping Centre,Colchester,,,CO1 1XJ,Tel: 01206 369733, - ,,,No ratings yet Rate it yourself - /Services/opticians/LeaveReview/DefaultView.aspx?id=OP_5GM_13308__000001_CO11PL,0,0,
Boots-Colchester  - Lion Walk,OP_5GM_782__000002_CO11LX,OPT,5-6 Lions Walk,,Colchester,Essex,,CO1 1LX,Tel: 01206 540854, - ,,,1 rating Rate it yourself - /Services/opticians/LeaveReview/DefaultView.aspx?id=OP_5GM_782__000002_CO11LX,,,
Scrivens Opticians & Hearing Care,OP_5GM_13305__000001_CO11LS,OPT,41 Eld Lane,41 Eld Lane,,Colchester,Essex,CO1 1LS,Tel: 01206 560735, - ,,,No ratings yet Rate it yourself - /Services/opticians/LeaveReview/DefaultView.aspx?id=OP_5GM_13305__000001_CO11LS,0,0,
Optical Express,,OPT,,Montrose House Eld Lane,,Colchester,,CO1 1LS,, - ,,,N/A - Data not available,,,
Optical Express,CO11LP_12654,OPT,Montrose House,Eld Lane,,Colchester,Essex,CO1 1LP,Tel: 0800 023 2020, - ,,,No ratings yet Rate it yourself - /Services/opticians/LeaveReview/DefaultView.aspx?id=CO11LP_12654,0,0,
Dunstone Optometry,OP_5JT_6400__000001_IP75DZ,OPT,3 Queen Street,Hadleigh,,Ipswich,,IP7 5DZ,Tel: 01473 823755, - ,,,No ratings yet Rate it yourself - /Services/opticians/LeaveReview/DefaultView.aspx?id=OP_5JT_6400__000001_IP75DZ,0,0,
Specsavers Opticians,OP_5GM_13223__000001_CO11LJ,OPT,,17 - 33 Long Wyre Street,,Colchester,,CO1 1LJ,Tel: 01206 763136, - ,,,No ratings yet Rate it yourself - /Services/opticians/LeaveReview/DefaultView.aspx?id=OP_5GM_13223__000001_CO11LJ,0,0,no
Hadleigh Eye & Hearing Centre,B9O9L,OPT,43 High Street,43B High Street,Ipswich,Ipswich,,IP7 5AB,Tel: 01473 828801, - ,,,2 ratings Rate it yourself - /Services/opticians/LeaveReview/DefaultView.aspx?id=B9O9L,,,
Eye Syte Ltd,OP_TAG_13855__000001_CO59AG,OPT,43 High Street,,Kelvedon,Essex,,CO5 9AG,Tel: 01376 573370, - ,,,No ratings yet Rate it yourself - /Services/opticians/LeaveReview/DefaultView.aspx?id=OP_TAG_13855__000001_CO59AG,0,0,
East England Eye Care Ltd,OPT_CO43FW_1,OPT,,3 Merlin End,,Colchester,Essex,CO4 3FW,Tel: 01206975032, - ,,,1 rating Rate it yourself - /Services/opticians/LeaveReview/DefaultView.aspx?id=OPT_CO43FW_1,,,
Dennies Spectacle Makers Ltd,OP_5PX_108__000001_CM83QS,OPT,5 The Broadway,Silver End,,Witham,Essex,CM8 3RQ,Tel: 01376 583553, - ,,,No ratings yet Rate it yourself - /Services/opticians/LeaveReview/DefaultView.aspx?id=OP_5PX_108__000001_CM83QS,0,0,yes
Harley Eyecare,OP_TAG_4169__000001_CM71UT,OPT,Manor House,Little Square,Braintree,Essex,,CM7 1UT,Tel: 01376 321852, - ,,,No ratings yet Rate it yourself - /Services/opticians/LeaveReview/DefaultView.aspx?id=OP_TAG_4169__000001_CM71UT,0,0,
Boots-Braintree,OP_TAG_11408__000001_CM77TX,OPT,2-4 Great Square,,,Braintree,Essex,CM7 1TX,Tel: 01376 346319, - ,,,No ratings yet Rate it yourself - /Services/opticians/LeaveReview/DefaultView.aspx?id=OP_TAG_11408__000001_CM77TX,0,0,
Vision Express (UK) Ltd,OP_CM71UR_34504,OPT,,36-38 Bank Street,,Braintree,,CM7 1UR,, - ,,,No ratings yet Rate it yourself - /Services/opticians/LeaveReview/DefaultView.aspx?id=OP_CM71UR_34504,0,0,
Specsavers Opticians,OP_TAG_13854__000001_CM71JP,OPT,68 High Street,,Braintree,Essex,,CM7 1JP,Tel: 01376 552247, - ,,,2 ratings Rate it yourself - /Services/opticians/LeaveReview/DefaultView.aspx?id=OP_TAG_13854__000001_CM71JP,,,
Patrick & Menzies,OP_TAG_1588__000001_CM71JX,OPT,84 High Street,,Braintree,Essex,,CM7 1JP,Tel: 01376 320419, - ,,,No ratings yet Rate it yourself - /Services/opticians/LeaveReview/DefaultView.aspx?id=OP_TAG_1588__000001_CM71JX,0,0,
Refraction Clinic,OP_TAG_13856__000001_CM72QJ,OPT,Rayne Road,,Braintree,Essex,,CM7 2QJ,Tel: 01376 551221, - ,,,No ratings yet Rate it yourself - /Services/opticians/LeaveReview/DefaultView.aspx?id=OP_TAG_13856__000001_CM72QJ,0,0,
Don Tyler & Son Opticians,OP_5GM_6206__000002_CO50HF,OPT,12 The Centre,Church Road,"Tiptree, Colchester",,,CO5 0HF,Tel: 01621 815084, - ,,,No ratings yet Rate it yourself - /Services/opticians/LeaveReview/DefaultView.aspx?id=OP_5GM_6206__000002_CO50HF,0,0,
Russell D J Opticians,OP_5GM_2070__000001_CO50AB,OPT,110 Church Road,Tiptree,Colchester,,,CO5 0AB,Tel: 01621 817443, - ,,,No ratings yet Rate it yourself - /Services/opticians/LeaveReview/DefaultView.aspx?id=OP_5GM_2070__000001_CO50AB,0,0,
Wivenhoe Eyecare and Contact Lens Centre,OP_5GM_20001__000012_B65RQ,OPT,1 Belle Vue Road,Wivenhoe,Colchester,Essex,,CO7 9LE,Tel: 01206 820202, - ,,,No ratings yet Rate it yourself - /Services/opticians/LeaveReview/DefaultView.aspx?id=OP_5GM_20001__000012_B65RQ,0,0,
Tesco Stores Ltd,OP_5PX_1998__000001_CM777WW,OPT,1 The Square,Notley Green,Braintree,Essex,,CM77 7WW,Tel: 01376 307438, - ,,,No ratings yet Rate it yourself - /Services/opticians/LeaveReview/DefaultView.aspx?id=OP_5PX_1998__000001_CM777WW,0,0,
Witham Health Centre,OP_TAG_13857__000001_CM82UX,OPT,,4 Mayland Road,Witham,Essex,Essex,CM8 2UX,Tel: 01376 302740, - ,,,No ratings yet Rate it yourself - /Services/opticians/LeaveReview/DefaultView.aspx?id=OP_TAG_13857__000001_CM82UX,0,0,
Belson & Sons Opticians,OP_TAG_2284__000002_CM82AF,OPT,5a Newland Street,,Witham,Essex,,CM8 2AF,Tel: 01376 512336, - ,,,No ratings yet Rate it yourself - /Services/opticians/LeaveReview/DefaultView.aspx?id=OP_TAG_2284__000002_CM82AF,0,0,
Boots-Witham,OP_TAG_7757__000001_CM82YT,OPT,19 The Grove Centre,,Witham,Essex,,CM8 2YT,Tel: 01376 514026, - ,,,1 rating Rate it yourself - /Services/opticians/LeaveReview/DefaultView.aspx?id=OP_TAG_7757__000001_CM82YT,,,
Specsavers Opticians Ltd,OP_TAG_13859__000002_CM82YT,OPT,4 The Grove Centre,,Witham,Essex,,CM8 2YT,Tel: 01376 533670, - ,,,No ratings yet Rate it yourself - /Services/opticians/LeaveReview/DefaultView.aspx?id=OP_TAG_13859__000002_CM82YT,0,0,
Witham Vision Centre,OP_TAG_13858__000002_CM82AB,OPT,,94 Newland Street,Witham,Essex,,CM8 1AH,Tel: 01376 515510, - ,,,No ratings yet Rate it yourself - /Services/opticians/LeaveReview/DefaultView.aspx?id=OP_TAG_13858__000002_CM82AB,0,0,
Piper & Priem Optometrists,OP_5AH_13299__000001_CO111AJ,OPT,30 High Street,,Manningtree,Essex,,CO11 1AJ,Tel: 01206 392529, - ,,,4 ratings Rate it yourself - /Services/opticians/LeaveReview/DefaultView.aspx?id=OP_5AH_13299__000001_CO111AJ,,,
Premiere Specs Centre,OP_5AH_1101__000001_CO111AH,OPT,29 High Street,,Manningtree,Essex,,CO11 1AH,Tel: 01206 396396, - ,,,No ratings yet Rate it yourself - /Services/opticians/LeaveReview/DefaultView.aspx?id=OP_5AH_1101__000001_CO111AH,0,0,
Boots-Haverhill,OP_5JW_7789__000001_CB98AH,OPT,41 High Street,,Haverhill,Suffolk,,CB9 8AH,Tel: 01440 702789, - ,,,No ratings yet Rate it yourself - /Services/opticians/LeaveReview/DefaultView.aspx?id=OP_5JW_7789__000001_CB98AH,0,0,
Specsavers Opticians,OP_5JW_765060__000001_CB98AR,OPT,8 The Chauntry,High Street,Haverhill,Suffolk,,CB9 8AR,Tel: 01440 765060, - ,,,No ratings yet Rate it yourself - /Services/opticians/LeaveReview/DefaultView.aspx?id=OP_5JW_765060__000001_CB98AR,0,0,
Observatory Opticians,OP_5JW_4154__000001_CB98HB,OPT,Observatory the Opticians,1 Camps Road,,Haverhill,Suffolk,CB9 8HB,Tel: 01440 761922, - ,,,No ratings yet Rate it yourself - /Services/opticians/LeaveReview/DefaultView.aspx?id=OP_5JW_4154__000001_CB98HB,0,0,
Billson Opticians,OP_5JW_13692__000001_CB99EG,OPT,10 Queens Square,,Haverhill,Suffolk,,CB9 9EG,Tel: 01440 714441, - ,,,No ratings yet Rate it yourself - /Services/opticians/LeaveReview/DefaultView.aspx?id=OP_5JW_13692__000001_CB99EG,0,0,
Patrick & Menzies,OP_5GM_134__000001_CO58QT,OPT,2 Barfield Road,West Mersea,Colchester,,,CO5 8QT,Tel: 01206 383455, - ,,,No ratings yet Rate it yourself - /Services/opticians/LeaveReview/DefaultView.aspx?id=OP_5GM_134__000001_CO58QT,0,0,
ASDA Opticians,OP_5JQ_14008__000002_IP15PD,OPT,Asda Stores Ltd,Goddard Road,,Ipswich,,IP1 5PD,Tel: 01473 464723, - ,,,No ratings yet Rate it yourself - /Services/opticians/LeaveReview/DefaultView.aspx?id=OP_5JQ_14008__000002_IP15PD,0,0,
Patrick & Menzies,OP_5AH_1997__000001_CO70BT,OPT,10 Station Road,Brightlingsea,Colchester,Essex,,CO7 0BT,Tel: 01206 302249, - ,,,No ratings yet Rate it yourself - /Services/opticians/LeaveReview/DefaultView.aspx?id=OP_5AH_1997__000001_CO70BT,0,0,
Asda Opticians,OPT_IP14 1DE,OPT,,MEADOW CENTRE,WILKS WAY,STOWMARKET,,IP14 1DE,Tel: 01449 763083, - ,,,2 ratings Rate it yourself - /Services/opticians/LeaveReview/DefaultView.aspx?id=OPT_IP14 1DE,,,
Needham Market Opticians,OP-01-9208-5PT__000001_IP68DG,OPT,102 High Street,,Needham Market,Suffolk,,IP6 8DG,Tel: 01449 723180, - ,,,No ratings yet Rate it yourself - /Services/opticians/LeaveReview/DefaultView.aspx?id=OP-01-9208-5PT__000001_IP68DG,0,0,
Specsavers,OP_5JT_14932__000002_IP141AH,OPT,11 Ipswich Street,,Stowmarket,Suffolk,,IP14 1AH,Tel: 01449 618280, - ,,,No ratings yet Rate it yourself - /Services/opticians/LeaveReview/DefaultView.aspx?id=OP_5JT_14932__000002_IP141AH,0,0,
F G Brown & Associates Ltd,OP_5JT_9924__000001_IP141BB,OPT,Denmark House,41 Bury Street,,Stowmarket,Suffolk,IP14 1HA,Tel: 01449 612812, - ,,,No ratings yet Rate it yourself - /Services/opticians/LeaveReview/DefaultView.aspx?id=OP_5JT_9924__000001_IP141BB,0,0,yes
Peel & Gudgin Opticians,OP_5JT_7588__000001_IP141EF,OPT,11 Station Road West,,Stowmarket,Suffolk,,IP14 1EF,Tel: 01449 612984, - ,,,No ratings yet Rate it yourself - /Services/opticians/LeaveReview/DefaultView.aspx?id=OP_5JT_7588__000001_IP141EF,0,0,
Eyecare Opticians,OP_5JQ_2629__000001_IP14HA,OPT,341 Norwich Road,,Ipswich,Suffolk,,IP1 4HA,Tel: 01473 747000, - ,,,No ratings yet Rate it yourself - /Services/opticians/LeaveReview/DefaultView.aspx?id=OP_5JQ_2629__000001_IP14HA,0,0,
Peel & Gudgin Opticians,OP_5JW_11956__000001_IP331LS,OPT,Abbey House,30 Angel Hill,Bury St. Edmunds,,,IP33 1LS,Tel: 01284 754541, - ,,,No ratings yet Rate it yourself - /Services/opticians/LeaveReview/DefaultView.aspx?id=OP_5JW_11956__000001_IP331LS,0,0,
Scotts Opticians,OP_5JW_1353__000001_IP331BJ,OPT,,58 Abbeygate Street,,Bury St. Edmunds,Suffolk,IP33 1LB,Tel: 01284 754616, - ,,,No ratings yet Rate it yourself - /Services/opticians/LeaveReview/DefaultView.aspx?id=OP_5JW_1353__000001_IP331BJ,0,0,
Scrivens Ltd,OP_5JW_13102__000001_IP331LW,OPT,43 Abbeygate Street,,,Bury St Edmunds,Suffolk,IP33 1LW,Tel: 01284 702061, - ,,,No ratings yet Rate it yourself - /Services/opticians/LeaveReview/DefaultView.aspx?id=OP_5JW_13102__000001_IP331LW,0,0,
Vision Express,OP_5JW_14192__000001_IP331DD,OPT,12-13 Buttermarket,,Bury St Edmunds,Suffolk,,IP33 1DP,Tel: 01284 750776, - ,,,No ratings yet Rate it yourself - /Services/opticians/LeaveReview/DefaultView.aspx?id=OP_5JW_14192__000001_IP331DD,0,0,
Tesco Opticians,OP_5PX_1988__000002_CM94LE,OPT,Fullbridge,,Maldon,Essex,,CM9 4LE,Tel: 01268 988 742, - ,,,No ratings yet Rate it yourself - /Services/opticians/LeaveReview/DefaultView.aspx?id=OP_5PX_1988__000002_CM94LE,0,0,
Specsavers Opticians,OP_5JW_11921__000002_IP331BE,OPT,,10 Buttermarket,Bury St. Edmunds,Suffolk,,IP33 1DB,Tel: 01284 702240, - ,,,No ratings yet Rate it yourself - /Services/opticians/LeaveReview/DefaultView.aspx?id=OP_5JW_11921__000002_IP331BE,0,0,
Wigram and Ware (Bury) Ltd,OP_5JW_7581__000001_IP331BS,OPT,4 Central Walk,,Bury St. Edmunds,Suffolk,,IP33 1BS,Tel: 01284 753821, - ,,,No ratings yet Rate it yourself - /Services/opticians/LeaveReview/DefaultView.aspx?id=OP_5JW_7581__000001_IP331BS,0,0,
Tesco Opticians Ipswich,CO-1998_24092015,OPT,,"42 London Road, Copdock Interchange",,Ipswich,,IP1 2HB,, - ,,,No ratings yet Rate it yourself - /Services/opticians/LeaveReview/DefaultView.aspx?id=CO-1998_24092015,0,0,
Boots-Bury St Edmunds - Cornhill,OP_5JW_1093__000002_IP331BT,OPT,11-13 Cornhill,,,Bury St Edmunds,Suffolk,IP33 1BX,Tel: 01284 703013, - ,,,1 rating Rate it yourself - /Services/opticians/LeaveReview/DefaultView.aspx?id=OP_5JW_1093__000002_IP331BT,,,
Boots-Bury St Edmunds - Brentgovel St,OP_5JW_4595__000001_IP331EB,OPT,5 Brentgovel Street,,Bury St. Edmunds,Suffolk,,IP33 1EB,Tel: 01284 768328, - ,,,No ratings yet Rate it yourself - /Services/opticians/LeaveReview/DefaultView.aspx?id=OP_5JW_4595__000001_IP331EB,0,0,
R H Jeffery & Associates,OP_5JQ_4554__000001_IP13QU,OPT,28 Anglesea Road,,Ipswich,Suffolk,,IP1 3PP,Tel: 01473 210672, - ,,,No ratings yet Rate it yourself - /Services/opticians/LeaveReview/DefaultView.aspx?id=OP_5JQ_4554__000001_IP13QU,0,0,
Martin James Opticians,OP_5GL_6822__000001_CM94PZ,OPT,1 Market Hill,,Maldon,Essex,,CM9 4PZ,Tel: 01621 853261, - ,,,No ratings yet Rate it yourself - /Services/opticians/LeaveReview/DefaultView.aspx?id=OP_5GL_6822__000001_CM94PZ,0,0,
Boots-Maldon,OP_5GL_13256__000001_CM97EP,OPT,75 High Street,,Maldon,Essex,,CM9 5EP,Tel: 01621 853547, - ,,,No ratings yet Rate it yourself - /Services/opticians/LeaveReview/DefaultView.aspx?id=OP_5GL_13256__000001_CM97EP,0,0,
Templeman Opticians Ltd,OP_5GL_10873__000001_CM97PN,OPT,,32 High Street,Maldon,Essex,,CM9 5PN,Tel: 01621 850573, - ,,,No ratings yet Rate it yourself - /Services/opticians/LeaveReview/DefaultView.aspx?id=OP_5GL_10873__000001_CM97PN,0,0,
Kite Opticians,OP_5JQ_3066__000001_IP13LU,OPT,38 Berners Street,,,Ipswich,Suffolk,IP1 3LU,Tel: 01473 255250, - ,,,No ratings yet Rate it yourself - /Services/opticians/LeaveReview/DefaultView.aspx?id=OP_5JQ_3066__000001_IP13LU,0,0,
Observatory Opticians,OP_5JQ_3639__000001_IP11SS,OPT,Observatory the Opticians,8 Queen Street,,Ipswich,Suffolk,IP1 1SS,Tel: 01473 252595, - ,,,3 ratings Rate it yourself - /Services/opticians/LeaveReview/DefaultView.aspx?id=OP_5JQ_3639__000001_IP11SS,,,
Optical Express,IP1 1SW_11111,OPT,Clydesdale House (3rd floor),,,Ipswich,Suffolk,IP1 1SW,Tel: 0800 023 2020, - ,,,No ratings yet Rate it yourself - /Services/opticians/LeaveReview/DefaultView.aspx?id=IP1 1SW_11111,0,0,
The Opticians,OP_5GN_8681__000002_CM61AB,OPT,35 High Street,,Great Dunmow,Essex,,CM6 1AB,Tel: 01376 876044, - ,,,No ratings yet Rate it yourself - /Services/opticians/LeaveReview/DefaultView.aspx?id=OP_5GN_8681__000002_CM61AB,0,0,
Specsavers Great Dunmow,Q7Q0A,OPT,,11 High Street,,Great Dunmow,,CM6 1AB,Tel: 01376 552247, - ,,,No ratings yet Rate it yourself - /Services/opticians/LeaveReview/DefaultView.aspx?id=Q7Q0A,0,0,
Bird & Fairley,OP_5GN_2946__000001_CM61AG,OPT,18a High Street,,Great Dunmow,Essex,,CM6 1AG,Tel: 01371 874138, - ,,,No ratings yet Rate it yourself - /Services/opticians/LeaveReview/DefaultView.aspx?id=OP_5GN_2946__000001_CM61AG,0,0,
Boots-Ipswich - Tavern St,OP_5JQ_8836__000002_IP13AA,OPT,5 Tavern Street,,,Ipswich,Suffolk,IP1 3AA,Tel: 01473 258256, - ,,,1 rating Rate it yourself - /Services/opticians/LeaveReview/DefaultView.aspx?id=OP_5JQ_8836__000002_IP13AA,,,
Specsavers Opticians,OP_5JQ_6836__000001_IP13AW,OPT,46a Tavern Street,,Ipswich,Suffolk,,IP1 3AW,Tel: 01473 210333, - ,,,4 ratings Rate it yourself - /Services/opticians/LeaveReview/DefaultView.aspx?id=OP_5JQ_6836__000001_IP13AW,,,
Vision Express,OP_5JQ_13694__000001_IP13BB,OPT,3 Tower Ramparts,Tavern Street,Ipswich,,,IP1 3DH,Tel: 01473 281199, - ,,,No ratings yet Rate it yourself - /Services/opticians/LeaveReview/DefaultView.aspx?id=OP_5JQ_13694__000001_IP13BB,0,0,
Boots-Ipswich - Upper Brook St,OP_5JQ_10211__000001_IP41EE,OPT,16 Upper Brook Street,,,Ipswich,Suffolk,IP4 1EE,Tel: 01473 252 359, - ,,,No ratings yet Rate it yourself - /Services/opticians/LeaveReview/DefaultView.aspx?id=OP_5JQ_10211__000001_IP41EE,0,0,
H E Kersey,OP_5JQ_4378__000001_IP41BA,OPT,22 Tacket Street,,Ipswich,Suffolk,,IP4 1BA,Tel: 01473 406567, - ,,,No ratings yet Rate it yourself - /Services/opticians/LeaveReview/DefaultView.aspx?id=OP_5JQ_4378__000001_IP41BA,0,0,
A J Rawling,OP_5JQ_13693__000001_IP13DB,OPT,14 Northgate Street,,Ipswich,Suffolk,,IP1 3DB,Tel: 01473 252026, - ,,,1 rating Rate it yourself - /Services/opticians/LeaveReview/DefaultView.aspx?id=OP_5JQ_13693__000001_IP13DB,,,no
Eyedeal Opticians,OL_22/5/2006_5PR__000001_IP41EJ,OPT,20 Carr Street,,Ipswich,Suffolk,,IP4 1EJ,Tel: 01473 251702, - ,,,No ratings yet Rate it yourself - /Services/opticians/LeaveReview/DefaultView.aspx?id=OL_22/5/2006_5PR__000001_IP41EJ,0,0,
Armstrong & North Ltd,01-17721,OPT,,36 Carr Street,,Ipswich,,IP4 1EN,Tel: 01473 226009, - ,,,No ratings yet Rate it yourself - /Services/opticians/LeaveReview/DefaultView.aspx?id=01-17721,0,0,
Orthoptic Department,OP_5JN_U/K__000002_CM29BG,OPT,West Wing 2,Broomfield Hospital,Court Road,Chelmsford,Essex,CM1 7ET,Tel: 01245 514500, - ,,,1 rating Rate it yourself - /Services/opticians/LeaveReview/DefaultView.aspx?id=OP_5JN_U/K__000002_CM29BG,,,
Broomfield Refraction Clinic,OP_5JN_13368__000001_CM29BG,OPT,Court Road,Broomfield,,Chelmsford,Essex,CM1 5ET,Tel: 01245 440761, - ,,,No ratings yet Rate it yourself - /Services/opticians/LeaveReview/DefaultView.aspx?id=OP_5JN_13368__000001_CM29BG,0,0,
Primesight Opticians,OP_5JQ_14007__000002_IP44EL,OPT,432 Woodbridge Road,,Ipswich,Suffolk,,IP4 4EL,Tel: 01473 724158, - ,,,No ratings yet Rate it yourself - /Services/opticians/LeaveReview/DefaultView.aspx?id=OP_5JQ_14007__000002_IP44EL,0,0,
Hanks and Peck Opticians,041120191014,OPT,,High Street,,Thorpe le Spoken,,CO16 0DY,, - ,,,No ratings yet Rate it yourself - /Services/opticians/LeaveReview/DefaultView.aspx?id=041120191014,0,0,
Chelmer Village Opticians,OPT_CM26RF_1,OPT,,"20 Village Square, Chelmer Village",,Chelmsford,Essex,CM2 6RF,Tel: 01245 461 843, - ,,,2 ratings Rate it yourself - /Services/opticians/LeaveReview/DefaultView.aspx?id=OPT_CM26RF_1,,,yes
Broomfield Opticians,OP_5JN_9929__000001_CM11SW,OPT,24 Broomfield Road,,Chelmsford,Essex,,CM1 1SW,Tel: 01245 352803, - ,,,No ratings yet Rate it yourself - /Services/opticians/LeaveReview/DefaultView.aspx?id=OP_5JN_9929__000001_CM11SW,0,0,
Optical Express,CM26JE_12356,OPT,,31 Springfield Road,,Chelmsford,,CM2 6JE,Tel: 0800 0232020, - ,,,No ratings yet Rate it yourself - /Services/opticians/LeaveReview/DefaultView.aspx?id=CM26JE_12356,0,0,
Specsavers Opticians,OP_5JN_2616__000001_CM11DX,OPT,92-93 High Street,,,Chelmsford,,CM1 1DX,Tel: 01245 600000, - ,,,No ratings yet Rate it yourself - /Services/opticians/LeaveReview/DefaultView.aspx?id=OP_5JN_2616__000001_CM11DX,0,0,
Opticial Express,OP_12345_CM1 1LN,OPT,"Ground Floor, Marlborough House",Victoria Road South,,Chelmsford,Essex,CM1 1LN,Tel: 0800 023 2020, - ,,,No ratings yet Rate it yourself - /Services/opticians/LeaveReview/DefaultView.aspx?id=OP_12345_CM1 1LN,0,0,
Opticial Express,OPT_CM11LN_1,OPT,,"Ground Floor, Marlborough House",,Chelmsford,,CM1 1LN,, - ,,,No ratings yet Rate it yourself - /Services/opticians/LeaveReview/DefaultView.aspx?id=OPT_CM11LN_1,0,0,
GoldsmithWebb,OP_5JN_11793__000001_CM11LU,OPT,19 Market Road,,Chelmsford,Essex,,CM1 1LU,Tel: 01245 260555, - ,,,No ratings yet Rate it yourself - /Services/opticians/LeaveReview/DefaultView.aspx?id=OP_5JN_11793__000001_CM11LU,0,0,