Organisation Name,NACS Code,Organisation Type,Address1,Address2,Address3,Address4,Address5,PostCode,Telephone Number,Opening time,Value  (Opening time),Banding Classification  (Opening time),NHS.UK users rating,Value  (NHS.UK users rating),Banding Classification  (NHS.UK users rating),Car parking (Is there car parking at this organisation?)
Optimum Vision Clinic,01-26429,OPT,,"The Falcon Garage, Burghfield Road",,Tadley,Hampshire,RG26 4QY,Tel: 0118 9810267, - ,,,161 ratings Rate it yourself - /Services/opticians/LeaveReview/DefaultView.aspx?id=01-26429,,,yes
Leightons Opticians & Hearing Care,OP_5DF_7434__000001_RG264HN,OPT,,Dental Surgery,Newchurch Road,Tadley,Hampshire,RG26 4HN,Tel: 0118 981 2250, - ,,,No ratings yet Rate it yourself - /Services/opticians/LeaveReview/DefaultView.aspx?id=OP_5DF_7434__000001_RG264HN,0,0,
Buyspecs Direct,TP0ML,OPT,,"Unit 9, Pipers Court",Berkshire Drive,Thatcham,Berkshire,RG19 4ER,Tel: 01635 293578, - ,,,No ratings yet Rate it yourself - /Services/opticians/LeaveReview/DefaultView.aspx?id=TP0ML,0,0,
Leightons Opticians & Hearing Care,OP_5DK_3647__000001_RG193JD,OPT,,12 Kingsland Centre,,Thatcham,Berkshire,RG19 3HN,Tel: 01635 863290, - ,,,1 rating Rate it yourself - /Services/opticians/LeaveReview/DefaultView.aspx?id=OP_5DK_3647__000001_RG193JD,,,
Specsavers Opticians,TP9F3,OPT,Sainsbury's,Bath Road,Calcot,Reading,Berkshire,RG31 7SA,Tel: 0118 956 9770, - ,,,No ratings yet Rate it yourself - /Services/opticians/LeaveReview/DefaultView.aspx?id=TP9F3,0,0,
Vision Express,OP_RG147HB_85778,OPT,,"Tesco Express, Pinchington Lane",,Newbury,,RG14 7HB,, - ,,,No ratings yet Rate it yourself - /Services/opticians/LeaveReview/DefaultView.aspx?id=OP_RG147HB_85778,0,0,
Specsavers - Hectors Way Newbury,,OPT,,Sainsbury's Hectors Way,,Newbury,Berkshire,RG14 5AB,Tel: 01635 881 657, - ,,,N/A - Data not available,,,
Scrivens Opticians,OP_5DL_10795__000002_RG315AR,OPT,11 School Road,Tilehurst,Reading,Berkshire,,RG31 5AR,Tel: 0118 9412911, - ,,,1 rating Rate it yourself - /Services/opticians/LeaveReview/DefaultView.aspx?id=OP_5DL_10795__000002_RG315AR,,,
Ottica UK Ltd,OP_RG141AY_85774,OPT,,38 Parkway,,Newbury,,RG14 1AY,, - ,,,No ratings yet Rate it yourself - /Services/opticians/LeaveReview/DefaultView.aspx?id=OP_RG141AY_85774,0,0,
Boots-Newbury - Northbrook St (in Boots UK),OP_RG141DJ_85768,OPT,4-5 Northbrook Street,,,Newbury,Berkshire,RG14 1DJ,Tel: 01635 40397, - ,,,2 ratings Rate it yourself - /Services/opticians/LeaveReview/DefaultView.aspx?id=OP_RG141DJ_85768,,,
Vision Express,OP_5DK_3370__000001_RG141AA,OPT,92 Northbrook Street,,Newbury,,,RG14 1AA,Tel: 01635 230294, - ,,,No ratings yet Rate it yourself - /Services/opticians/LeaveReview/DefaultView.aspx?id=OP_5DK_3370__000001_RG141AA,0,0,
Scott Waters Opticians,OP_5DK_5322__000002_RG141AA,OPT,,98 Northbrook Street,,Newbury,Berkshire,RG14 1AA,Tel: 01635 31113, - ,,,No ratings yet Rate it yourself - /Services/opticians/LeaveReview/DefaultView.aspx?id=OP_5DK_5322__000002_RG141AA,0,0,
Specsavers Opticians,OP_5DK_1746__000001_RG141DT,OPT,42-42a Northbrook Street,Newbury,Berkshire,,,RG14 1DT,Tel: 01635 46105, - ,,,No ratings yet Rate it yourself - /Services/opticians/LeaveReview/DefaultView.aspx?id=OP_5DK_1746__000001_RG141DT,0,0,
Vision Express (UK) Ltd,OP_5DL_2989__000001_RG87LR,OPT,,12 Whitchurch Road,Reading,Pangbourne,Berkshire,RG8 7BP,Tel: 0118 984 2428, - ,,,No ratings yet Rate it yourself - /Services/opticians/LeaveReview/DefaultView.aspx?id=OP_5DL_2989__000001_RG87LR,0,0,
Costco,OP_RG26UE_85770,OPT,,"100 South Oak Way, Green Park",,Reading,,RG2 6UE,, - ,,,No ratings yet Rate it yourself - /Services/opticians/LeaveReview/DefaultView.aspx?id=OP_RG26UE_85770,0,0,
Chineham Centre Opticians,OP_5DF_11440__000002_RG248BQ,OPT,17 Chineham Shopping Centre,Chineham,,Basingstoke,,RG24 8BQ,Tel: 01256 327564, - ,,,1 rating Rate it yourself - /Services/opticians/LeaveReview/DefaultView.aspx?id=OP_5DF_11440__000002_RG248BQ,,,
Tesco Opticians,654321__000001_RG248BE,OPT,District Shopping Centre,Chineham,,Basingstoke,,RG24 8BE,Tel: 0345 601 3479, - ,,,1 rating Rate it yourself - /Services/opticians/LeaveReview/DefaultView.aspx?id=654321__000001_RG248BE,,,
Boots-Basingstoke - Old Basing Mall,OP_5DF_6102__000002_RG217LW,OPT,15 Old Basing Mall,,,Basingstoke,Hampshire,RG21 7LW,Tel: 01256 364943, - ,,,1 rating Rate it yourself - /Services/opticians/LeaveReview/DefaultView.aspx?id=OP_5DF_6102__000002_RG217LW,,,
Prime Opticians,F6T5F,OPT,,"Unit 3a, Old Basing Mall",,Basingstoke,Hampshire,RG21 7AW,Tel: 01256 278 278, - ,,,No ratings yet Rate it yourself - /Services/opticians/LeaveReview/DefaultView.aspx?id=F6T5F,0,0,
Vision Express,OP_RG301AH_85777,OPT,,"Tesco Express, Portman Road",,Reading,,RG30 1AH,, - ,,,No ratings yet Rate it yourself - /Services/opticians/LeaveReview/DefaultView.aspx?id=OP_RG301AH_85777,0,0,
Vision Express,OP_5DF_12805__000001_RG217LD,OPT,"Unit 4, Chiswick House","Unit 4, Chiswick House",,Basingstoke,,RG21 7LD,Tel: 01256 814824, - ,,,No ratings yet Rate it yourself - /Services/opticians/LeaveReview/DefaultView.aspx?id=OP_5DF_12805__000001_RG217LD,0,0,
Specsavers,OP_5DF_1542__000001_RG217JR,OPT,5 Chiswick House,Festival Place,,Basingstoke,,RG21 7LD,Tel: 01256 479429, - ,,,98 ratings Rate it yourself - /Services/opticians/LeaveReview/DefaultView.aspx?id=OP_5DF_1542__000001_RG217JR,,,
David Clulow Opticians,OP_5DF_8373__000001_RG217JY,OPT,25 Mayfair House,25 Mayfair House,,Basingstoke,Hampshire,RG21 7JY,Tel: 01256 332113, - ,,,No ratings yet Rate it yourself - /Services/opticians/LeaveReview/DefaultView.aspx?id=OP_5DF_8373__000001_RG217JY,0,0,
Batemans Opticians,OP_5DF_270__000001_RG217LN,OPT,13 Kensington House,Festival Centre,,Basingstoke,Hampshire,RG21 7LN,Tel: 01256 321327, - ,,,No ratings yet Rate it yourself - /Services/opticians/LeaveReview/DefaultView.aspx?id=OP_5DF_270__000001_RG217LN,0,0,
Leightons Opticians & Hearing Care,OP_5DF_9286__000001_RG217DE,OPT,,9-11 Church Street,,Basingstoke,Hampshire,RG21 7QG,Tel: 01256 321068, - ,,,No ratings yet Rate it yourself - /Services/opticians/LeaveReview/DefaultView.aspx?id=OP_5DF_9286__000001_RG217DE,0,0,
Buyspecs Direct,OPT_RG211NX_1,OPT,,"Yard House, May Place",,Basingstoke,,RG21 1NX,, - ,,,No ratings yet Rate it yourself - /Services/opticians/LeaveReview/DefaultView.aspx?id=OPT_RG211NX_1,0,0,
D & R Kirk Opticians,OP_RG20EG_85771,OPT,D & R Kirk Opticians,47 Whitley Street,,READING,Berkshire,RG2 0EG,Tel: 0118 9871020, - ,,,4 ratings Rate it yourself - /Services/opticians/LeaveReview/DefaultView.aspx?id=OP_RG20EG_85771,,,
Specsavers Opticians,OP_RG12AA_85781,OPT,,45 Broad Street,,Reading,,RG1 2AA,, - ,,,No ratings yet Rate it yourself - /Services/opticians/LeaveReview/DefaultView.aspx?id=OP_RG12AA_85781,0,0,
Vision Express (UK) Ltd,OP_5DL_2333__000003_RG12AH,OPT,"5a, Town Mall Walk, Upper Ground Level",The Oracle Centre,Reading,,,RG1 2AH,Tel: 0118 950 4504, - ,,,No ratings yet Rate it yourself - /Services/opticians/LeaveReview/DefaultView.aspx?id=OP_5DL_2333__000003_RG12AH,0,0,
Boots-Reading - Oracle Centre (in Boots UK),OP_5DL_1822__000002_RG12AH,OPT,Unit 5 Upper Ground Level,The Oracle Centre,,Reading,Berkshire,RG1 2AH,Tel: 0118 958 9783, - ,,,5 ratings Rate it yourself - /Services/opticians/LeaveReview/DefaultView.aspx?id=OP_5DL_1822__000002_RG12AH,,,
Eyesite Opticians,OP_5DL_297__000001_RG11EP,OPT,142 Friar Street,,,Reading,Berkshire,RG1 1EX,Tel: 0118 950 9098, - ,,,1 rating Rate it yourself - /Services/opticians/LeaveReview/DefaultView.aspx?id=OP_5DL_297__000001_RG11EP,,,
Leightons Opticians & Hearing Care,OP_5DL_8141__000001_RG17UJ,OPT,,12-14 Queen Victoria Street,,Reading,Berkshire,RG1 1TG,Tel: 0118 959 0055, - ,,,No ratings yet Rate it yourself - /Services/opticians/LeaveReview/DefaultView.aspx?id=OP_5DL_8141__000001_RG17UJ,0,0,
Specsavers Opticians,OP_RG28HA_85773,OPT,,"203 - 205 Shinfield Road,",,"Earley, Reading",,RG2 8HA,, - ,,,No ratings yet Rate it yourself - /Services/opticians/LeaveReview/DefaultView.aspx?id=OP_RG28HA_85773,0,0,
Opticial Express,OP_12345_RG1 4BP,OPT,"Lower Ground, Havell House",62-66 Queens Road,,Reading,Berkshire,RG1 4BP,Tel: 0800 023 2020, - ,,,No ratings yet Rate it yourself - /Services/opticians/LeaveReview/DefaultView.aspx?id=OP_12345_RG1 4BP,0,0,
Optical Express,,OPT,,Havell House,,Reading,,RG1 4BP,, - ,,,N/A - Data not available,,,
Robin James Opticians Ltd,OP_5DL_844__000002_RG48AU,OPT,44 Church Street,Caversham,Reading,,,RG4 8AU,Tel: 0118 947 2099, - ,,,No ratings yet Rate it yourself - /Services/opticians/LeaveReview/DefaultView.aspx?id=OP_5DL_844__000002_RG48AU,0,0,
ASDA Stores Ltd,OP_RG65TT_85766,OPT,,Lower Earley District Centre,,READING,,RG6 5TT,Tel: 01189 870 320, - ,,,No ratings yet Rate it yourself - /Services/opticians/LeaveReview/DefaultView.aspx?id=OP_RG65TT_85766,0,0,
Vision Express,OP_RG18DF_85776,OPT,,"Tesco Express, Napier Road",,Reading,,RG1 8DF,, - ,,,No ratings yet Rate it yourself - /Services/opticians/LeaveReview/DefaultView.aspx?id=OP_RG18DF_85776,0,0,
Brown & White (Opticians) Ltd,OP_5G6_7713__000001_RG279DJ,OPT,Bourne House,London Road,,Hook,Hampshire,RG27 9DJ,Tel: 01256 763016, - ,,,No ratings yet Rate it yourself - /Services/opticians/LeaveReview/DefaultView.aspx?id=OP_5G6_7713__000001_RG279DJ,0,0,
Home Care Optician,OP_RG46PH_46763,OPT,,4 Highbridge Close,Caversham Park Village,Reading,Berkshire,RG4 6PH,Tel: 07909 335211, - ,,,No ratings yet Rate it yourself - /Services/opticians/LeaveReview/DefaultView.aspx?id=OP_RG46PH_46763,0,0,
Stephen Abery Opticians,OP_5DN_8100__000001_RG67HD,OPT,,46 Gipsy Lane,Reading,Earley,Buckinghamshire,RG6 7HD,Tel: 0118 935 1975, - ,,,No ratings yet Rate it yourself - /Services/opticians/LeaveReview/DefaultView.aspx?id=OP_5DN_8100__000001_RG67HD,0,0,
Leightons Opticians & Hearing Care,OP_5DN_6941__000002_RG53JH,OPT,,124 Crockhamwell Road,Woodley,Reading,Berkshire,RG5 3JH,Tel: 0118 969 1139, - ,,,1 rating Rate it yourself - /Services/opticians/LeaveReview/DefaultView.aspx?id=OP_5DN_6941__000002_RG53JH,,,
Specsavers Opticians,OP_RG53JH_85780,OPT,,176 Crockhamwell Road,,Woodley,,RG5 3JH,, - ,,,1 rating Rate it yourself - /Services/opticians/LeaveReview/DefaultView.aspx?id=OP_RG53JH_85780,,,
The Opticians,OP_5G6_9543__000001_RG291LA,OPT,,113a High Street,,Odiham,Hampshire,RG29 1LA,Tel: 01256 703707, - ,,,No ratings yet Rate it yourself - /Services/opticians/LeaveReview/DefaultView.aspx?id=OP_5G6_9543__000001_RG291LA,0,0,
Specsavers Opticians,OP_RG401AL_85779,OPT,,18 Market Place,,Wokingham,Berkshire,RG40 1AL,Tel: 0118 978 3525, - ,,,No ratings yet Rate it yourself - /Services/opticians/LeaveReview/DefaultView.aspx?id=OP_RG401AL_85779,0,0,
the eye people,OP_5DN_5493__000002_RG401XJ,OPT,,the eye people,22 Market Place,Wokingham,Berkshire,RG40 1AP,Tel: 0118 978 9311, - ,,,No ratings yet Rate it yourself - /Services/opticians/LeaveReview/DefaultView.aspx?id=OP_5DN_5493__000002_RG401XJ,0,0,
Vision Express (UK) Ltd,OP_5DN_10002__000002_RG401XZ,OPT,4 Old Row Court,Rose Street,Wokingham,Berkshire,,RG40 1XZ,Tel: 0118 978 0937, - ,,,No ratings yet Rate it yourself - /Services/opticians/LeaveReview/DefaultView.aspx?id=OP_5DN_10002__000002_RG401XZ,0,0,
Boots-Wokingham,OP_5DN_11548__000001_RG401XS,OPT,41 Market Place,,Wokingham,Wokingham,Berkshire,RG40 1AT,Tel: 01189796392, - ,,,No ratings yet Rate it yourself - /Services/opticians/LeaveReview/DefaultView.aspx?id=OP_5DN_11548__000001_RG401XS,0,0,
Vision Express (UK) Ltd,OP_5DN_1223__000001_RG109DN,OPT,7 Church Street,Twyford,Reading,Berkshire,,RG10 9DN,Tel: 0118 934 5566, - ,,,No ratings yet Rate it yourself - /Services/opticians/LeaveReview/DefaultView.aspx?id=OP_5DN_1223__000001_RG109DN,0,0,
Leightons Opticians & Hearing Care,OP_RG401XJ_85767,OPT,,15 Peach Street,,Wokingham,Berkshire,RG40 1XJ,Tel: 0118 9786 744, - ,,,No ratings yet Rate it yourself - /Services/opticians/LeaveReview/DefaultView.aspx?id=OP_RG401XJ_85767,0,0,
Robert Stanley Opticians,OP_5DX_5409__000002_OX100AL,OPT,8 St. Martins Street,,,Wallingford,,OX10 0AL,Tel: 01491 837033, - ,,,No ratings yet Rate it yourself - /Services/opticians/LeaveReview/DefaultView.aspx?id=OP_5DX_5409__000002_OX100AL,0,0,
Patricia Hayselden & Partners,OP_5DX_8466__000002_OX100EL,OPT,,60 St Mary's Street,,Wallingford,Oxfordshire,OX10 0EL,Tel: 01491 835466, - ,,,1 rating Rate it yourself - /Services/opticians/LeaveReview/DefaultView.aspx?id=OP_5DX_8466__000002_OX100EL,,,
Boots-Wallingford,BOOTSWALLINGFORD1,OPT,1 Castle Street,,,Wallingford,Oxfordshire,OX10 8DL,Tel: 01491 833200, - ,,,2 ratings Rate it yourself - /Services/opticians/LeaveReview/DefaultView.aspx?id=BOOTSWALLINGFORD1,,,
Bunker Opticians,OP_5DX_8715__000001_RG91AN,OPT,45 - 47 Duke Street,,Henley-on-Thames,,,RG9 1UR,Tel: 01491 412020, - ,,,No ratings yet Rate it yourself - /Services/opticians/LeaveReview/DefaultView.aspx?id=OP_5DX_8715__000001_RG91AN,0,0,
Boots-Henley On Thames,BOOTSHENLEY1,OPT,23 Duke Street,,,Henley On Thames,Oxfordshire,RG9 1UR,Tel: 01491 637763, - ,,,1 rating Rate it yourself - /Services/opticians/LeaveReview/DefaultView.aspx?id=BOOTSHENLEY1,,,
John Harwood Optometrist,OP_5G6_13202__000002_GU513PQ,OPT,202 Fleet Road,,Fleet,Hampshire,,GU51 4BY,Tel: 01252 613733, - ,,,No ratings yet Rate it yourself - /Services/opticians/LeaveReview/DefaultView.aspx?id=OP_5G6_13202__000002_GU513PQ,0,0,
Brown & White (Opticians) Ltd,OP_5G6_5186__000001_GU513BU,OPT,341 Fleet Road,,Fleet,,,GU51 3NT,Tel: 01252 616830, - ,,,1 rating Rate it yourself - /Services/opticians/LeaveReview/DefaultView.aspx?id=OP_5G6_5186__000001_GU513BU,,,
Specsavers,OP_5G6_12127__000001_GU513PQ,OPT,231 Fleet Road,,Fleet,Hampshire,,GU51 4BN,Tel: 01252 815 275, - ,,,No ratings yet Rate it yourself - /Services/opticians/LeaveReview/DefaultView.aspx?id=OP_5G6_12127__000001_GU513PQ,0,0,
Leightons Opticians & Hearing Care,OP_5G6_14843__000001_GU514BE,OPT,,168b Fleet Road,,Fleet,Hampshire,GU51 4BE,Tel: 01252 617753, - ,,,No ratings yet Rate it yourself - /Services/opticians/LeaveReview/DefaultView.aspx?id=OP_5G6_14843__000001_GU514BE,0,0,
Boots-Fleet,OP_5G6_5230__000002_GU513LA,OPT,Unit 23,Hart Shopping Centre,Fleet Road,Fleet,Hampshire,GU51 3LA,Tel: 01252 629 259, - ,,,No ratings yet Rate it yourself - /Services/opticians/LeaveReview/DefaultView.aspx?id=OP_5G6_5230__000002_GU513LA,0,0,
Norman Prince Crowthorne Opticians,J7N9X,OPT,,85 Church Street,,Crowthorne,Berkshire,RG45 7AW,Tel: 01344 772062, - ,,,No ratings yet Rate it yourself - /Services/opticians/LeaveReview/DefaultView.aspx?id=J7N9X,0,0,
Vision Express,OP_5DK_11298__000002_RG170DL,OPT,,21 High Street,,Hungerford,Berkshire,RG17 0NF,Tel: 01488 682458, - ,,,No ratings yet Rate it yourself - /Services/opticians/LeaveReview/DefaultView.aspx?id=OP_5DK_11298__000002_RG170DL,0,0,yes
Specsavers,SPECSAVERSDIDCOT1,OPT,,17 Orchard Street,,Didcot,,OX11 7LG,Tel: 01235 517100, - ,,,No ratings yet Rate it yourself - /Services/opticians/LeaveReview/DefaultView.aspx?id=SPECSAVERSDIDCOT1,0,0,
Boots-Didcot,OP_5DY_11588__000001_OX118RJ,OPT,,48 Orchard Street,,Didcot,Oxfordshire,OX11 7LG,Tel: 01235 812241, - ,,,No ratings yet Rate it yourself - /Services/opticians/LeaveReview/DefaultView.aspx?id=OP_5DY_11588__000001_OX118RJ,0,0,
Scrivens,OP_5DY_11103__000001_OX118RN,OPT,,182 The Broadway,,Didcot,Oxfordshire,OX11 8RN,Tel: 01235 813305, - ,,,No ratings yet Rate it yourself - /Services/opticians/LeaveReview/DefaultView.aspx?id=OP_5DY_11103__000001_OX118RN,0,0,
Forsight,OP_5G6_14841__000002_GU179AA,OPT,2 Kings Parade,42 London Road,Blackwater,,,GU17 9AA,Tel: 01276 34053, - ,,,No ratings yet Rate it yourself - /Services/opticians/LeaveReview/DefaultView.aspx?id=OP_5G6_14841__000002_GU179AA,0,0,
Medical Eye Centre,GU17 9AA__000003_GU179AA,OPT,White Hart Parade,,Blackwater,Hampshire,,GU17 9AA,, - ,,,No ratings yet Rate it yourself - /Services/opticians/LeaveReview/DefaultView.aspx?id=GU17 9AA__000003_GU179AA,0,0,
Healthcall Optical Services,OP_GU470UR_46762,OPT,,108 Harvard Road,Owlsmoor,Sandhurst,Berkshire,GU47 0UR,Tel: 01962 609011, - ,,,No ratings yet Rate it yourself - /Services/opticians/LeaveReview/DefaultView.aspx?id=OP_GU470UR_46762,0,0,
Vision Express,OP_5G2_7146__000001_GU470FD,OPT,Tesco Extra,The Meadows,Marshall Road,Sandhurst,Berkshire,GU47 0FD,Tel: 0125 229 8186, - ,,,No ratings yet Rate it yourself - /Services/opticians/LeaveReview/DefaultView.aspx?id=OP_5G2_7146__000001_GU470FD,0,0,
Vision Express,TP8HJ,OPT,The Lexicon,26 Braccan Walk,,Bracknell,Berkshire,RG12 1EN,Tel: 01344 304217, - ,,,No ratings yet Rate it yourself - /Services/opticians/LeaveReview/DefaultView.aspx?id=TP8HJ,0,0,
Specsavers Optician,OP_5G2_6225__000001_RG121DE,OPT,18 Princess Square,,Bracknell,,,RG12 1LS,Tel: 01344 303344, - ,,,No ratings yet Rate it yourself - /Services/opticians/LeaveReview/DefaultView.aspx?id=OP_5G2_6225__000001_RG121DE,0,0,
Insight Opticians,OP_5G2_8738__000002_RG121LS,OPT,15b Princess Square,,Bracknell,,,RG12 1LS,Tel: 01344 454965, - ,,,No ratings yet Rate it yourself - /Services/opticians/LeaveReview/DefaultView.aspx?id=OP_5G2_8738__000002_RG121LS,0,0,
Boots Opticians,TP6A2,OPT,,The Lexicon,19-23 Braccan Walk,Bracknell,Berkshire,RG12 1BE,Tel: 01344 420933, - ,,,No ratings yet Rate it yourself - /Services/opticians/LeaveReview/DefaultView.aspx?id=TP6A2,0,0,
Boots-Camberley - Obelisk Way,OP_5L7_3761__000002_GU153SD,OPT,26-30 Obelisk Way,,,Camberley,Surrey,GU15 3SD,Tel: 01276 670393, - ,,,7 ratings Rate it yourself - /Services/opticians/LeaveReview/DefaultView.aspx?id=OP_5L7_3761__000002_GU153SD,,,
Boots Opticians,OPT_GU341BN_1,OPT,,30 High Street,,Hampshire,,GU34 1BN,Tel: 0142084396, - ,,,No ratings yet Rate it yourself - /Services/opticians/LeaveReview/DefaultView.aspx?id=OPT_GU341BN_1,0,0,
Boots-Camberley - Grace Reynolds Walk,OP_5L7_12539__000001_GU153SN,OPT,1B Grace Reynolds Walk,Main Square,,Camberley,,GU15 3SN,Tel: 01276 25880, - ,,,No ratings yet Rate it yourself - /Services/opticians/LeaveReview/DefaultView.aspx?id=OP_5L7_12539__000001_GU153SN,0,0,
Rawlings Opticians,OP_5DF_4855__000001_GU341AW,OPT,36 High Street,,Alton,Hampshire,,GU34 1BD,Tel: 01420 84230, - ,,,No ratings yet Rate it yourself - /Services/opticians/LeaveReview/DefaultView.aspx?id=OP_5DF_4855__000001_GU341AW,0,0,
Alton Eyecare,GU34 1HA__000001_GU341HA,OPT,23 Market Street,,Alton,Hants,,GU34 1HA,Tel: 01420 542363, - ,,,No ratings yet Rate it yourself - /Services/opticians/LeaveReview/DefaultView.aspx?id=GU34 1HA__000001_GU341HA,0,0,
Specsavers Opticians,OP_5L7_3649__000001_GU153SP,OPT,3 Princess Way,,Camberley,,,GU15 3SP,Tel: 01276 677 686, - ,,,No ratings yet Rate it yourself - /Services/opticians/LeaveReview/DefaultView.aspx?id=OP_5L7_3649__000001_GU153SP,0,0,
Bayfields Opticians,OP_5L7_4702__000001_GU153QU,OPT,1b High Street,,Camberley,Camberley,,GU15 3QU,Tel: 01276 21791, - ,,,No ratings yet Rate it yourself - /Services/opticians/LeaveReview/DefaultView.aspx?id=OP_5L7_4702__000001_GU153QU,0,0,
Specsavers Alton,564738__000002_GU341AW,OPT,,58 High Street,,Alton,,GU34 1ET,Tel: 01420 593600, - ,,,No ratings yet Rate it yourself - /Services/opticians/LeaveReview/DefaultView.aspx?id=564738__000002_GU341AW,0,0,
Tesco Opticians,OP_SP101UZ_29725,OPT,,River Way,,Andover,Hampshire,SP10 1UZ,Tel: 0345 601 3479, - ,,,No ratings yet Rate it yourself - /Services/opticians/LeaveReview/DefaultView.aspx?id=OP_SP101UZ_29725,0,0,
Vision Express Camberley,E0W2O,OPT,,36 High Street,,Camberley,Surrey,GU15 3RS,Tel: 01276670222, - ,,,No ratings yet Rate it yourself - /Services/opticians/LeaveReview/DefaultView.aspx?id=E0W2O,0,0,
Leightons Opticians & Hearing Care,OP_5L7_11292__000001_GU153RS,OPT,,62 High Street,,Camberley,Surrey,GU15 3RS,Tel: 01276 23648, - ,,,No ratings yet Rate it yourself - /Services/opticians/LeaveReview/DefaultView.aspx?id=OP_5L7_11292__000001_GU153RS,0,0,
Leightons Opticians & Hearing Care,OP_5DF_1179__000001_GU341EN,OPT,,90 High Street,,Alton,Hampshire,GU34 1EN,Tel: 01420 83070, - ,,,No ratings yet Rate it yourself - /Services/opticians/LeaveReview/DefaultView.aspx?id=OP_5DF_1179__000001_GU341EN,0,0,
Costco Wholesale UK Ltd,CO-1833-8,OPT,,Templar Avenue,,Farnborough,,GU14 6FE,Tel: 01252 896 945, - ,,,No ratings yet Rate it yourself - /Services/opticians/LeaveReview/DefaultView.aspx?id=CO-1833-8,0,0,
Specsavers,OP_5G6_5949__000002_GU146YA,OPT,Princes Mead Centre,,,Farnborough,,GU14 6YA,Tel: 01252 370 498, - ,,,No ratings yet Rate it yourself - /Services/opticians/LeaveReview/DefaultView.aspx?id=OP_5G6_5949__000002_GU146YA,0,0,
ASDA Opticians,OP_5G6_14839__000002_GU147LT,OPT,Asda Stores Ltd,West Meade,Farnborough,Hampshire,,GU14 7LT,Tel: 01252 557292, - ,,,No ratings yet Rate it yourself - /Services/opticians/LeaveReview/DefaultView.aspx?id=OP_5G6_14839__000002_GU147LT,0,0,
Leightons Opticians & Hearing Care,OP_5G6_8593__000001_GU147NY,OPT,20 Victoria Road,.,Farnborough,.,,GU14 7NY,Tel: 01252 545666, - ,,,No ratings yet Rate it yourself - /Services/opticians/LeaveReview/DefaultView.aspx?id=OP_5G6_8593__000001_GU147NY,0,0,
Brian Craig Eyecare Ltd,GU14 7NY__000002_GU147NY,OPT,20 Victoria Road,,Farnborough,Hampshire,,GU14 7NY,, - ,,,No ratings yet Rate it yourself - /Services/opticians/LeaveReview/DefaultView.aspx?id=GU14 7NY__000002_GU147NY,0,0,
Campbells Opticians,OP_5DY_2985__000002_OX128BU,OPT,,34 Market Place,,Wantage,Oxfordshire,OX12 8AH,Tel: 01235 763312, - ,,,No ratings yet Rate it yourself - /Services/opticians/LeaveReview/DefaultView.aspx?id=OP_5DY_2985__000002_OX128BU,0,0,
Specsavers Opticians,TP2HJ,OPT,,1A Grove Street,,Wantage,Oxfordshire,OX12 7AB,Tel: 01235 773980, - ,,,No ratings yet Rate it yourself - /Services/opticians/LeaveReview/DefaultView.aspx?id=TP2HJ,0,0,
Speccies,GU14 7RL__000001_GU147RL,OPT,71 Queens Mead,,Farnborough,Hants,,GU14 7RL,Tel: 01252 373008, - ,,,No ratings yet Rate it yourself - /Services/opticians/LeaveReview/DefaultView.aspx?id=GU14 7RL__000001_GU147RL,0,0,
Insight Opticians,OP_5L7_13115__000001_GU165HJ,OPT,,21 Frimley High Street,Frimley,Camberley,Surrey,GU16 7HJ,Tel: 01276 627 44, - ,,,1 rating Rate it yourself - /Services/opticians/LeaveReview/DefaultView.aspx?id=OP_5L7_13115__000001_GU165HJ,,,Data not available
Boots-Wantage,BOOTSOPTICIANSWANTAGE1,OPT,Unit 3A Kings Walk,,,Wantage,Oxfordshire,OX12 9AJ,Tel: 01235 768177, - ,,,No ratings yet Rate it yourself - /Services/opticians/LeaveReview/DefaultView.aspx?id=BOOTSOPTICIANSWANTAGE1,0,0,
Boots-Farnborough,OP_5G6_5035__000001_GU147RZ,OPT,87-91 Queensmead,,,Farnborough,Hampshire,GU14 7RZ,Tel: 01252 549100, - ,,,No ratings yet Rate it yourself - /Services/opticians/LeaveReview/DefaultView.aspx?id=OP_5G6_5035__000001_GU147RZ,0,0,
Boots-Frimley,OP_5L7_5111__000002_GU165HY,OPT,4 The Parade,,High Street,Frimley,,GU16 7HY,Tel: 01276 62656, - ,,,No ratings yet Rate it yourself - /Services/opticians/LeaveReview/DefaultView.aspx?id=OP_5L7_5111__000002_GU165HY,0,0,
West Country Eyecare,OL/5FT__000004_SP101NG,OPT,76 High Street,,andover,Hants,,SP10 1NG,Tel: 01264 366165, - ,,,No ratings yet Rate it yourself - /Services/opticians/LeaveReview/DefaultView.aspx?id=OL/5FT__000004_SP101NG,0,0,
Specsavers,OP_5E9_5988__000001_SP101NG,OPT,,72 High Street,,Andover,Hampshire,SP10 1NG,Tel: 01264 339 369, - ,,,2 ratings Rate it yourself - /Services/opticians/LeaveReview/DefaultView.aspx?id=OP_5E9_5988__000001_SP101NG,,,
Boots-Andover - High St,OP_5E9_6071__000001_SP101LP,OPT,63 High Street,,,Andover,Hampshire,SP10 1LP,Tel: 01264 352887, - ,,,2 ratings Rate it yourself - /Services/opticians/LeaveReview/DefaultView.aspx?id=OP_5E9_6071__000001_SP101LP,,,
Leightons Opticians & Hearing Care,OP_5E9_433__000001_SP101RW,OPT,,68 The Chantry Centre,,Andover,Hampshire,SP10 1RW,Tel: 01264 365695, - ,,,No ratings yet Rate it yourself - /Services/opticians/LeaveReview/DefaultView.aspx?id=OP_5E9_433__000001_SP101RW,0,0,