Organisation Name,NACS Code,Organisation Type,Address1,Address2,Address3,Address4,Address5,PostCode,Telephone Number,Opening time,Value  (Opening time),Banding Classification  (Opening time),NHS.UK users rating,Value  (NHS.UK users rating),Banding Classification  (NHS.UK users rating),Car parking (Is there car parking at this organisation?)
Zeiss Opticians,OP_5MQ_4968__000001_CV376EP,OPT,5a Chapel Street,,Stratford-upon-Avon,,,CV37 6EP,Tel: 01789 269555, - ,,,No ratings yet Rate it yourself - /Services/opticians/LeaveReview/DefaultView.aspx?id=OP_5MQ_4968__000001_CV376EP,0,0,
Greys Opticians,OP_5MQ_6922__000002_CV376LF,OPT,,11 Chapel Street,,Stratford-upon-Avon,Warwickshire,CV37 6EP,Tel: 01789 266941, - ,,,No ratings yet Rate it yourself - /Services/opticians/LeaveReview/DefaultView.aspx?id=OP_5MQ_6922__000002_CV376LF,0,0,
Walford & Round,OP_5MQ_9501__000001_CV376EF,OPT,25 Sheep Street,,Stratford-upon-Avon,,,CV37 6EF,Tel: 01789 205941, - ,,,No ratings yet Rate it yourself - /Services/opticians/LeaveReview/DefaultView.aspx?id=OP_5MQ_9501__000001_CV376EF,0,0,
CGOptical,OP_5MQ_11227__000001_CV376LN,OPT,57 Ely Street,,Stratford-upon-Avon,Stratford-upon-Avon,,CV37 6LN,Tel: 01789 268828, - ,,,No ratings yet Rate it yourself - /Services/opticians/LeaveReview/DefaultView.aspx?id=OP_5MQ_11227__000001_CV376LN,0,0,
Vision Express,OP - 5PM__000002_CV376JE,OPT,2 Wood Street,,Stratford-upon-Avon,Warwickshire,,CV37 6JE,Tel: 01789 290007, - ,,,1 rating Rate it yourself - /Services/opticians/LeaveReview/DefaultView.aspx?id=OP - 5PM__000002_CV376JE,,,
Specsavers Opticians,OP_5MQ_1955__000001_CV376JE,OPT,8 Wood Street,,Stratford-upon-Avon,,,CV37 6JE,Tel: 01789 262606, - ,,,1 rating Rate it yourself - /Services/opticians/LeaveReview/DefaultView.aspx?id=OP_5MQ_1955__000001_CV376JE,,,
Boots-Stratford Upon-Avon,OP_5MQ_2401__000002_CV376JG,OPT,36 Wood Street,,,Stratford Upon Avon,Warwickshire,CV37 6JG,Tel: 01789 292161, - ,,,No ratings yet Rate it yourself - /Services/opticians/LeaveReview/DefaultView.aspx?id=OP_5MQ_2401__000002_CV376JG,0,0,
Walford and Round,OP_5MQ_14439__000001_CV364AE,OPT,42 Sheep Street,Shipston On Stour,Warwickshire,,,CV36 4AE,Tel: 01608 661649, - ,,,No ratings yet Rate it yourself - /Services/opticians/LeaveReview/DefaultView.aspx?id=OP_5MQ_14439__000001_CV364AE,0,0,
Greys Opticians,OP_5MQ_2403__000002_CV364AF,OPT,29 High Street,,,Shipston-on-Stour,Warwickshire,CV36 4AJ,Tel: 01608 662873, - ,,,No ratings yet Rate it yourself - /Services/opticians/LeaveReview/DefaultView.aspx?id=OP_5MQ_2403__000002_CV364AF,0,0,
Greys Opticians,5KY 20001__000002_GL556AT,OPT,,"Drury House, The Square",High Street,Chipping Campden,Gloucestershire,GL55 6AL,Tel: 01386 848884, - ,,,No ratings yet Rate it yourself - /Services/opticians/LeaveReview/DefaultView.aspx?id=5KY 20001__000002_GL556AT,0,0,
Kineton Optometrists,OP_5MQ_8887__000001_CV350JZ,OPT,The Bank House,Banbury Street,Kineton,Warwick,Warwickshire,CV35 0JS,Tel: 01926 641093, - ,,,No ratings yet Rate it yourself - /Services/opticians/LeaveReview/DefaultView.aspx?id=OP_5MQ_8887__000001_CV350JZ,0,0,
Specsavers - Alcester,TP9D3,OPT,,36 High Street,,Alcester,Warwickshire,B49 5AA,Tel: 01789764705, - ,,,No ratings yet Rate it yourself - /Services/opticians/LeaveReview/DefaultView.aspx?id=TP9D3,0,0,
Alcester Opticians,OP_5MQ_14436__000002_B495AF,OPT,65 High Street,Alcester,Warwickshire,,,B49 5AA,Tel: 01789 762692, - ,,,No ratings yet Rate it yourself - /Services/opticians/LeaveReview/DefaultView.aspx?id=OP_5MQ_14436__000002_B495AF,0,0,
Michael Beaver Optician,OP_5MQ_11665__000001_B495AD,OPT,20 High Street,Alcester,Warwickshire,Alcester,,B49 5AD,Tel: 01789 763183, - ,,,No ratings yet Rate it yourself - /Services/opticians/LeaveReview/DefaultView.aspx?id=OP_5MQ_11665__000001_B495AD,0,0,
Browetts Opticians,OP_5MQ_1346__000001_CV344HS,OPT,Browett Opticians,3 Market Street,,Warwick,,CV34 4DH,Tel: 01926 493157, - ,,,2 ratings Rate it yourself - /Services/opticians/LeaveReview/DefaultView.aspx?id=OP_5MQ_1346__000001_CV344HS,,,
Vision Express,OP_5MQ_7813__000001_CV344SD,OPT,,72 Market Place,,Warwick,Warwickshire,CV34 4SD,Tel: 01926 419100, - ,,,No ratings yet Rate it yourself - /Services/opticians/LeaveReview/DefaultView.aspx?id=OP_5MQ_7813__000001_CV344SD,0,0,
McConnell Optometrist,OP_5MQ_2263__000001_CV344AB,OPT,,6 Swan Street,,Warwick,Warwickshire,CV34 4BJ,Tel: 01926 492487, - ,,,No ratings yet Rate it yourself - /Services/opticians/LeaveReview/DefaultView.aspx?id=OP_5MQ_2263__000001_CV344AB,0,0,
B S Breakwell Optometrists,OP_5MQ_7876__000001_CV344EW,OPT,16 Jury Street,,Warwick,,,CV34 4EW,Tel: 01926 491426, - ,,,No ratings yet Rate it yourself - /Services/opticians/LeaveReview/DefaultView.aspx?id=OP_5MQ_7876__000001_CV344EW,0,0,
A Tissington,OP_5MQ_8857__000001_B955AU,OPT,133 High Street,Henley-In-Arden,Solihull,Warwickshire,,B95 5AU,Tel: 01564 792334, - ,,,No ratings yet Rate it yourself - /Services/opticians/LeaveReview/DefaultView.aspx?id=OP_5MQ_8857__000001_B955AU,0,0,
Chris Cheshire Opticians,0000001__000001_WR127AA,OPT,17 The Green,High Street,,Broadway,Worcestershire,WR12 7AA,Tel: 01386 859109, - ,,,No ratings yet Rate it yourself - /Services/opticians/LeaveReview/DefaultView.aspx?id=0000001__000001_WR127AA,0,0,
Osbornes of Evesham,00000060__000001_WR114PA,OPT,Cross Keys House,1-3 Swan Lane,,Evesham,Worcestershire,WR11 4PA,Tel: 01386 47997, - ,,,No ratings yet Rate it yourself - /Services/opticians/LeaveReview/DefaultView.aspx?id=00000060__000001_WR114PA,0,0,
Kevin Tait Opticians,OP_5KY_3831__000001_GL560AS,OPT,3 High Street,,Moreton-In-Marsh,Gloucestershire,,GL56 0AH,Tel: 01608 650621, - ,,,5 ratings Rate it yourself - /Services/opticians/LeaveReview/DefaultView.aspx?id=OP_5KY_3831__000001_GL560AS,,,
Boots-Evesham,OP_5MT_10560__000002_WR114RR,OPT,22 Bridge Street,,,Evesham,Worcestershire,WR11 4RR,Tel: 01386 446 176, - ,,,No ratings yet Rate it yourself - /Services/opticians/LeaveReview/DefaultView.aspx?id=OP_5MT_10560__000002_WR114RR,0,0,
Specsavers Opticians,00000062__000002_WR114SQ,OPT,24 Bridge Street,,,Evesham,Worcestershire,WR11 4RR,Tel: 01386 423301, - ,,,397 ratings Rate it yourself - /Services/opticians/LeaveReview/DefaultView.aspx?id=00000062__000002_WR114SQ,,,
Asda Vision Centre,OP_5MQ_14440__000001_CV311YD,OPT,Chesterton Drive,Leamington Spa,Warwickshire,,,CV31 1YD,Tel: 01926 459112, - ,,,No ratings yet Rate it yourself - /Services/opticians/LeaveReview/DefaultView.aspx?id=OP_5MQ_14440__000001_CV311YD,0,0,
Lees & Thomas Optometrist,OP_5MQ_9995__000001_B807NJ,OPT,57 Alcester Road,,Studley,,,B80 7NJ,Tel: 01527 853932, - ,,,No ratings yet Rate it yourself - /Services/opticians/LeaveReview/DefaultView.aspx?id=OP_5MQ_9995__000001_B807NJ,0,0,
Specsavers Opticians,OP_5MQ_2679__000003_CV324BA,OPT,69 The Parade,Leamington Spa,Warwickshire,,,CV32 4BA,Tel: 01926 427822, - ,,,1 rating Rate it yourself - /Services/opticians/LeaveReview/DefaultView.aspx?id=OP_5MQ_2679__000003_CV324BA,,,
Charnley's Opticians,OP_5MQ_832__000002_CV324BA,OPT,,71 Parade,,Leamington Spa,Warwickshire,CV32 4BA,Tel: 01926 424820, - ,,,No ratings yet Rate it yourself - /Services/opticians/LeaveReview/DefaultView.aspx?id=OP_5MQ_832__000002_CV324BA,0,0,
My Specs Direct T/A Gohil and Grey Opticians,CO-4010,OPT,,53 Parade,,leamington Spa,,CV32 4BA,, - ,,,No ratings yet Rate it yourself - /Services/opticians/LeaveReview/DefaultView.aspx?id=CO-4010,0,0,
Vision Express ,OP_5MQ_1910__000001_CV324XU,OPT,Royal Priors Shopping Centre,,Leamington Spa,,,CV32 4XU,Tel: 01926 831989, - ,,,1 rating Rate it yourself - /Services/opticians/LeaveReview/DefaultView.aspx?id=OP_5MQ_1910__000001_CV324XU,,,
Boots-Leamington Spa - The Parade (in Boots UK),OP_5MQ_1847__000001_CV324BL,OPT,31 The Parade,,,Leamington Spa,Warwickshire,CV32 4BL,Tel: 01926 332404, - ,,,2 ratings Rate it yourself - /Services/opticians/LeaveReview/DefaultView.aspx?id=OP_5MQ_1847__000001_CV324BL,,,
Winyates Opticians,0000050__000004_B980NR,OPT,17 Winyates Shopping Centre,Winyates,Redditch,Worcestershire,,B98 0NR,Tel: 01527 529010, - ,,,No ratings yet Rate it yourself - /Services/opticians/LeaveReview/DefaultView.aspx?id=0000050__000004_B980NR,0,0,
Home Eyecare,5MX063,OPT,,"Unit 8, 17 Winyates Centre",,Redditch,,B98 0NR,Tel: 01527 529010, - ,,,No ratings yet Rate it yourself - /Services/opticians/LeaveReview/DefaultView.aspx?id=5MX063,0,0,
ZMP:  Charles Barlow (domiciliary),OL/01-10826/5EY__000003_B946JG,OPT,171 Station Lane,Lapworth,Solihull,West Midlands,,B94 6JG,Tel: 0800 652 5505, - ,,,No ratings yet Rate it yourself - /Services/opticians/LeaveReview/DefaultView.aspx?id=OL/01-10826/5EY__000003_B946JG,0,0,
Keith Murphy Opticians Ltd,OP_5MQ_14437__000001_CV81HN,OPT,69 Warwick Road,Kenilworth,Warwickshire,,,CV8 1HN,Tel: 01926 853366, - ,,,7 ratings Rate it yourself - /Services/opticians/LeaveReview/DefaultView.aspx?id=OP_5MQ_14437__000001_CV81HN,,,
Vision Express,OP_5MQ_7051__000001_CV81HE,OPT,,28 Warwick Rd,,Kenilworth,Warwickshire,CV8 1HE,Tel: 01926 853331, - ,,,No ratings yet Rate it yourself - /Services/opticians/LeaveReview/DefaultView.aspx?id=OP_5MQ_7051__000001_CV81HE,0,0,
Boots-Kenilworth,5PM-CV8 1JB__000002_CV81JB,OPT,20 Talisman Square,,,Kenilworth,Warwickshire,CV8 1JB,Tel: 01926 856025, - ,,,No ratings yet Rate it yourself - /Services/opticians/LeaveReview/DefaultView.aspx?id=5PM-CV8 1JB__000002_CV81JB,0,0,
Specsavers Opticians,5PM-CV8 1EF__000003_CV81EF,OPT,17 The Square,,Kenilworth,Warwickshire,,CV8 1EF,Tel: 01926 865030, - ,,,2 ratings Rate it yourself - /Services/opticians/LeaveReview/DefaultView.aspx?id=5PM-CV8 1EF__000003_CV81EF,,,
Asda Opticians,OPT_B98 7ER,OPT,,JINNAH ROAD,SMALLWOOD,REDDITCH,,B98 7ER,Tel: 01527 509344, - ,,,No ratings yet Rate it yourself - /Services/opticians/LeaveReview/DefaultView.aspx?id=OPT_B98 7ER,0,0,
Vision Express (UK) Ltd,OP_5MR_9135__000001_B974HA,OPT,7 New Walk,Kingfisher Centre,Redditch,Worcestershire,,B97 4HA,Tel: 01527 69633, - ,,,No ratings yet Rate it yourself - /Services/opticians/LeaveReview/DefaultView.aspx?id=OP_5MR_9135__000001_B974HA,0,0,
Specsavers Opticians,OP_5MR_655__000001_B974YP,OPT,13 New Walk,Kingfisher Centre,Redditch,Worcestershire,,B97 4YP,Tel: 01527 595558, - ,,,No ratings yet Rate it yourself - /Services/opticians/LeaveReview/DefaultView.aspx?id=OP_5MR_655__000001_B974YP,0,0,
Boots-Redditch,OP_5MR_9389__000002_B974EY,OPT,7 Kingfisher Walk,,,Redditch,Worcestershire,B97 4EY,Tel: 01527 63068, - ,,,No ratings yet Rate it yourself - /Services/opticians/LeaveReview/DefaultView.aspx?id=OP_5MR_9389__000002_B974EY,0,0,yes
Peter Bainbridge Opticians,OP_5MR_341__000003_B974EY,OPT,18 Kingfisher Walk,Redditch,Worcestershire,,,B97 4EY,Tel: 01527 64691, - ,,,2 ratings Rate it yourself - /Services/opticians/LeaveReview/DefaultView.aspx?id=OP_5MR_341__000003_B974EY,,,
Specsavers - Redditch Alvechurch,M2Y9H,OPT,,"Sainsburys, Abbey Trading Centre,Alvechurch Highway",,Redditch,,B97 6RF,Tel: 01527 913585, - ,,,No ratings yet Rate it yourself - /Services/opticians/LeaveReview/DefaultView.aspx?id=M2Y9H,0,0,
Janet Porter Opticians,OP_5MQ_3828__000001_CV470EP,OPT,,52 Coventry Street,,Southam,Warwickshire,CV47 0EP,Tel: 01926 813113, - ,,,No ratings yet Rate it yourself - /Services/opticians/LeaveReview/DefaultView.aspx?id=OP_5MQ_3828__000001_CV470EP,0,0,
Alan Tyler Opticians,5QW047,OPT,,11 Arden Buildings,Station Road,Solihull,,B93 8HH,Tel: 01564 772217, - ,,,No ratings yet Rate it yourself - /Services/opticians/LeaveReview/DefaultView.aspx?id=5QW047,0,0,
The Opticians,5KY 20005__000001_GL541AA,OPT,Sheep Street,Sheep Street,Stow On The Wold,Gloucestershire,,GL54 1AA,Tel: 01451 830554, - ,,,1 rating Rate it yourself - /Services/opticians/LeaveReview/DefaultView.aspx?id=5KY 20005__000001_GL541AA,,,
Chipping Norton Opticians,310320170916,OPT,,"Chipping Norton Health Centre, Russell Way",,Chipping Norton,Oxfordshire,OX7 5FA,Tel: 01608 648012, - ,,,12 ratings Rate it yourself - /Services/opticians/LeaveReview/DefaultView.aspx?id=310320170916,,,
Michael Barfield,MICHEALBARFIELD1,OPT,,4 New Street,,Chipping Norton,,OX7 5LJ,Tel: 01608 643772, - ,,,2 ratings Rate it yourself - /Services/opticians/LeaveReview/DefaultView.aspx?id=MICHEALBARFIELD1,,,
Scrivens,5QE_0X75AD__000005_OX75AD,OPT,Scrivens Opticians and   Hearing Care,8 High Street,,Chipping Norton,Oxfordshire,OX7 5AD,Tel: 01608 642 949, - ,,,No ratings yet Rate it yourself - /Services/opticians/LeaveReview/DefaultView.aspx?id=5QE_0X75AD__000005_OX75AD,0,0,
Pershore Eyecare Centre,CO - 5410,OPT,,16 Bridge Street,,Pershore,Worcestershire,WR10 1AT,Tel: 01386 555675, - ,,,No ratings yet Rate it yourself - /Services/opticians/LeaveReview/DefaultView.aspx?id=CO - 5410,0,0,
Peter J Smith,00000061__000002_WR101BG,OPT,14 High Street,,,Pershore,Worcestershire,WR10 1BG,Tel: 01386 553922, - ,,,No ratings yet Rate it yourself - /Services/opticians/LeaveReview/DefaultView.aspx?id=00000061__000002_WR101BG,0,0,
Greys Opticians,OP_5D1_4664__000001_B93ONA,OPT,1642 High Street,Knowle,,Solihull,West Midlands,B93 0NA,Tel: 01564 773466, - ,,,No ratings yet Rate it yourself - /Services/opticians/LeaveReview/DefaultView.aspx?id=OP_5D1_4664__000001_B93ONA,0,0,
Tesco Stores Ltd,OL/CO-1998/TAM__000001_B904EN,OPT,,1505 Stratford Road,Shirley,Solihull,,B90 4EN,Tel: 0121 253 7538, - ,,,No ratings yet Rate it yourself - /Services/opticians/LeaveReview/DefaultView.aspx?id=OL/CO-1998/TAM__000001_B904EN,0,0,
Bannister Opticians Ltd,OP_5D1_8378__000001_B930LE,OPT,,17 St. Johns Way,Knowle,Solihull,,B93 0LE,Tel: 01564 778206, - ,,,3 ratings Rate it yourself - /Services/opticians/LeaveReview/DefaultView.aspx?id=OP_5D1_8378__000001_B930LE,,,
Eye C Healthcare (Domiciliary Only) BY APPOINTMENT ONLY  ,DOM04__000001_B904UZ,OPT,,11 Horton Grove,,Solihull,West Midlands,B90 4UZ,Tel: 07957 652170, - ,,,No ratings yet Rate it yourself - /Services/opticians/LeaveReview/DefaultView.aspx?id=DOM04__000001_B904UZ,0,0,
Walford & Round,OP_5DV_3485__000001_OX165LA,OPT,47 High Street,,,Banbury,,OX16 5LA,Tel: 01295 262501, - ,,,No ratings yet Rate it yourself - /Services/opticians/LeaveReview/DefaultView.aspx?id=OP_5DV_3485__000001_OX165LA,0,0,
Maginnis Opticians (Optometrists) Ltd,OP_5D1_4086__000001_CV77ER,OPT,384 Kenilworth Road,Balsall Common,Coventry,,,CV7 7ER,Tel: 01676 532180, - ,,,1 rating Rate it yourself - /Services/opticians/LeaveReview/DefaultView.aspx?id=OP_5D1_4086__000001_CV77ER,,,
Peepers Opticians,OP_5DV_3830__000001_OX165ER,OPT,,54 High Street,,Banbury,Oxfordshire,OX16 5JJ,Tel: 01295 262219, - ,,,No ratings yet Rate it yourself - /Services/opticians/LeaveReview/DefaultView.aspx?id=OP_5DV_3830__000001_OX165ER,0,0,
Complete Eyecare,SPECSEXPRESS1,OPT,,13 High Street,,Banbury,Oxfordshire,OX16 5EE,Tel: 01295 262200, - ,,,No ratings yet Rate it yourself - /Services/opticians/LeaveReview/DefaultView.aspx?id=SPECSEXPRESS1,0,0,
Vision Express,VISIONEXPRESSBANBURY1,OPT,,"Unit 8,  Castle Centre",,Banbury,,OX16 8UH,Tel: 01295 709006, - ,,,No ratings yet Rate it yourself - /Services/opticians/LeaveReview/DefaultView.aspx?id=VISIONEXPRESSBANBURY1,0,0,
Scrivens inc Melson Wingate,OP_5DT_10799__000001_OX165JJ,OPT,,5 High Street,,Banbury,Oxfordshire,OX16 5DZ,Tel: 01295 262 882, - ,,,No ratings yet Rate it yourself - /Services/opticians/LeaveReview/DefaultView.aspx?id=OP_5DT_10799__000001_OX165JJ,0,0,
Boots-Banbury,BOOTSOPTICIANBANBURY1,OPT,,19 Castle Quay,,Banbury,,OX16 5UH,Tel: 01295 262557, - ,,,No ratings yet Rate it yourself - /Services/opticians/LeaveReview/DefaultView.aspx?id=BOOTSOPTICIANBANBURY1,0,0,
S H Harrold Ltd,OP_5DV_118__000001_OX165JE,OPT,92 High Street,,,Banbury,,OX16 5JE,Tel: 01295 266326, - ,,,No ratings yet Rate it yourself - /Services/opticians/LeaveReview/DefaultView.aspx?id=OP_5DV_118__000001_OX165JE,0,0,
J & D Mason Opticians,5M144__000001_B296AU,OPT,,18 Farmhouse Way,Shirley,Solihull,,B90 4EH,Tel: 0121 705 8139, - ,,,No ratings yet Rate it yourself - /Services/opticians/LeaveReview/DefaultView.aspx?id=5M144__000001_B296AU,0,0,
Specsavers,SPECSAVERSBANBURY1,OPT,,29-31 Bridge Street,,Banbury,,OX16 5PN,Tel: 01295 251251, - ,,,No ratings yet Rate it yourself - /Services/opticians/LeaveReview/DefaultView.aspx?id=SPECSAVERSBANBURY1,0,0,
Horton General Hospital,OP_5DV_3501__000001_OX169AL,OPT,Oxford Road,,Banbury,,,OX16 9AL,Tel: 01295 275500, - ,,,No ratings yet Rate it yourself - /Services/opticians/LeaveReview/DefaultView.aspx?id=OP_5DV_3501__000001_OX169AL,0,0,
Dickens Eye Clinic,DICKENS__000001_B901UB,OPT,39 Main Street,Dickens Heath,Solihull,West Midlands,,B90 1UB,Tel: 0121 744 5544, - ,,,2 ratings Rate it yourself - /Services/opticians/LeaveReview/DefaultView.aspx?id=DICKENS__000001_B901UB,,,
M&S Opticians (Banbury),F7M6Y,OPT,,"M&S, Unit 11 Gateway Retail Park",Banbury,Oxfordshire,,OX16 3ER,Tel: 0129 523 4570, - ,,,No ratings yet Rate it yourself - /Services/opticians/LeaveReview/DefaultView.aspx?id=F7M6Y,0,0,
S W Optics Ltd,5PG183,OPT,,3 Libbards Gate,Solihull,West Midlands,,B91 3XQ,Tel: 0121 704 1429, - ,,,No ratings yet Rate it yourself - /Services/opticians/LeaveReview/DefaultView.aspx?id=5PG183,0,0,
My Optician,OP_5MD_8278__000002_CV47EH,OPT,8 Cannon Park Centre,Lynchgate Road,,Coventry,,CV4 7EH,Tel: 024 7641 6667, - ,,,5 ratings Rate it yourself - /Services/opticians/LeaveReview/DefaultView.aspx?id=OP_5MD_8278__000002_CV47EH,,,
Dray's Eyecare,OLCO30425QE__000002_OX169YJ,OPT,,81 Chatsworth Drive,Cherwell Heights,Banbury,Oxfordshire,OX16 9YJ,Tel: 01295 261080, - ,,,5 ratings Rate it yourself - /Services/opticians/LeaveReview/DefaultView.aspx?id=OLCO30425QE__000002_OX169YJ,,,yes
Eye Tech Optometrists,CV36BP1901,OPT,Eyetech Optometrists,42 Kenpas Highway,,Coventry,,CV3 6BP,Tel: 02476 233 993, - ,,,No ratings yet Rate it yourself - /Services/opticians/LeaveReview/DefaultView.aspx?id=CV36BP1901,0,0,
J & D Mason Opticians ,OP_5PL_9067__000003_B487LA,OPT,23 The Square,"23 The Square,",Birmingham,Alvechurch,,B48 7LA,Tel: 0121 447 8682, - ,,,1 rating Rate it yourself - /Services/opticians/LeaveReview/DefaultView.aspx?id=OP_5PL_9067__000003_B487LA,,,
Pabari Opticians,00000055__000001_B475DX,OPT,Unit2 Drakes Cross Shopping Parade,,Wythall,Worcestershire,,B47 5HD,Tel: 01564 824482, - ,,,1 rating Rate it yourself - /Services/opticians/LeaveReview/DefaultView.aspx?id=00000055__000001_B475DX,,,
Cotswold Eye Care Centre,OP_5KW_6379__000002_GL545LJ,OPT,High Street,,Winchcombe,Gloucestershire,Gloucestershire,GL54 5LJ,Tel: 01242 604654, - ,,,1 rating Rate it yourself - /Services/opticians/LeaveReview/DefaultView.aspx?id=OP_5KW_6379__000002_GL545LJ,,,
Costco Wholesale UK Ltd,CO-1833-5,OPT,,51 Torrington Avenue,,Coventry,,CV4 9AQ,Tel: 02476 854 675, - ,,,No ratings yet Rate it yourself - /Services/opticians/LeaveReview/DefaultView.aspx?id=CO-1833-5,0,0,
Healthcall Optical Services,5EJ_01582__000003_LU48EF,OPT,"Unit 3, Bow Court",Fletchworth Gate,Canley,Coventry,,CV5 6SP,Tel: 0800 198 1132, - ,,,No ratings yet Rate it yourself - /Services/opticians/LeaveReview/DefaultView.aspx?id=5EJ_01582__000003_LU48EF,0,0,
Pike Opticians Ltd,OP_5D1_13856__000001_B903BB,OPT,,452 Stratford Road,Shirley,Solihull,,B90 4AQ,Tel: 0121 744 9093, - ,,,No ratings yet Rate it yourself - /Services/opticians/LeaveReview/DefaultView.aspx?id=OP_5D1_13856__000001_B903BB,0,0,
Sims Opticians,OP_5D1_11728__000002_B903BT,OPT,,1 Union Road,Solihull,Solihull,,B90 3BT,Tel: 0121 744 6036, - ,,,No ratings yet Rate it yourself - /Services/opticians/LeaveReview/DefaultView.aspx?id=OP_5D1_11728__000002_B903BT,0,0,
Homespecs,5QW052,OPT,,383 Stratford Road,Shirley,Birmingham,,B90 3BW,Tel: 0121 733 1232, - ,,,No ratings yet Rate it yourself - /Services/opticians/LeaveReview/DefaultView.aspx?id=5QW052,0,0,
Specsavers Opticians,OP_5D1_3685__000001_B913TA,OPT,,90 High Street,,Solihull,,B91 3TA,Tel: 0121 711 3411, - ,,,No ratings yet Rate it yourself - /Services/opticians/LeaveReview/DefaultView.aspx?id=OP_5D1_3685__000001_B913TA,0,0,
Susan Bowers Opticians,OP_5MD_12273__000002_CV49DU,OPT,349 Tile Hill Lane,Tile Hill,Coventry,Coventry,West Midlands,CV4 9DU,Tel: 02476466661, - ,,,No ratings yet Rate it yourself - /Services/opticians/LeaveReview/DefaultView.aspx?id=OP_5MD_12273__000002_CV49DU,0,0,
Eyesite Eyecare Centres,OP_5MD_9954__000001_CV49PQ,OPT,44 Jardine Crescent,,,Coventry,,CV4 9PQ,Tel: 024 7647 3739, - ,,,No ratings yet Rate it yourself - /Services/opticians/LeaveReview/DefaultView.aspx?id=OP_5MD_9954__000001_CV49PQ,0,0,
Perspective Opticians ,OP_5D1_5333__000001_B913BH,OPT,56 Drury Lane,Mell Square,Solihull,Solihull,,B91 3BH,Tel: 0121 709 1000, - ,,,No ratings yet Rate it yourself - /Services/opticians/LeaveReview/DefaultView.aspx?id=OP_5D1_5333__000001_B913BH,0,0,
Vision Express (UK) Ltd,5QW005,OPT,,Touchwood Shopping Centre,,Solihull,,B91 3QE,Tel: 0121 704 7150, - ,,,No ratings yet Rate it yourself - /Services/opticians/LeaveReview/DefaultView.aspx?id=5QW005,0,0,
Boots-Solihull,OP_5D1_3193__000001_B913AT,OPT,57 Mill Lane,,,Solihull,West Midlands,B91 3AT,Tel: 0121 705 2152, - ,,,No ratings yet Rate it yourself - /Services/opticians/LeaveReview/DefaultView.aspx?id=OP_5D1_3193__000001_B913AT,0,0,
Katie Hattersley Opticians,CV5 6EJ__000002_CV56EJ,OPT,56 Earlsdon Street,,,Coventry,,CV5 6EJ,Tel: 024 76675885, - ,,,No ratings yet Rate it yourself - /Services/opticians/LeaveReview/DefaultView.aspx?id=CV5 6EJ__000002_CV56EJ,0,0,
A B Optics,OP_5D1_13858__000001_B913DA,OPT,,681 Warwick Road,,Solihull,,B91 3DA,Tel: 0121 704 2615, - ,,,5 ratings Rate it yourself - /Services/opticians/LeaveReview/DefaultView.aspx?id=OP_5D1_13858__000001_B913DA,,,
Michael P Harris (Opticians) Ltd,OP_5MD_3452__000002_CV56EP,OPT,25 Earlsdon Street,,,Coventry,,CV5 6EP,Tel: 024 7671 1620, - ,,,No ratings yet Rate it yourself - /Services/opticians/LeaveReview/DefaultView.aspx?id=OP_5MD_3452__000002_CV56EP,0,0,
Clarke Opticians Ltd,OP_5MD_3230__000001_CV35HW,OPT,8 Quinton Parade,,,Coventry,,CV3 5HW,Tel: 024 7650 6300, - ,,,No ratings yet Rate it yourself - /Services/opticians/LeaveReview/DefaultView.aspx?id=OP_5MD_3230__000001_CV35HW,0,0,
Specsavers Opticians,000CV35HD,OPT,,129 Daventry Road,,"Cheylesmore, Coventry",West Midlands,CV3 5HD,Tel: 02476 507950, - ,,,No ratings yet Rate it yourself - /Services/opticians/LeaveReview/DefaultView.aspx?id=000CV35HD,0,0,
Boots-Coventry - Daventry Rd,OP_5MD_7170__000001_CV35HF,OPT,179 Daventry Road,Cheylesmore,Coventry,West Midlands,,CV3 5HF,Tel: 02476 502825, - ,,,2 ratings Rate it yourself - /Services/opticians/LeaveReview/DefaultView.aspx?id=OP_5MD_7170__000001_CV35HF,,,
Specsavers Opticians,TAM01__000004_B903AH,OPT,,207 Stratford Road,Shirley,Solihull,,B90 3AH,Tel: 0121 506 8650, - ,,,No ratings yet Rate it yourself - /Services/opticians/LeaveReview/DefaultView.aspx?id=TAM01__000004_B903AH,0,0,
Community Eyecare trading as Vision Call,OP_B920AJ_20418,OPT,463-465 Warwick Road,"Cleeves House, Hampton Court, 55 Marsh Lane, Hampton-in-Arden",,Solihull,,B92 0AJ,Tel: 01675 446 065, - ,,,No ratings yet Rate it yourself - /Services/opticians/LeaveReview/DefaultView.aspx?id=OP_B920AJ_20418,0,0,
Boots-Birmingham- Shirley,OP_5D1_862__000001_B903AU,OPT,,199 Stratford Road,Shirley,Solihull,,B90 3AU,Tel: 0121 744 1207, - ,,,1 rating Rate it yourself - /Services/opticians/LeaveReview/DefaultView.aspx?id=OP_5D1_862__000001_B903AU,,,
Scrivens Opticians & Hearing Care,13022015_B90 3AU,OPT,,191 Stratford Road,,"Shirley, Solihull",,B90 3AU,, - ,,,No ratings yet Rate it yourself - /Services/opticians/LeaveReview/DefaultView.aspx?id=13022015_B90 3AU,0,0,
Asda Opticians,OPT_B90 3GG,OPT,,STRATFORD ROAD,PARKGATE,SHIRLEY,,B90 3GG,Tel: 0121 296 3736, - ,,,No ratings yet Rate it yourself - /Services/opticians/LeaveReview/DefaultView.aspx?id=OPT_B90 3GG,0,0,