Organisation Name,NACS Code,Organisation Type,Address1,Address2,Address3,Address4,Address5,PostCode,Telephone Number,Opening time,Value  (Opening time),Banding Classification  (Opening time),NHS.UK users rating,Value  (NHS.UK users rating),Banding Classification  (NHS.UK users rating),Car parking (Is there car parking at this organisation?)
Robert J Lynch Opticians ,OP_5HX_8658__000001_W36QS,OPT,10 Market Place,Acton,,London,,W3 6QS,Tel: 020 8992 2440, - ,,,No ratings yet Rate it yourself - /Services/opticians/LeaveReview/DefaultView.aspx?id=OP_5HX_8658__000001_W36QS,0,0,
Eye Emporium Opticians,CO-4997,OPT,,168 Acton High Street,,London,,W3 6QZ,Tel: 02087520410, - ,,,No ratings yet Rate it yourself - /Services/opticians/LeaveReview/DefaultView.aspx?id=CO-4997,0,0,
Acton Specsavers,TP870,OPT,,150 High Street,,Acton,,W3 6QZ,, - ,,,1 rating Rate it yourself - /Services/opticians/LeaveReview/DefaultView.aspx?id=TP870,,,
Homehealth Opticians Ltd,HOMEHEALTHOPTICIANSLTD1,OPT,,"1a Acton Hill Mews, 310-328 Uxbridge Road",,Acton,,W3 9QN,Tel: 0800 783 7409, - ,,,No ratings yet Rate it yourself - /Services/opticians/LeaveReview/DefaultView.aspx?id=HOMEHEALTHOPTICIANSLTD1,0,0,
Acton Eye Centre,OP_5HX_12684__000002_W36QX,OPT,122 High Street,Acton,London,,,W3 6QX,Tel: 020 8993 4654, - ,,,No ratings yet Rate it yourself - /Services/opticians/LeaveReview/DefaultView.aspx?id=OP_5HX_12684__000002_W36QX,0,0,
EYES ON THE COMMON,CO-5352,OPT,EYES ON THE COMMON,"4 Station Parade, Uxbridge Road",Ealing Common,London,Middlesex,W5 3LD,Tel: 020 3538 5977, - ,,,6 ratings Rate it yourself - /Services/opticians/LeaveReview/DefaultView.aspx?id=CO-5352,,,
S L Choi,OP_5HX_13900__000001_W54NJ,OPT,164 Popes Lane,Ealing,London,,,W5 4NJ,Tel: 020 8840 2328, - ,,,No ratings yet Rate it yourself - /Services/opticians/LeaveReview/DefaultView.aspx?id=OP_5HX_13900__000001_W54NJ,0,0,
I See 3 Limited,J2J4T,OPT,,444 Chiswick High Road,,London,,W4 5TT,Tel: 0208 995 0544, - ,,,No ratings yet Rate it yourself - /Services/opticians/LeaveReview/DefaultView.aspx?id=J2J4T,0,0,
Eye Spy Opticians,COOL-32795HX__000003_W37DJ,OPT,1a East Acton Arcade,Old Ok Common Lane,East Acton,London,,W3 7DJ,Tel: 020 8746 9200, - ,,,No ratings yet Rate it yourself - /Services/opticians/LeaveReview/DefaultView.aspx?id=COOL-32795HX__000003_W37DJ,0,0,
Boots-Chiswick - High Rd (in Boots UK),OP_5HY_1030__000003_W45TA,OPT,332 Chiswick High Road,,London,Chiswick,,W4 5TA,Tel: 020 8994 9464, - ,,,1 rating Rate it yourself - /Services/opticians/LeaveReview/DefaultView.aspx?id=OP_5HY_1030__000003_W45TA,,,
Vision Express,OP_5HY_13893__000002_W45TA,OPT,324 Chiswick High Road,Chiswick,London,,,W4 5TA,Tel: 020 8994 6534, - ,,,No ratings yet Rate it yourself - /Services/opticians/LeaveReview/DefaultView.aspx?id=OP_5HY_13893__000002_W45TA,0,0,
Sherman Opticians,OP_5HY_2497__000001_W44PU,OPT,267 Chiswick High Road,Chiswick,London,,,W4 4PU,Tel: 020 8994 5381, - ,,,1 rating Rate it yourself - /Services/opticians/LeaveReview/DefaultView.aspx?id=OP_5HY_2497__000001_W44PU,,,
Boots-Chiswick - High Rd,OP_5HY_5979__000001_W41PB,OPT,298 High Road,,,Chiswick,,W4 1PB,Tel: 0208 994 1070, - ,,,No ratings yet Rate it yourself - /Services/opticians/LeaveReview/DefaultView.aspx?id=OP_5HY_5979__000001_W41PB,0,0,
The Eye Studio Opticians,OP_5HY_7837__000001_W42DW,OPT,229e Chiswick High Road,Chiswick,London,,,W4 2DW,Tel: 020 8742 8536, - ,,,No ratings yet Rate it yourself - /Services/opticians/LeaveReview/DefaultView.aspx?id=OP_5HY_7837__000001_W42DW,0,0,
B J Trylska,OP_5H1_13864__000001_W120NA,OPT,71 Sedgeford Road,Shepherds Bush,London,,,W12 0NA,Tel: 020 8749 0792, - ,,,No ratings yet Rate it yourself - /Services/opticians/LeaveReview/DefaultView.aspx?id=OP_5H1_13864__000001_W120NA,0,0,
David Clulow,OP_5HX_6485__000004_W55JY,OPT,47 Ealing Broadway Centre,The Broadway,Ealing,,,W5 5JY,Tel: 020 8579 7274, - ,,,No ratings yet Rate it yourself - /Services/opticians/LeaveReview/DefaultView.aspx?id=OP_5HX_6485__000004_W55JY,0,0,
Vision Express,OP_5HX_11734__000003_W55JY,OPT,82 Ealing Broadway Centre,The Broadway,Ealing,London,,W5 5JY,Tel: 020 8840 1880, - ,,,No ratings yet Rate it yourself - /Services/opticians/LeaveReview/DefaultView.aspx?id=OP_5HX_11734__000003_W55JY,0,0,
M&S Opticians,,OPT,,69-79 The Broadway,,"Ealing, London",,W5 5JW,Tel: 0208 0169602, - ,,,N/A - Data not available,,,
Dollond & Aitchison,OP_5HX_1875__000003_W55AW,OPT,1a New Broadway,Ealing,London,,,W5 5AW,Tel: 020 8567 1235, - ,,,No ratings yet Rate it yourself - /Services/opticians/LeaveReview/DefaultView.aspx?id=OP_5HX_1875__000003_W55AW,0,0,
Boots-Ealing,OP_5HX_4747__000002_W55AW,OPT,1A New Broadway,,Ealing,London,,W5 5AW,Tel: 0208 567 1235, - ,,,No ratings yet Rate it yourself - /Services/opticians/LeaveReview/DefaultView.aspx?id=OP_5HX_4747__000002_W55AW,0,0,
The Eye Zone,L2D5V,OPT,25 New Broadway,Ealing,London,London,,W5 5AW,Tel: 020 8567 2020, - ,,,No ratings yet Rate it yourself - /Services/opticians/LeaveReview/DefaultView.aspx?id=L2D5V,0,0,
My Specs Direct,555000__000001_NW106LA,OPT,25a Gorst Road,,London,,,NW10 6LA,Tel: 020 8453 1163, - ,,,No ratings yet Rate it yourself - /Services/opticians/LeaveReview/DefaultView.aspx?id=555000__000001_NW106LA,0,0,
Specsavers Opticians,OP_5HX_509__000001_W52XA,OPT,6 New Broadway,Ealing,London,,,W5 2XA,Tel: 020 8840 2977, - ,,,No ratings yet Rate it yourself - /Services/opticians/LeaveReview/DefaultView.aspx?id=OP_5HX_509__000001_W52XA,0,0,
Asda Opticians,OP_5HX_14719__000002_NW107LW,OPT,2-20 Western Road,Park Royal Industrial Estate,,London,,NW10 7LW,Tel: 020 8951 9112, - ,,,No ratings yet Rate it yourself - /Services/opticians/LeaveReview/DefaultView.aspx?id=OP_5HX_14719__000002_NW107LW,0,0,
John  Wexler,OP_5HX_13862__000001_W54QP,OPT,151 South Ealing Road,Ealing,London,,,W5 4QP,Tel: 020 8567 7902, - ,,,No ratings yet Rate it yourself - /Services/opticians/LeaveReview/DefaultView.aspx?id=OP_5HX_13862__000001_W54QP,0,0,
West London Home Eyecare Ltd,GOC-01-13193-01/08-W5 4JB,OPT,,18 Gloucester Road Ealing,,Ealing,Greater London,W5 4JB,Tel: 02085678707, - ,,,No ratings yet Rate it yourself - /Services/opticians/LeaveReview/DefaultView.aspx?id=GOC-01-13193-01/08-W5 4JB,0,0,
Opticall Limited,OP_W52QP_46953,OPT,,7 Acantha Court,15A Montpelier Road,Ealing,,W5 2QP,Tel: 0208 9984228, - ,,,No ratings yet Rate it yourself - /Services/opticians/LeaveReview/DefaultView.aspx?id=OP_W52QP_46953,0,0,
K H Kennell,OP_5HX_13899__000001_NW107HR,OPT,8 Norbreck Parade,,London,,,NW10 7HR,Tel: 020 8997 7170, - ,,,No ratings yet Rate it yourself - /Services/opticians/LeaveReview/DefaultView.aspx?id=OP_5HX_13899__000001_NW107HR,0,0,
Hynes Opticians,OP_5HX_12797__000001_W139RT,OPT,120 Northfield Avenue,Ealing,,london,,W13 9RT,Tel: 020 8579 3241, - ,,,2 ratings Rate it yourself - /Services/opticians/LeaveReview/DefaultView.aspx?id=OP_5HX_12797__000001_W139RT,,,
B A Williams Chemists & Opticians,OP_5HY_13897__000002_TW80JW,OPT,14-15 Albany Parade,High Street,Brentford,,,TW8 0JW,Tel: 020 8560 3834, - ,,,No ratings yet Rate it yourself - /Services/opticians/LeaveReview/DefaultView.aspx?id=OP_5HY_13897__000002_TW80JW,0,0,
Lynch Opticians,OP_5H1_805__000001_W127JA,OPT,264 Uxbridge Road,Shepherds Bush,London,,,W12 7JA,Tel: 020 8743 4034, - ,,,No ratings yet Rate it yourself - /Services/opticians/LeaveReview/DefaultView.aspx?id=OP_5H1_805__000001_W127JA,0,0,
Keena Rakkado,OP_5HX_1621__000002_W130SR,OPT,18 The Broadway,West Ealing,,London,Greater London,W13 0SR,Tel: 020 8567 2320, - ,,,2 ratings Rate it yourself - /Services/opticians/LeaveReview/DefaultView.aspx?id=OP_5HX_1621__000002_W130SR,,,
Keena Rakkado,OP_SL39EA_34404,OPT,,18 The Broadway,,West Ealing,,W13 0SR,Tel: 0208 567 2320, - ,,,No ratings yet Rate it yourself - /Services/opticians/LeaveReview/DefaultView.aspx?id=OP_SL39EA_34404,0,0,
Vision Care for Homeless People,TP6ER,OPT,,The Broadway Centre,,London,,W12 8EZ,Tel: 020 8735 5810, - ,,,No ratings yet Rate it yourself - /Services/opticians/LeaveReview/DefaultView.aspx?id=TP6ER,0,0,
Eye Kew,OPT_TW93QB_1,OPT,,7 Station Approach,Kew,Surrey,,TW9 3QB,Tel: 020 8948 0803, - ,,,No ratings yet Rate it yourself - /Services/opticians/LeaveReview/DefaultView.aspx?id=OPT_TW93QB_1,0,0,
Specsavers Opticians,OP_5HX_3353__000001_W139BP,OPT,81 The Broadway,West Ealing,London,,,W13 9BP,Tel: 020 8840 8744, - ,,,No ratings yet Rate it yourself - /Services/opticians/LeaveReview/DefaultView.aspx?id=OP_5HX_3353__000001_W139BP,0,0,
Shepherds Bush Eye Centre,OP_5H1_12685__000001_W128AA,OPT,166 Uxbridge Road,Shepherds Bush,,London,,W12 8AA,Tel: 020 8740 7100, - ,,,No ratings yet Rate it yourself - /Services/opticians/LeaveReview/DefaultView.aspx?id=OP_5H1_12685__000001_W128AA,0,0,
Vision Direct Opticians,OP_5K5_1673__000001_NW108TS,OPT,6 Acton Lane,Harlesden,London,,,NW10 8TS,Tel: 020 8965 6707, - ,,,No ratings yet Rate it yourself - /Services/opticians/LeaveReview/DefaultView.aspx?id=OP_5K5_1673__000001_NW108TS,0,0,
Optical Express,W12 7GF_22222,OPT,"Unit 2121, Westfield London Shopping Centre",Ariel Way,,London,,W12 7GF,Tel: 0800 023 2020, - ,,,5 ratings Rate it yourself - /Services/opticians/LeaveReview/DefaultView.aspx?id=W12 7GF_22222,,,
Boots-London - White City,W12 7GB_19187,OPT,,White City Shopping Centre,Ariel Way,London,,W12 7GB,Tel: 0208 7438432, - ,,,No ratings yet Rate it yourself - /Services/opticians/LeaveReview/DefaultView.aspx?id=W12 7GB_19187,0,0,
Mr S Stewart Duncan,OP_5HY_4818__000002_TW88AH,OPT,213 High Street,Brentford,Middlesex,,,TW8 8AH,Tel: 020 8568 4139, - ,,,No ratings yet Rate it yourself - /Services/opticians/LeaveReview/DefaultView.aspx?id=OP_5HY_4818__000002_TW88AH,0,0,
Boots Opticians Ltd,OP_5H1_9655__000002_W60PZ,OPT,Unit 6 Kings Mall,King Street,Hammersmith,,,W6 0PZ,Tel: 020 8748 4453, - ,,,No ratings yet Rate it yourself - /Services/opticians/LeaveReview/DefaultView.aspx?id=OP_5H1_9655__000002_W60PZ,0,0,
Specsavers Opticians,OP_5H1_5763__000002_W60QB,OPT,29 Kings Mall,King Street,Hammersmith,,,W6 0PZ,Tel: 020 8748 3233, - ,,,No ratings yet Rate it yourself - /Services/opticians/LeaveReview/DefaultView.aspx?id=OP_5H1_5763__000002_W60QB,0,0,
Specsavers Opticians (Harlesden Visionplus),5K5_NW10 4LT,OPT,,"Bank Buildings, Unit 8, High Street ",,Harlesden,,NW10 4LT,, - ,,,No ratings yet Rate it yourself - /Services/opticians/LeaveReview/DefaultView.aspx?id=5K5_NW10 4LT,0,0,
Eyecloud Opticians,OP_5K5_6725__000002_NW104NS,OPT,75 High Street,Harlesden,,London,,NW10 4NS,Tel: 020 8961 0077, - ,,,1 rating Rate it yourself - /Services/opticians/LeaveReview/DefaultView.aspx?id=OP_5K5_6725__000002_NW104NS,,,
Specsavers Opticians,OP_5H1_8637__000002_W128LR,OPT,106 Uxbridge Road,Shepherds Bush,London,,,W12 8LR,Tel: 020 8735 5890, - ,,,No ratings yet Rate it yourself - /Services/opticians/LeaveReview/DefaultView.aspx?id=OP_5H1_8637__000002_W128LR,0,0,
Boots-Hammersmith - King St,OP_5H1_34__000001_W69HR,OPT,1-15 King Street,,Hammersmith,London,,W6 9HR,Tel: 0208 741 7061, - ,,,1 rating Rate it yourself - /Services/opticians/LeaveReview/DefaultView.aspx?id=OP_5H1_34__000001_W69HR,,,
Classic Eyes Brentford,OLCO-29195HY__000001_TW88JZ,OPT,Unit 7 Brentford Lock,159-188 High Street,Brentford,Middlesex,,TW8 8AQ,Tel: 020 8568 7778, - ,,,No ratings yet Rate it yourself - /Services/opticians/LeaveReview/DefaultView.aspx?id=OLCO-29195HY__000001_TW88JZ,0,0,
David Clulow,OP_5H1_310__000002_W69YD,OPT,Unit 2 Broadway Shopping Centre,Hammersmith Broadway,London,,,W6 9YD,Tel: 020 8741 2468, - ,,,No ratings yet Rate it yourself - /Services/opticians/LeaveReview/DefaultView.aspx?id=OP_5H1_310__000002_W69YD,0,0,
Barnes Nineteen,TP8YQ,OPT,,19 Barnes High Street,,London,,SW13 9LW,Tel: 020 3490 8560, - ,,,2 ratings Rate it yourself - /Services/opticians/LeaveReview/DefaultView.aspx?id=TP8YQ,,,no
Hanwell Eyecare Centre,OP_5HX_14066__000002_W71DR,OPT,20 Church Road,Hanwell,London,,,W7 1DR,Tel: 020 8840 8595, - ,,,No ratings yet Rate it yourself - /Services/opticians/LeaveReview/DefaultView.aspx?id=OP_5HX_14066__000002_W71DR,0,0,
Focal Point Opticians,OPT_SW130DQ_1,OPT,,70 Church Road,Barnes,London,,SW13 0DQ,Tel: 020 8748 1666, - ,,,No ratings yet Rate it yourself - /Services/opticians/LeaveReview/DefaultView.aspx?id=OPT_SW130DQ_1,0,0,
Lauder and Rees Ophthalmic Opticians ,OLCO-18405H1__000004_W68RF,OPT,Charing Cross Hospital,Fulham Palace Road,,Hammersmith,,W6 8RF,Tel: 020 8741 1570, - ,,,No ratings yet Rate it yourself - /Services/opticians/LeaveReview/DefaultView.aspx?id=OLCO-18405H1__000004_W68RF,0,0,
Vision Eyecare,OP_5HX_14390__000002_UB67BN,OPT,94 Bilton Road,Perivale,Greenford,,,UB6 7BN,Tel: 020 8998 2121, - ,,,4 ratings Rate it yourself - /Services/opticians/LeaveReview/DefaultView.aspx?id=OP_5HX_14390__000002_UB67BN,,,
L C Hall,OP_5H1_2487__000002_W69PA,OPT,202 Fulham Palace Road,Hammersmith,London,,,W6 9PA,Tel: 020 7385 4821, - ,,,2 ratings Rate it yourself - /Services/opticians/LeaveReview/DefaultView.aspx?id=OP_5H1_2487__000002_W69PA,,,
Kensington Eye Centre,OP_5LA_11475__000001_W105NB,OPT,154 Ladbroke Grove,,London,,,W10 5NB,Tel: 020 8969 4326, - ,,,No ratings yet Rate it yourself - /Services/opticians/LeaveReview/DefaultView.aspx?id=OP_5LA_11475__000001_W105NB,0,0,
Tesco Opticians,OLCO-19985HY__000002_TW75NZ,OPT,Osterley Park,Syon Lane,Isleworth,Middlesex,,TW7 5NZ,Tel: 0345 6013479, - ,,,No ratings yet Rate it yourself - /Services/opticians/LeaveReview/DefaultView.aspx?id=OLCO-19985HY__000002_TW75NZ,0,0,
Ashdown & Collins,OP_5K5_14713__000001_NW103JP,OPT,118 Chamberlayne Road,Kensal Rise,London,,,NW10 3JP,Tel: 020 8969 0881, - ,,,No ratings yet Rate it yourself - /Services/opticians/LeaveReview/DefaultView.aspx?id=OP_5K5_14713__000001_NW103JP,0,0,
Kensal Eyes Opticians,OP_5K5_4919__000001_NW103NR,OPT,1 Bridge House,Chamberlayne Road,London,,,NW10 3NR,Tel: 020 8969 4109, - ,,,No ratings yet Rate it yourself - /Services/opticians/LeaveReview/DefaultView.aspx?id=OP_5K5_4919__000001_NW103NR,0,0,
Blink Optics,TP8HE,OPT,,327 Upper Richmond Road West,,London,,SW14 8QR,Tel: 02033271510, - ,,,3 ratings Rate it yourself - /Services/opticians/LeaveReview/DefaultView.aspx?id=TP8HE,,,
Tolley & Partners,OP_5M6_3307__000002_SW147NX,OPT,399 Upper Richmond Road West,East Sheen,,London,,SW14 7NX,Tel: 0208 878 3415, - ,,,No ratings yet Rate it yourself - /Services/opticians/LeaveReview/DefaultView.aspx?id=OP_5M6_3307__000002_SW147NX,0,0,
Kensington Heights Opticians,OP_5LA_2004__000002_W105PF,OPT,22 Golborne Road,,London,,,W10 5PF,Tel: 020 8964 1080, - ,,,No ratings yet Rate it yourself - /Services/opticians/LeaveReview/DefaultView.aspx?id=OP_5LA_2004__000002_W105PF,0,0,
Specsavers Opticians (Wembley Visionplus Ltd T/A),OP_5K5_1786__000002_HA97BH,OPT,476 High Road,Wembley,Middlesex,,,HA9 7AS,Tel: 020 8900 1433, - ,,,2 ratings Rate it yourself - /Services/opticians/LeaveReview/DefaultView.aspx?id=OP_5K5_1786__000002_HA97BH,,,
Eyecraft Optometrist Ltd,OP_5K5_213__000001_HA04TL,OPT,26 Ealing Road,,Wembley,,,HA0 4TL,Tel: 020 8902 9908, - ,,,No ratings yet Rate it yourself - /Services/opticians/LeaveReview/DefaultView.aspx?id=OP_5K5_213__000001_HA04TL,0,0,
Realeyes The Eye Clinic,01-1853,OPT,,"Unit 7, Wembley Central Square",,Wembley,,HA9 7AJ,Tel: 020 3909 9181, - ,,,No ratings yet Rate it yourself - /Services/opticians/LeaveReview/DefaultView.aspx?id=01-1853,0,0,
Eye Emporium Ltd,OP_5K5_3180__000002_NW102PB,OPT,184 High Road,Willesden,London,,,NW10 2PB,Tel: 020 8459 7689, - ,,,No ratings yet Rate it yourself - /Services/opticians/LeaveReview/DefaultView.aspx?id=OP_5K5_3180__000002_NW102PB,0,0,
Boots-Wembley,OP_5K5_3809__000001_HA97AG,OPT,449 High Road,,,Wembley,Middlesex,HA9 7AF,Tel: 0208 9022721, - ,,,1 rating Rate it yourself - /Services/opticians/LeaveReview/DefaultView.aspx?id=OP_5K5_3809__000001_HA97AG,,,
Realeyes - The Eye Clinic,OPT_W93QH_1,OPT,Realeyes - The Eye Clinic,568 Harrow Road,,London,,W9 3QH,Tel: 020 3897 0200, - ,,,No ratings yet Rate it yourself - /Services/opticians/LeaveReview/DefaultView.aspx?id=OPT_W93QH_1,0,0,
Chatoo & Co Ltd,OP_5LA_1228__000002_W86ND,OPT,258 Kensington High Street,,London,,,W8 6ND,Tel: 020 7602 3065, - ,,,1 rating Rate it yourself - /Services/opticians/LeaveReview/DefaultView.aspx?id=OP_5LA_1228__000002_W86ND,,,
Paul Simon Opticians,OP_5K5_5997__000001_HA96AA,OPT,383 High Road,,Wembley,,,HA9 6AA,Tel: 020 8902 0271, - ,,,No ratings yet Rate it yourself - /Services/opticians/LeaveReview/DefaultView.aspx?id=OP_5K5_5997__000001_HA96AA,0,0,
Ronald Brown Opticians,OP_5LC_7422__000001_W93NF,OPT,393 Harrow Road,,London,,,W9 3NF,Tel: 020 8969 2564, - ,,,No ratings yet Rate it yourself - /Services/opticians/LeaveReview/DefaultView.aspx?id=OP_5LC_7422__000001_W93NF,0,0,
David Clulow Opticians,2035LA__000002_W112AB,OPT,38 Ledbury Road,Notting Hill,London,,,W11 2AB,Tel: 020 7243 6877, - ,,,No ratings yet Rate it yourself - /Services/opticians/LeaveReview/DefaultView.aspx?id=2035LA__000002_W112AB,0,0,
Betterspecs Wembley Ltd,OP_5K5_14718__000001_HA97AY,OPT,475 - 477 High Road,Wembley,Middlesex,,,HA9 7AY,Tel: 020 8900 0677, - ,,,No ratings yet Rate it yourself - /Services/opticians/LeaveReview/DefaultView.aspx?id=OP_5K5_14718__000001_HA97AY,0,0,
TESCO OPTICIANS,5K5/ 3036__000002_NW100TL,OPT,TESCO WEMBLEY BRENT PARK,GREAT CENTRAL WAY,,LONDON,,NW10 0TL,Tel: 0345 601 3479, - ,,,No ratings yet Rate it yourself - /Services/opticians/LeaveReview/DefaultView.aspx?id=5K5/ 3036__000002_NW100TL,0,0,
Specs Of Kensington,-645LA__000001_W86EJ,OPT,36 Earls Court Road,,,London,,W8 6EJ,Tel: 020 7938 1251, - ,,,No ratings yet Rate it yourself - /Services/opticians/LeaveReview/DefaultView.aspx?id=-645LA__000001_W86EJ,0,0,
Eye Emporium Ltd T/A Open Eye Opticians,OP_5K5_14720__000001_NW102PU,OPT,64 High Road,Willesden,London,,,NW10 2PU,Tel: 020 8830 2727, - ,,,No ratings yet Rate it yourself - /Services/opticians/LeaveReview/DefaultView.aspx?id=OP_5K5_14720__000001_NW102PU,0,0,
SPECSAVERS,TW9 1DJ__000001_TW91DJ,OPT,3 Quadrant House,The Quadrant,,Richmond,,TW9 1DJ,Tel: 0208 439 9330, - ,,,No ratings yet Rate it yourself - /Services/opticians/LeaveReview/DefaultView.aspx?id=TW9 1DJ__000001_TW91DJ,0,0,
David Faulder Opticians,OP_5LA_12254__000001_W87RG,OPT,218 Kensington High Street,,London,,,W8 7RG,Tel: 020 7937 8790, - ,,,1 rating Rate it yourself - /Services/opticians/LeaveReview/DefaultView.aspx?id=OP_5LA_12254__000001_W87RG,,,
Dollond & Aitchison,OP_5LA_13371__000001_W113HT,OPT,70 Notting Hill Gate,,London,,,W11 3HT,Tel: 020 7229 2681, - ,,,No ratings yet Rate it yourself - /Services/opticians/LeaveReview/DefaultView.aspx?id=OP_5LA_13371__000001_W113HT,0,0,
Vision Express ,OP_5M6_6901__000002_TW91HE,OPT,,10 The Quadrant,,Richmond,,TW9 1BP,Tel: 020 8948 6149, - ,,,No ratings yet Rate it yourself - /Services/opticians/LeaveReview/DefaultView.aspx?id=OP_5M6_6901__000002_TW91HE,0,0,
K J Popat,OP_5K5_4272__000001_NW102TE,OPT,11 High Road,Willesden,London,,,NW10 2TE,Tel: 020 8451 0754, - ,,,No ratings yet Rate it yourself - /Services/opticians/LeaveReview/DefaultView.aspx?id=OP_5K5_4272__000001_NW102TE,0,0,
Costco Wholesale UK Limited,O7A7A,OPT,,30 Second Way,,Wembley,,HA9 0YJ,, - ,,,No ratings yet Rate it yourself - /Services/opticians/LeaveReview/DefaultView.aspx?id=O7A7A,0,0,
Costco Wholesale UK Limited,O7A7A,OPT,,30 Second Way,,Wembley,,HA9 0YJ,, - ,,,No ratings yet Rate it yourself - /Services/opticians/LeaveReview/DefaultView.aspx?id=O7A7A,0,0,
RICHMOND EYE CENTRE ,OP_5M6_2157__000001_TW91HP,OPT,,18 Duke Street,,Richmond,,TW9 1HP,Tel: 0208 948 8882, - ,,,No ratings yet Rate it yourself - /Services/opticians/LeaveReview/DefaultView.aspx?id=OP_5M6_2157__000001_TW91HP,0,0,
Notting Hill Gate Opticians,W113JE_11111,OPT,Notting Hill Gate Opticians,18 Notting Hill Gate,,London,,W11 3JE,Tel: 020 7243 6219, - ,,,6 ratings Rate it yourself - /Services/opticians/LeaveReview/DefaultView.aspx?id=W113JE_11111,,,
Vision Express,OLC018815LA__000002_W86SU,OPT,,159 High Street,Kensington,London,,W8 6SU,Tel: 0207 937 9911, - ,,,No ratings yet Rate it yourself - /Services/opticians/LeaveReview/DefaultView.aspx?id=OLC018815LA__000002_W86SU,0,0,
Sidfiz Optic,OPT_NW66NN_2,OPT,,46 Salusbury Road,,London,,NW6 6NN,, - ,,,No ratings yet Rate it yourself - /Services/opticians/LeaveReview/DefaultView.aspx?id=OPT_NW66NN_2,0,0,
Sidfiz Optic,OPT_NW66NN_1,OPT,,46 Salusbury Road,,London,,NW6 6NN,, - ,,,No ratings yet Rate it yourself - /Services/opticians/LeaveReview/DefaultView.aspx?id=OPT_NW66NN_1,0,0,
Sidfiz Optique,04BR,OPT,Sid Fiz Optique,46 Salusbury Road,,London,,NW6 6NN,Tel: 02076256694, - ,,,No ratings yet Rate it yourself - /Services/opticians/LeaveReview/DefaultView.aspx?id=04BR,0,0,
Ten The Green,OPT_TW91PX_1,OPT,,10 The Green,,Richmond,,TW9 1PX,Tel: 0208 940 0010, - ,,,No ratings yet Rate it yourself - /Services/opticians/LeaveReview/DefaultView.aspx?id=OPT_TW91PX_1,0,0,
Zdenek-Walker,OP_5M6_13287__000001_TW91PX,OPT,10 The Green,Richmond,,Surrey,,TW9 1PX,Tel: 0208 940 0010, - ,,,No ratings yet Rate it yourself - /Services/opticians/LeaveReview/DefaultView.aspx?id=OP_5M6_13287__000001_TW91PX,0,0,
Boots-Kensington - High St (in Boots UK),OP_5LA_1716__000002_W85SF,OPT,127a Kensington High Street,,Kensington,London,,W8 5SF,Tel: 020 7937 0298, - ,,,2 ratings Rate it yourself - /Services/opticians/LeaveReview/DefaultView.aspx?id=OP_5LA_1716__000002_W85SF,,,
Kensington Eye Centre Ltd,OP_5LA_9809__000001_W84LL,OPT,37 Kensington Church Street,London,W8 4LL,www.kensingtoneyecentre.com,,W8 4LL,Tel: 020 7937 8282, - ,,,No ratings yet Rate it yourself - /Services/opticians/LeaveReview/DefaultView.aspx?id=OP_5LA_9809__000001_W84LL,0,0,
Bromptons Opticians,OP_5LA_4837__000002_W87RG,OPT,,84 Kensington High Street,,London,,W8 4SG,Tel: 020 7937 5500, - ,,,No ratings yet Rate it yourself - /Services/opticians/LeaveReview/DefaultView.aspx?id=OP_5LA_4837__000002_W87RG,0,0,
David Clulow Opticians,OP_5LA_584__000001_W84SG,OPT,82 Kensington High Street,Kensington,London,,,W8 4SG,Tel: 020 7937 1984, - ,,,7 ratings Rate it yourself - /Services/opticians/LeaveReview/DefaultView.aspx?id=OP_5LA_584__000001_W84SG,,,
Specsavers Opticians,OP_5H1_13865__000002_SW61NP,OPT,387 North End Road,Fulham,,London,,SW6 1NP,Tel: 020 7471 0390, - ,,,4 ratings Rate it yourself - /Services/opticians/LeaveReview/DefaultView.aspx?id=OP_5H1_13865__000002_SW61NP,,,
Boots-Richmond - George St,TW9 1HE_99812,OPT,,60 George Street,,Richmond,Surrey,TW9 1HE,Tel: 0208 940 5166, - ,,,1 rating Rate it yourself - /Services/opticians/LeaveReview/DefaultView.aspx?id=TW9 1HE_99812,,,
Boots-Richmond - Red Lion St,TW9 1RW_83731,OPT,,22 Red Lion Street,,Richmond,Surrey,TW9 1RW,Tel: 0208 940 2218, - ,,,No ratings yet Rate it yourself - /Services/opticians/LeaveReview/DefaultView.aspx?id=TW9 1RW_83731,0,0,
Osterley Opticians,00015HY__000001_TW74QE,OPT,156 Thornbury Road,Osterley Village,Osterley,Isleworth,,TW7 4QE,Tel: 0208 5606098, - ,,,1 rating Rate it yourself - /Services/opticians/LeaveReview/DefaultView.aspx?id=00015HY__000001_TW74QE,,,
David Clulow,TW9 1JT__000001_TW91JT,OPT,,5 George Street,,Richmond,Middlesex,TW9 1JT,Tel: 0208 332 0345, - ,,,No ratings yet Rate it yourself - /Services/opticians/LeaveReview/DefaultView.aspx?id=TW9 1JT__000001_TW91JT,0,0,
Specsavers Opticians,OP_5HX_14720__000001_UB69PU,OPT,20 The Broadway,Greenford,Middlesex,,,UB6 9PU,Tel: 020 8832 8940, - ,,,No ratings yet Rate it yourself - /Services/opticians/LeaveReview/DefaultView.aspx?id=OP_5HX_14720__000001_UB69PU,0,0,
Norman Hart Opticians,OP_5K5_13098__000002_NW100AA,OPT,6 Neasden Parade,250 Neasden Lane,London,,,NW10 0AA,Tel: 020 8450 8153, - ,,,2 ratings Rate it yourself - /Services/opticians/LeaveReview/DefaultView.aspx?id=OP_5K5_13098__000002_NW100AA,,,
Boots-Greenford,UB6 0UW_19217,OPT,,1000 Greenford Road,,Greenford,Middlesex,UB6 0UW,Tel: 0208 575 2152, - ,,,No ratings yet Rate it yourself - /Services/opticians/LeaveReview/DefaultView.aspx?id=UB6 0UW_19217,0,0,