Organisation Name,NACS Code,Organisation Type,Address1,Address2,Address3,Address4,Address5,PostCode,Telephone Number,Information supplied by,Value  (Information supplied by),Banding Classification  (Information supplied by)
D P Mark Chemist,,GDOS,4 Grand Parade,Harringay,,,,N4 1JX,Tel: 020 8800 1638,"To collect your free vitamins, you’ll have to show your NHS Healthy Start card.Ask your midwife or health visitor if you need any further advice or visit www.healthystart.nhs.uk/getting-vitamins/",,
The Ladder Childrens Centre,,GDOS,Pemberton Road,London,,,,N4 1BA,Tel: 020 8372 5008,"To collect your free vitamins, you’ll have to show your NHS Healthy Start card.Ask your midwife or health visitor if you need any further advice or visit www.healthystart.nhs.uk/getting-vitamins/",,
Woodlands Park Childrens Centre *,,GDOS,Woodlands Park Road,London,,,,N15 3SD,Tel: 020 8802 0041,"To collect your free vitamins, you’ll have to show your NHS Healthy Start card.Ask your midwife or health visitor if you need any further advice or visit www.healthystart.nhs.uk/getting-vitamins/",,
South Grove Childrens Centre,,GDOS,"South Grove, Tottenham",London,,,,N15 5QE,Tel: 020 8802 7520,"To collect your free vitamins, you’ll have to show your NHS Healthy Start card.Ask your midwife or health visitor if you need any further advice or visit www.healthystart.nhs.uk/getting-vitamins/",,
Safedale Pharmacy,,GDOS,491-493 Seven Sisters Road,Tottenham,,,,N15 6EP,Tel: 020 8800 4876,"To collect your free vitamins, you’ll have to show your NHS Healthy Start card.Ask your midwife or health visitor if you need any further advice or visit www.healthystart.nhs.uk/getting-vitamins/",,
Triangle Children Young People Community Centre,,GDOS,91 - 93 St Ann'S Road,London,,,,N15 6NU,Tel: 020 8802 8782,"To collect your free vitamins, you’ll have to show your NHS Healthy Start card.Ask your midwife or health visitor if you need any further advice or visit www.healthystart.nhs.uk/getting-vitamins/",,
Rowlands Pharmacy,,GDOS,"5 Marlborough Parade, 280 Green Lanes",Hackney,London,,,N4 2NH,Tel: 020 8800 8801,"To collect your free vitamins, you’ll have to show your NHS Healthy Start card.Ask your midwife or health visitor if you need any further advice or visit www.healthystart.nhs.uk/getting-vitamins/",,
Rokesly Childrens Centre,,GDOS,Hermiston Avenue,London,,,,N8 8NH,Tel: 020 8340 7687,"To collect your free vitamins, you’ll have to show your NHS Healthy Start card.Ask your midwife or health visitor if you need any further advice or visit www.healthystart.nhs.uk/getting-vitamins/",,
Woodberry Down Children'S Centre,,GDOS,Spring Park Drive,London,,,,N4 2NP,Tel: 020 8815 3270,"To collect your free vitamins, you’ll have to show your NHS Healthy Start card.Ask your midwife or health visitor if you need any further advice or visit www.healthystart.nhs.uk/getting-vitamins/",,
The Cadge Pharmacy,,GDOS,105 Phillip Lane,Tottenham,,,,N15 4JR,Tel: 020 8808 2740,"To collect your free vitamins, you’ll have to show your NHS Healthy Start card.Ask your midwife or health visitor if you need any further advice or visit www.healthystart.nhs.uk/getting-vitamins/",,
Boots The Chemist,,GDOS,137-139 High Road,London,,,,N22 6BA,Tel: 0208 881 0101,"To collect your free vitamins, you’ll have to show your NHS Healthy Start card.Ask your midwife or health visitor if you need any further advice or visit www.healthystart.nhs.uk/getting-vitamins/",,
Santas Pharmacy,,GDOS,182 Stroud Green Road,London,,,,N4 3RN,Tel: 0207 272 1591,"To collect your free vitamins, you’ll have to show your NHS Healthy Start card.Ask your midwife or health visitor if you need any further advice or visit www.healthystart.nhs.uk/getting-vitamins/",,
Petter Pharmacy,,GDOS,49-51 The Broadway,Crouch End,,,,N8 8DT,Tel: 0208 340 4772,"To collect your free vitamins, you’ll have to show your NHS Healthy Start card.Ask your midwife or health visitor if you need any further advice or visit www.healthystart.nhs.uk/getting-vitamins/",,
Noel Park Childrens Centre,,GDOS,"Shropshire Hall, Gladstone Avenue",London,,,,N22 6LD,Tel: 020 8826 9280,"To collect your free vitamins, you’ll have to show your NHS Healthy Start card.Ask your midwife or health visitor if you need any further advice or visit www.healthystart.nhs.uk/getting-vitamins/",,
Dunsmure Pharmacy,,GDOS,"90 Dunsmure Road, N16 5Jy",Hackney,London,,,N16 5JY,Tel: 020 8802 7007,"To collect your free vitamins, you’ll have to show your NHS Healthy Start card.Ask your midwife or health visitor if you need any further advice or visit www.healthystart.nhs.uk/getting-vitamins/",,
Campsbourne Childrens Centre,,GDOS,Nightingale Lane,London,,,,N8 7AF,Tel: 020 8347 0478,"To collect your free vitamins, you’ll have to show your NHS Healthy Start card.Ask your midwife or health visitor if you need any further advice or visit www.healthystart.nhs.uk/getting-vitamins/",,
Park Chemist,,GDOS,286 Seven Sisters Road,Hackney,London,,,N4 2AA,Tel: 020 8800 0786,"To collect your free vitamins, you’ll have to show your NHS Healthy Start card.Ask your midwife or health visitor if you need any further advice or visit www.healthystart.nhs.uk/getting-vitamins/",,
Lubavitch Children'S Centre,,GDOS,1 Northfield Road,London,,,,N16 5RL,Tel: 0208 809 9050 ,"To collect your free vitamins, you’ll have to show your NHS Healthy Start card.Ask your midwife or health visitor if you need any further advice or visit www.healthystart.nhs.uk/getting-vitamins/",,
Pharmacy Express,,GDOS,214 High Road,Wood Green,,,,N22 8HH,Tel: 0208 881 1669,"To collect your free vitamins, you’ll have to show your NHS Healthy Start card.Ask your midwife or health visitor if you need any further advice or visit www.healthystart.nhs.uk/getting-vitamins/",,
Tesco Pharmacy,,GDOS,230 High Road,South Tottenham,,,,N15 4AJ,Tel: 01992806466,"To collect your free vitamins, you’ll have to show your NHS Healthy Start card.Ask your midwife or health visitor if you need any further advice or visit www.healthystart.nhs.uk/getting-vitamins/",,
North Islington Nursery School And Children'S Centre,,GDOS,110-112 Tollington Park,Finsbury Park,London,,,N4 3RB,Tel: 020 7527 4844,"To collect your free vitamins, you’ll have to show your NHS Healthy Start card.Ask your midwife or health visitor if you need any further advice or visit www.healthystart.nhs.uk/getting-vitamins/",,
Armstrong Pharmacy,,GDOS,279 Green Lanes,Hackney,London,,,N4 2EX,Tel: 020 8800 4546,"To collect your free vitamins, you’ll have to show your NHS Healthy Start card.Ask your midwife or health visitor if you need any further advice or visit www.healthystart.nhs.uk/getting-vitamins/",,
Land Chemist,,GDOS,"272 Stamford Hill, N16 6Ty",Hackney,London,,,N16 6TY,Tel: 020 8800 2931,"To collect your free vitamins, you’ll have to show your NHS Healthy Start card.Ask your midwife or health visitor if you need any further advice or visit www.healthystart.nhs.uk/getting-vitamins/",,
Broadwater Farm Childrens Centre *,,GDOS,Adams Road,London,,,,N17 6HE,Tel: 020 8885 8800,"To collect your free vitamins, you’ll have to show your NHS Healthy Start card.Ask your midwife or health visitor if you need any further advice or visit www.healthystart.nhs.uk/getting-vitamins/",,
Boots The Chemists Ltd,,GDOS,222-224 Stamford Hill,Hackney,London,,,N16 6TT,Tel: 020 8986 9014,"To collect your free vitamins, you’ll have to show your NHS Healthy Start card.Ask your midwife or health visitor if you need any further advice or visit www.healthystart.nhs.uk/getting-vitamins/",,
Abc - Day Lewis Pharmacy,,GDOS,170-172 Stamford Road,,London,,,N16 6QX,Tel: 020 8800 6166,"To collect your free vitamins, you’ll have to show your NHS Healthy Start card.Ask your midwife or health visitor if you need any further advice or visit www.healthystart.nhs.uk/getting-vitamins/",,
Hornsey Rise Health Centre (The Rise Group Practice),,GDOS,Hornsey Rise,Islington,London,,,N19 3YU,Tel: 020 7561 3420,"To collect your free vitamins, you’ll have to show your NHS Healthy Start card.Ask your midwife or health visitor if you need any further advice or visit www.healthystart.nhs.uk/getting-vitamins/",,
Hanley Road Health Centre,,GDOS,51 Hanley Road,Finsbury Park,London,,,N4 3DU,Tel: 020 3874 5676,"To collect your free vitamins, you’ll have to show your NHS Healthy Start card.Ask your midwife or health visitor if you need any further advice or visit www.healthystart.nhs.uk/getting-vitamins/",,
Ambler Children'S Centre And Extended School,,GDOS,Ambler Primary School,Blackstock Road,Finsbury Park,London,,N4 2DR,Tel: 020 7226 4708,"To collect your free vitamins, you’ll have to show your NHS Healthy Start card.Ask your midwife or health visitor if you need any further advice or visit www.healthystart.nhs.uk/getting-vitamins/",,
Hornsey Central Neighbourhood Health Centre,,GDOS,151 Park Road,Hornsey,,,,N8 8JD,Tel: 020 3074 2400,"To collect your free vitamins, you’ll have to show your NHS Healthy Start card.Ask your midwife or health visitor if you need any further advice or visit www.healthystart.nhs.uk/getting-vitamins/",,
Phillips Chemist,,GDOS,193 Lordship Lane,Tottenham,,,,N17 6XF,Tel: 0208 808 4040,"To collect your free vitamins, you’ll have to show your NHS Healthy Start card.Ask your midwife or health visitor if you need any further advice or visit www.healthystart.nhs.uk/getting-vitamins/",,
Woodside Childrens Centre *,,GDOS,59 White Hart Lane,London,,,,N22 5SJ,Tel: 020 8888 4398,"To collect your free vitamins, you’ll have to show your NHS Healthy Start card.Ask your midwife or health visitor if you need any further advice or visit www.healthystart.nhs.uk/getting-vitamins/",,
Welbourne Childrens Centre *,,GDOS,Stainby Road,London,,,,N15 4EA,Tel: 020 8493 1197,"To collect your free vitamins, you’ll have to show your NHS Healthy Start card.Ask your midwife or health visitor if you need any further advice or visit www.healthystart.nhs.uk/getting-vitamins/",,
Stonecroft Childrens Centre,,GDOS,100 Priory Road,London,,,,N8 7HR,Tel: 020 8340 7050,"To collect your free vitamins, you’ll have to show your NHS Healthy Start card.Ask your midwife or health visitor if you need any further advice or visit www.healthystart.nhs.uk/getting-vitamins/",,
Morrisons Pharmacy,,GDOS,47-49 Stamford Hill,Hackney,London,,,N16 5SR,Tel: 020 8809 3369,"To collect your free vitamins, you’ll have to show your NHS Healthy Start card.Ask your midwife or health visitor if you need any further advice or visit www.healthystart.nhs.uk/getting-vitamins/",,
Safedale Pharmacy,,GDOS,2-3 Kingsway Parade,Hackney,London,,,N16 0TA,Tel: 020 7254 4990,"To collect your free vitamins, you’ll have to show your NHS Healthy Start card.Ask your midwife or health visitor if you need any further advice or visit www.healthystart.nhs.uk/getting-vitamins/",,
Hornsey Road Children'S Centre,,GDOS,8 Tiltman Place,Hornsey Road,Finsbury Park,London,,N7 7EN,Tel: 020 7527 2005,"To collect your free vitamins, you’ll have to show your NHS Healthy Start card.Ask your midwife or health visitor if you need any further advice or visit www.healthystart.nhs.uk/getting-vitamins/",,
Dowsett Express,,GDOS,70 Dowsett Road,Tottenham,,,,N17 9DD,Tel: 0208 808 1088,"To collect your free vitamins, you’ll have to show your NHS Healthy Start card.Ask your midwife or health visitor if you need any further advice or visit www.healthystart.nhs.uk/getting-vitamins/",,
Safedale Ltd,,GDOS,100 Stoke Newington Church St,Hackney,London,,,N16 0AP,Tel: 020 7254 8487,"To collect your free vitamins, you’ll have to show your NHS Healthy Start card.Ask your midwife or health visitor if you need any further advice or visit www.healthystart.nhs.uk/getting-vitamins/",,
Conewood Street Children'S Centre,,GDOS,14 Conewood Street,Islington,London,,,N5 1DL,Tel: 020 7527 4440,"To collect your free vitamins, you’ll have to show your NHS Healthy Start card.Ask your midwife or health visitor if you need any further advice or visit www.healthystart.nhs.uk/getting-vitamins/",,
Greenlight Pharmacy,,GDOS,51 Oldhill Street,Hackney,London,,,N16 6LU,Tel: 020 8802 4488,"To collect your free vitamins, you’ll have to show your NHS Healthy Start card.Ask your midwife or health visitor if you need any further advice or visit www.healthystart.nhs.uk/getting-vitamins/",,
Rowland Hill Childrens Centre,,GDOS,315 White Hart Lane,London,,,,N17 7LT,Tel: 020 8808 6089,"To collect your free vitamins, you’ll have to show your NHS Healthy Start card.Ask your midwife or health visitor if you need any further advice or visit www.healthystart.nhs.uk/getting-vitamins/",,
Safedale Ltd,,GDOS,162 Green Lanes,Hackney,London,,,N16 9DL,Tel: 020 7254 0505,"To collect your free vitamins, you’ll have to show your NHS Healthy Start card.Ask your midwife or health visitor if you need any further advice or visit www.healthystart.nhs.uk/getting-vitamins/",,
Ihsan Children'S Centre,,GDOS,66-68 Cazeonove Road,Hackney,London,,,N16 6AA,Tel: 020 8806 1147,"To collect your free vitamins, you’ll have to show your NHS Healthy Start card.Ask your midwife or health visitor if you need any further advice or visit www.healthystart.nhs.uk/getting-vitamins/",,
Benjamin Chemist,,GDOS,190 Stoke Newington High St,Hackney,London,,,N16 7JD,Tel: 020 7254 2696,"To collect your free vitamins, you’ll have to show your NHS Healthy Start card.Ask your midwife or health visitor if you need any further advice or visit www.healthystart.nhs.uk/getting-vitamins/",,
Northern Health Centre,,GDOS,580 Holloway Road,Archway,London,,,N7 6LB,Tel: 020 3817 3975,"To collect your free vitamins, you’ll have to show your NHS Healthy Start card.Ask your midwife or health visitor if you need any further advice or visit www.healthystart.nhs.uk/getting-vitamins/",,
Pembury House Childrens Centre,,GDOS,Lansdowne Road,London,,,,N17 9XE,Tel: 020 8801 9914,"To collect your free vitamins, you’ll have to show your NHS Healthy Start card.Ask your midwife or health visitor if you need any further advice or visit www.healthystart.nhs.uk/getting-vitamins/",,
Highbury Grange Health Centre,,GDOS,1-5 Highbury Grange,Islington,London,,,N5 2QB,Tel: 020 7226 2462,"To collect your free vitamins, you’ll have to show your NHS Healthy Start card.Ask your midwife or health visitor if you need any further advice or visit www.healthystart.nhs.uk/getting-vitamins/",,
Allen Pharmacy,,GDOS,150 Albion Road,Stoke Newington,London,,,N16 9PA,Tel: 020 7254 2500,"To collect your free vitamins, you’ll have to show your NHS Healthy Start card.Ask your midwife or health visitor if you need any further advice or visit www.healthystart.nhs.uk/getting-vitamins/",,
Willow Children'S Centre,,GDOS,1A Holbrooke Court,Islington,London,,,N7 0BF,Tel: 020 7527 1990,"To collect your free vitamins, you’ll have to show your NHS Healthy Start card.Ask your midwife or health visitor if you need any further advice or visit www.healthystart.nhs.uk/getting-vitamins/",,
Archway Children'S Centre,,GDOS,1 Vorley Road,Archway,London,,,N19 5HE,Tel: 020 7527 4827,"To collect your free vitamins, you’ll have to show your NHS Healthy Start card.Ask your midwife or health visitor if you need any further advice or visit www.healthystart.nhs.uk/getting-vitamins/",,
Bounds Green Childrens Centre,,GDOS,Bounds Green Road,London,,,,N11 2QG,Tel: 020 8888 8824,"To collect your free vitamins, you’ll have to show your NHS Healthy Start card.Ask your midwife or health visitor if you need any further advice or visit www.healthystart.nhs.uk/getting-vitamins/",,
Linden Children'S Centre,,GDOS,86-92 Rectory Road,Clapton,London,,,N16 7SH,Tel: 020 7254 9939,"To collect your free vitamins, you’ll have to show your NHS Healthy Start card.Ask your midwife or health visitor if you need any further advice or visit www.healthystart.nhs.uk/getting-vitamins/",,
Bounds Green Health Centre,,GDOS,1A Gordon Road,,,,,N11 2PA,Tel: (020) 3074 2800,"To collect your free vitamins, you’ll have to show your NHS Healthy Start card.Ask your midwife or health visitor if you need any further advice or visit www.healthystart.nhs.uk/getting-vitamins/",,
Safedale Pharmacy,,GDOS,142A Upper Clapton Road,Hackney,London,,,E5 9JZ,Tel: 020 8806 7073,"To collect your free vitamins, you’ll have to show your NHS Healthy Start card.Ask your midwife or health visitor if you need any further advice or visit www.healthystart.nhs.uk/getting-vitamins/",,
Safedale Ltd,,GDOS,97 Upper Clapton Road,Hackney,London,,,E5 9BU,Tel: 020 8806 5140,"To collect your free vitamins, you’ll have to show your NHS Healthy Start card.Ask your midwife or health visitor if you need any further advice or visit www.healthystart.nhs.uk/getting-vitamins/",,
Park Lane Childrens Centre,,GDOS,139 Park Lane,London,,,,N17 0HB,Tel: 020 8489 4945,"To collect your free vitamins, you’ll have to show your NHS Healthy Start card.Ask your midwife or health visitor if you need any further advice or visit www.healthystart.nhs.uk/getting-vitamins/",,
The Factory Children'S Centre,,GDOS,107  Matthias Road,Mayville Estate,London,,,N16 8NP,Tel: 020 7060 7487,"To collect your free vitamins, you’ll have to show your NHS Healthy Start card.Ask your midwife or health visitor if you need any further advice or visit www.healthystart.nhs.uk/getting-vitamins/",,
Day Lewis Pharmacy,,GDOS,75-77 Stoke Newington Road,,London,,,N16 8AD,Tel: 020 7241 0486,"To collect your free vitamins, you’ll have to show your NHS Healthy Start card.Ask your midwife or health visitor if you need any further advice or visit www.healthystart.nhs.uk/getting-vitamins/",,
Day Lewis Pharmacy,,GDOS,14 Kenninghall Road,Clapton,London,,,E5 8BY,Tel: 020 8985 1873,"To collect your free vitamins, you’ll have to show your NHS Healthy Start card.Ask your midwife or health visitor if you need any further advice or visit www.healthystart.nhs.uk/getting-vitamins/",,
Paradise Park Children'S Centre,,GDOS,Paradise Park,164 Mackenzie Road,Islington,London,,N7 8SE,Tel: 020 7697 7330,"To collect your free vitamins, you’ll have to show your NHS Healthy Start card.Ask your midwife or health visitor if you need any further advice or visit www.healthystart.nhs.uk/getting-vitamins/",,
Konstam Nursery,,GDOS,75 Chester Road,Camden,London,,,N19 5DH,Tel: 020 7272 3594,"To collect your free vitamins, you’ll have to show your NHS Healthy Start card.Ask your midwife or health visitor if you need any further advice or visit www.healthystart.nhs.uk/getting-vitamins/",,
Boots The Chemist,,GDOS,222-224 Stamford Hill,Hackney,London,,,E8 2NS,Tel: 020 8800 2874,"To collect your free vitamins, you’ll have to show your NHS Healthy Start card.Ask your midwife or health visitor if you need any further advice or visit www.healthystart.nhs.uk/getting-vitamins/",,
New River Green Children'S Centre,,GDOS,23 Ramsey Walk,Islington,London,,,N1 2SX,Tel: 020 7527 4813/4817,"To collect your free vitamins, you’ll have to show your NHS Healthy Start card.Ask your midwife or health visitor if you need any further advice or visit www.healthystart.nhs.uk/getting-vitamins/",,
Goodinge Health Centre,,GDOS,20 Goodinge Close,North Road,Market Estate,London,,N7 9EW,Tel: 020 7619 6670,"To collect your free vitamins, you’ll have to show your NHS Healthy Start card.Ask your midwife or health visitor if you need any further advice or visit www.healthystart.nhs.uk/getting-vitamins/",,
Hungerford Children'S Centre,,GDOS,10 Goodinge Road,Islington,London,,,N7 9LH,Tel: 020 7527 8441,"To collect your free vitamins, you’ll have to show your NHS Healthy Start card.Ask your midwife or health visitor if you need any further advice or visit www.healthystart.nhs.uk/getting-vitamins/",,
J. Edmunds Chemists,,GDOS,47 Kingsland High St,Hackney,London,,,E8 2JS,Tel: 020 7254 0732,"To collect your free vitamins, you’ll have to show your NHS Healthy Start card.Ask your midwife or health visitor if you need any further advice or visit www.healthystart.nhs.uk/getting-vitamins/",,
Superdrug Pharmacy,,GDOS,Dalston Cross Shopping Centre,Hackney,London,,,E8 2LX,Tel: 020 7241 0661,"To collect your free vitamins, you’ll have to show your NHS Healthy Start card.Ask your midwife or health visitor if you need any further advice or visit www.healthystart.nhs.uk/getting-vitamins/",,
F. A. Strange,,GDOS,185 Lower Clapton Road,Hackney,London,,,E5 8EQ,Tel: 020 8510 0829,"To collect your free vitamins, you’ll have to show your NHS Healthy Start card.Ask your midwife or health visitor if you need any further advice or visit www.healthystart.nhs.uk/getting-vitamins/",,
Bowes Road Clinic,,GDOS,269 Bowes Road,London,,,,N11 1BD,Tel: 020 8368 2051,"To collect your free vitamins, you’ll have to show your NHS Healthy Start card.Ask your midwife or health visitor if you need any further advice or visit www.healthystart.nhs.uk/getting-vitamins/",,
Coppetts Wood Children'S Centre,,GDOS,Coppetts Road,Friern Barnet,London,,,N10 1JS,Tel: 0208 883 2985,"To collect your free vitamins, you’ll have to show your NHS Healthy Start card.Ask your midwife or health visitor if you need any further advice or visit www.healthystart.nhs.uk/getting-vitamins/",,
Walthamstow Family Hub,,GDOS,313 Billet Road,Walthamstow,,,,E17 5PX,Tel: 020 8496 3511,"To collect your free vitamins, you’ll have to show your NHS Healthy Start card.Ask your midwife or health visitor if you need any further advice or visit www.healthystart.nhs.uk/getting-vitamins/",,
River Place Health Centre,,GDOS,Essex Road,Islington,London,,,N1 2DE,Tel: 020 7704 2832,"To collect your free vitamins, you’ll have to show your NHS Healthy Start card.Ask your midwife or health visitor if you need any further advice or visit www.healthystart.nhs.uk/getting-vitamins/",,
Guardian Pharmacy,,GDOS,448 Kingsland Road,Hackney,London,,,E8 4AE,Tel: 020 7254 8211,"To collect your free vitamins, you’ll have to show your NHS Healthy Start card.Ask your midwife or health visitor if you need any further advice or visit www.healthystart.nhs.uk/getting-vitamins/",,
Friends Pharmacy,,GDOS,46 Lower Clapton Road,Hackney,London,,,E5 0RN,Tel: 020 8986 9706,"To collect your free vitamins, you’ll have to show your NHS Healthy Start card.Ask your midwife or health visitor if you need any further advice or visit www.healthystart.nhs.uk/getting-vitamins/",,
Safedale Ltd,,GDOS,59 Lower Clapton Road,Hackney,London,,,E5 0NS,Tel: 020 8985 8819,"To collect your free vitamins, you’ll have to show your NHS Healthy Start card.Ask your midwife or health visitor if you need any further advice or visit www.healthystart.nhs.uk/getting-vitamins/",,
Clockwork Pharmacy,,GDOS,398-400 Mare Street,Hackney,London,,,E8 1HP,Tel: 020 8985 1635,"To collect your free vitamins, you’ll have to show your NHS Healthy Start card.Ask your midwife or health visitor if you need any further advice or visit www.healthystart.nhs.uk/getting-vitamins/",,
Dev'S Chemist,,GDOS,103A Dalston Lane,Hackney,London,,,E8 1HN,Tel: 020 7249 8060,"To collect your free vitamins, you’ll have to show your NHS Healthy Start card.Ask your midwife or health visitor if you need any further advice or visit www.healthystart.nhs.uk/getting-vitamins/",,
Bemerton Children'S Centre,,GDOS,Coatbridge House,"1A ,Carnoustie Drive",Islington,London,,N1 0DX,Tel: 020 7527 4806,"To collect your free vitamins, you’ll have to show your NHS Healthy Start card.Ask your midwife or health visitor if you need any further advice or visit www.healthystart.nhs.uk/getting-vitamins/",,
Kingsland Pharmacy,,GDOS,406 Kingsland Road,Hackney,London,,,E8 4AA,Tel: 020 7254 6910,"To collect your free vitamins, you’ll have to show your NHS Healthy Start card.Ask your midwife or health visitor if you need any further advice or visit www.healthystart.nhs.uk/getting-vitamins/",,