Organisation Name,NACS Code,Organisation Type,Address1,Address2,Address3,Address4,Address5,PostCode,Telephone Number,Information supplied by,Value  (Information supplied by),Banding Classification  (Information supplied by)
Core Restore,,GDOS,Bushey and Oxhey Methodist Church,,,Bushey ,,WD19 4DA,Tel: 07834234997,Restore My Core is a 12 week at home exercise programme designed to help restore core strength and repair diastasis recti / abdominal seperation after... <a href="https://www.netmums.com/local/l/core-restore-1">Read more</a>,,
Vinyasa Flow Yoga Class,,GDOS,The Bushey Arena,The Bushey Academy,London Road,Bushey,,WD23 3AA,,Vinyasa Flow Yoga Class - First Class Free! Suitable for all levels. Plenty of parking! Classes run every Monday in the dance studio at The Bushey Ar... <a href="https://www.netmums.com/local/l/vinyasa-flow-yoga-class">Read more</a>,,
Jeannette Peel Diet &Amp; Fitness (Fit Combo),,GDOS,St. Matthew's Church,Eastbury Road,,Oxhey,Herts,WD19 4ST,Tel: 01494 871543,"Fit ComboIs a mixture of different disciplines. Each week will feature a diverse workout, including body-sculpting exercises, aerobic, salsa, Zumba da... <a href=https://www.netmums.com/local/l/rosemary-conley-diet-fitness-slim-zumba-toning-1>Read more</a>",,
Franklin Health And Fitness - Personal Training,,GDOS,Bushey,,,Watford,,WD19 4HH,Tel: 447890948366,Franklin Health and Fitness offers one-to-one personal training and/or small group sessions. Lydia is a fully qualified (REPs Level 3) personal traine... <a href="https://www.netmums.com/local/l/franklin-health-and-fitness-personal-training">Read more</a>,,
Claire Murphy Yoga,,GDOS,Central Primary School,Stanley Road,,Watford,,WD17 2LX,,"Yoga for women to support you through all stages, with particular emphasis on restoring and strengthening the pelvic floor.Classes are suitable for b... <a href=https://www.netmums.com/local/l/claire-murphy-esprit-yoga>Read more</a>",,
Meditation &Amp; Mindfulness,,GDOS,Central Primary School,,,Watford,,WD17 2LX,Tel: 07980 415698,Regular monthly meditation sessions open to all - beginners most welcome!I also offer a 5-week introduction to mindfulness - A Mindful Woman - which ... <a href="https://www.netmums.com/local/l/meditation-9">Read more</a>,,
St Margaret'S Sports Centre,,GDOS,Merry Hill Road,,,Bushey,Hertfordshire,WD23 1DT,Tel: 02084164604,St Margaret's Swim School run a comprehensive Swimming Lesson Programme for children and adults alike.Our swimming lessons programme is designed to b... <a href="https://www.netmums.com/local/l/st-margaret-s-sports-centre">Read more</a>,,
Wocy Family Yoga With Children (4 - 11 Years),,GDOS,The School Hall,Little St Margaret's School,Merry Hill Road,Bushey,Hertfordshire,WD23 1DT,Tel: 07784 370034,"FREE TRIAL CLASSFamily Yoga classes are a shared wellbeing experience for both children and adults, including parents and other care givers. Through e... <a href=https://www.netmums.com/local/l/wocy-family-yoga-with-children-5-7-years>Read more</a>",,
Wocy Mum &Amp; Daughter With Teens (11 - 15 Years),,GDOS,School Hall,Little St Margaret's School,Merry Hill Road,Bushey,Hertfordshire,WD23 1DT,Tel: 07784 370034,FREE TRIAL CLASSMum and Daughter classes provide a calm space to nurture their unique bond. Its a space for them to value each other's feelings and em... <a href="https://www.netmums.com/local/l/wocy-family-yoga-with-teens-11-15-years">Read more</a>,,
Yoga For All By Mala,,GDOS,St. Margaret's School Sport Centre,Merry Hill Road,,Bushey,Herfordshire,WD23 1DT,Tel: 07881966073,"This approach promotes safer and more fluid physical movement, and results in a practice that cultivates lasting strength and flexibility, inner and o... <a href=https://www.netmums.com/local/l/yoga-for-all-11>Read more</a>",,
Wocy Family Yoga With Pre-Schoolers (2-4 Years),,GDOS,School Hall,Little St Margaret's School,Merry Hill Road,Bushey,Hertfordshire,WD23 1DT,Tel: 07784 370034,"FREE TRIAL CLASSPre-School Family Yoga classes are interactive with children  exploring a weekly theme, including national curriculum and well being t... <a href=https://www.netmums.com/local/l/wocy-family-yoga-with-pre-schoolers-2-4-years>Read more</a>",,
Weekend Power Mornings: Open Class From 8 Years+,,GDOS,School Hall,Little St Margaret's School,Merry Hill Road,Bushey,Hertfordshire,WD23 1DT,Tel: 07784 370034,FREE TRIAL CLASS30 minute bite-size classes to share short yoga sequences you and your Family can practise every day.These brand new WOCY classes with... <a href="https://www.netmums.com/local/l/weekend-power-mornings-open-class-from-8-years">Read more</a>,,
Zumba At Femme Fitness Gym,,GDOS,Femme Fitness Gym,Queens Road,,Watford,Herts,WD17 2QN,Tel: 07947 183292,"Come and join the party, a fun way to exercise with great music. Meet new people. The class is for all abilities, give it a try, look forward to seein... <a href=https://www.netmums.com/local/l/zumba-372>Read more</a>",,
And Breathe,,GDOS,The Curve,Watford Grammar School for Girls,Lady's Close,Watford,Herts,WD18 0EA,Tel: 07984 429255,"Friendly, group yoga class, suitable for all abilities. Achieve a sense of physical well being and a feeling of deep peace.Tuesday evening @ 6.30pm. T... <a href=https://www.netmums.com/local/l/and-breathe>Read more</a>",,
Aqua Style Swimming School Bushey,,GDOS,Meadow Wood School ,Cold Harbour Lane,,Bushey Heath,Hertfordshire,WD23 4NN,Tel: 07925 954144,"Warm pool, fun and safe Adult and Baby swimming half hour lessons every Saturday. Children from 3+ progress onto being taught by qualified CRB checke... <a href=https://www.netmums.com/local/l/aqua-style-swimming-school-bushey>Read more</a>",,
Aqua Style Swimming School,,GDOS,St Margaret's Sports Centre ,Merry Hill Road,Meadow Wood School,Bushey,Hertforshire,WD23 4NN,Tel: 07925 954144,A unique Swim School with excellent results.Apply now for summer fast track courses: One week - 5 lessons (45 min each) Progress is incredible and ex... <a href="https://www.netmums.com/local/l/aqua-style-swimming-school-3">Read more</a>,,
Atlantis Swimming School At Meadow Wood School Bushey On Saturday Am!,,GDOS,Meadow Wood School,Coldharbour Lane,,"Bushey, Watford",Hertfordshire,WD23 4NN,Tel: 07793 000583,Atlantis Swimming School provides swimming lessons for children aged 1.5yrs+ at Meadow Wood School in Bushey near Watford.  We have classes for non-sw... <a href="https://www.netmums.com/local/l/atlantis-swimming-school-4">Read more</a>,,
Piloxing Fitness Classes!,,GDOS,"The Barn Studio, Watford",,,Watford,Herts,WD17 1BJ,Tel: 07964991376,"Burn up to 900 Calories per Hour with this amazing workout fusing boxing, pilates and dance into one!!£5 per classOptional £1 to hire weighted glove... <a href=https://www.netmums.com/local/l/piloxing-fitness-classes>Read more</a>",,
Beginners Yoga,,GDOS,Hartspring Community centre,336 Park Avenue,,Bushey,,WD23 2BJ,Tel: 02080886420,Ever wanted to try yoga? This class is open to complete beginners focusing on the physical yoga practise as well as meditation and breathing. Small cl... <a href="https://www.netmums.com/local/l/yoga-for-everyone">Read more</a>,,
Yoga Workshop 'Tangled &Amp; Twisted!'   For All Levels,,GDOS,Mercure Hotel Watford (Excel Sports in the car park behind the hotel),Tylers Way,A41 Watford Bypass,Watford,Hertfordshire,WD25 8JH,Tel: Kirsty 07415 218224 or Nicola 07884 006337,"Open to all levels, join us for this 2 hour workshop exploring strong hipopeners and deep backbends. Using both a yin and a yang approach to godeeper ... <a href=https://www.netmums.com/local/l/yoga-workshop-tangled-twisted-for-all-levels-1>Read more</a>",,
Energie Fitness For Women Watford,,GDOS,12 Station Road,,,Watford,Hertfordshire,WD17 1EG,Tel: 01923 3750336,Welcome to Ã©nergie fitness for womenWatfordÃ©nergie for lifeOur Ã©nergie fitness for women club is a fitness and weight loss circuit designed for the... <a href="https://www.netmums.com/local/l/energie-fitness-for-women-watford">Read more</a>,,
Learn To Run,,GDOS,25 Caladonian Court,West Street,,Watford,,WD17 1RY,Tel: 07709 342329,"Learn to Run will take you from having never run before to around 5k in 8 weeks. Each session involves running, education and team building exercises... <a href=https://www.netmums.com/local/l/learn-to-run>Read more</a>",,
Adult And Child Lessons At South Oxhey Leisure Centre,,GDOS,South Oxhey Leisure Centre ,,,South Oxhey,,WD19 7AX,Tel: 02084284954,Adult &amp; Child Lessons!Are you looking to start building your little ones water confidence? Our Swim School is all about making sure that everyo... <a href="https://www.netmums.com/local/l/adult-and-child-lessons-at-south-oxhey-leisure-centre">Read more</a>,,
Jeannette Peel Diet &Amp; Fitness Fit Combo,,GDOS,St. Thomas Church,Langley Road,,Watford,Herts,WD17 4PN,Tel: 01494 871543,"Fit Combo is a mixture of different disciplines. Each week will feature a diverse workout, including body-sculpting exercises, aerobic and zumba dance... <a href=https://www.netmums.com/local/l/rosemary-conley-diet-fitness-slim-aerobics>Read more</a>",,
Cassiobury Parkrun,,GDOS,"Cassiobury Park, ",,,"Watford, ","Hertfordshire, ",WD18 7LB,,"parkrun is a free, weekly, timed 5k run that takes place every Saturday at 9am. junior parkruns are 2k events specifically for 4 to 14 year olds, held... <a href=https://www.netmums.com/local/l/cassiobury-parkrun>Read more</a>",,
Yoga At Watford Boys School,,GDOS,Rickmansworth Road,,,Watford,Herts,WD18 7JF,Tel: 07748 047649,"Yoga classes for strength, flexibility and stability on Tues  and Wed  evenings in a clean, warm , environment taught by BWY/Sports Alliance/ITEC qual... <a href=https://www.netmums.com/local/l/evening-yoga-in-arts-cafe-cassiobury-park>Read more</a>",,
Personal Training,,GDOS,Chiswell court,,,Watford ,,WD24 7PJ,Tel: 07792230275,"Are you desperate to loose some weight, get toned and feel better and happier with yourself? Or if you just need to let some steam off or need that e... <a href=https://www.netmums.com/local/l/personal-training-132>Read more</a>",,
Experienced Classically Trained Pilates Teacher Watford,,GDOS,King Georges Avenue,,,Watford,Herts,WD18 7QD,Tel: 07739 043 930,Westside Pilates in Watford is a private studio located in West Watford. The studio is fully equipped with all the Classical Pilates apparatus. Owned... <a href="https://www.netmums.com/local/l/experienced-classically-trained-pilates-teacher-watford">Read more</a>,,
Classical Pilates Reformer Classes,,GDOS,King Georges Avenue,,,Watford,,WD18 7QD,Tel: 07739 043 930,"Pilotties Pilates is a Classical Pilates Studio offering Pilates Equipment Sessions, 1 to 1 tuition, and small group Reformer classes in a dedicated ... <a href=https://www.netmums.com/local/l/classical-pilates-reformer-classes>Read more</a>",,
Jeannette Peel Diet &Amp;  Fitness ( Zumba),,GDOS,Holywell Community Centre,Tolpits Lane,,Watford,Herts,WD18 9QD,Tel: 01494 871543,"Zumba You may attend to exercise only or to weigh-in, follow the healthy eating plan &amp; exercise.We tailor a bespoke Mediterranean style healthy ea... <a href=https://www.netmums.com/local/l/rosemary-conley-diet-fitness-slim-zumba-3>Read more</a>",,
Sir James Altham Swimming Pool,,GDOS,Little Oxhey Lane,South Oxhey,,Watford,Hertfordshire,WD19 6FW,Tel: 0208 421 0211,"The Sir James Altham Pool in South Oxhey is a small, friendly community pool with specialised facilities for people with disabilities.The Pool offers ... <a href=https://www.netmums.com/local/l/sir-james-altham-swimming-pool-2>Read more</a>",,
Boxfit Boxercise Kickfit With Nelson,,GDOS,The Dan Tien Dance Studio (Monday),Harbreaks Community Hub,,Watford,Herts,WD24 6NJ,Tel: 07957642737,Boxercise class for anyone who wants an intense but fun all over workout that is guaranteed to show results. Boxing skills and training methods in a s... <a href="https://www.netmums.com/local/l/boxfit-boxercise-kickfit-with-nelson">Read more</a>,,
Aqua Style Swim School Bushey And Northwood,,GDOS,Merchant Taylors School,Sandy Lodge,,Northwood,Middlesex,HA6 2HT,Tel: 07925 954144,We believe in giving students confidence by being in the water with them when we teach. Classes are small about four students to a teacher. One to On... <a href="https://www.netmums.com/local/l/aqua-style-swim-school-bushey-and-northwood-1">Read more</a>,,
Ashley La Grange Swimming School,,GDOS,Merchant Taylors' School pool,Sandy Lodge Lane,,Northwood,Mddx,HA6 2HT,Tel: 07792 896 590 or 01923 237472,"SWIMMING CLASSES AT MERCHANT TAYLORS' POOL:  Classes available for babies, children &amp; teenagers, and adults. We have weekly classes during term t... <a href=https://www.netmums.com/local/l/ashley-la-grange-swimming-school>Read more</a>",,
Swimming Training With A Difference!,,GDOS,Merchant Taylors' School Pool,Sandy Lodge Lane,,Northwood,,HA6 2HT,Tel: 01923 237472 or 07593 040 500,Can you swim lengths (front crawl)? Do you need to get fit?  Come to our non-competitive swimming training with a difference - no ploughing up and dow... <a href="https://www.netmums.com/local/l/swimming-training-with-a-difference">Read more</a>,,
Swimming Lessons For Adults (Beginners &Amp; Improvers),,GDOS,Merchant Taylors' School Pool,Sandy Lodge Lane,,Northwood,,HA6 2HT,Tel: 01923 237472 or 07593 040 500,"Come and learn how to swim with us as an adult, if you've never learned how, or improve your stroke and breathing technique if you've never quite mast... <a href=https://www.netmums.com/local/l/swimming-lessons-for-adults-beginners-improvers>Read more</a>",,
Tracey'S Zumba Cafe &Amp; 'Stay &Amp; Play',,GDOS,"IN The Clubhouse, IN Saddlers Mead Park","off Clonard Way, off Rowlands Avenue",Hatch End,Pinner,Middlesex,HA5 4BU,Tel: 0208 866 3970,"Looking for a Zumba Class in the day, where you can take the kids too? Look no further Tracey's Zumba is set in a clubhouse where there is room for yo... <a href=https://www.netmums.com/local/l/zumba-cafe-creche>Read more</a>",,
Zumba/ Cafe And Play Area,,GDOS,"IN The Clubhouse, In Saddlers Mead Park",off Clonard Way,off Rowlands Avenue,Hatch End,"Pinner, Middx",HA5 4BU,,Come and enjoy a Tuesday lunchtime workout with Tracey. If you enjoy the party atmosphere of Zumba then this is the class for you. Held in the spaciou... <a href="https://www.netmums.com/local/l/zumba-cafe-and-play-area">Read more</a>,,
Cyclezone Studio,,GDOS,33H Battlers Green Farm,Common Lane,,Radlett,Herts.,WD7 8PH,Tel: 01923 555066 /07500221220,CYCLEZONE STUDIO IS A DEDICATED INDOOR CYCLING AND PILATES STUDIO IN RADLETT.WE NOW OFFER ANTENATAL AND POSTNATAL PILATESTO BOOK 01923 555066 OR  www... <a href="https://www.netmums.com/local/l/cyclezone-studio">Read more</a>,,
Pilates Wellness For Women,,GDOS,Harrow Arts Centre,171 Uxbridge Road,,Hatch End,,HA5 4EA,Tel: 07854419772,"Pilates classes &amp; Personal Training in Hatch End, Pinner.  For up to date class times/prices go to: www.pilateswellnessforwomen.com... <a href=https://www.netmums.com/local/l/pilates-60>Read more</a>",,
Chi Kri Yoga In Hatch End,,GDOS,Harrow Arts Centre,171 Uxbridge Road,,Hatch End,Middlesex,HA5 4EA,Tel: 07931 71 77 88,"We deliver great classes in a warm and friendly environment, where you are encouraged  to try your best and develop every aspect of your yoga practic... <a href=https://www.netmums.com/local/l/mixed-ability-yoga-hatch-end>Read more</a>",,
Adult Flamenco Dance Class,,GDOS,Harrow Arts Centre,Hatch End,,Harrow,Middlesex,HA5 4EA,,"Come along and have a go at dancing flamenco- the fiery dance from AndalucÃ­a, Spain. Blast away tired feet with some foot-stomping and create beauti... <a href=https://www.netmums.com/local/l/flamenco-dance-class-for-adults>Read more</a>",,
Hatch End Swim School,,GDOS,Hatch End Swimming Pool,Uxbridge Road,,Hatch End,,HA5 4EA,Tel: 01923 469839,"All children's classes last for 30 minutes except for training sessions, which last 1 hour.Baby Swimming lessons though to Adult lessons ... <a href=https://www.netmums.com/local/l/hatch-end-swim-school>Read more</a>",,
Exceptional Yoga Classes Near Pinner,,GDOS,Harrow Arts Centre,171 Uxbridge Road,,Hatch End,,HA5 4EA,Tel: 07931717711,"Treat yourself to the gift of yoga: release the stress, have fun and feel great!Our classes are varied and empowering, packed with deep stretches, cr... <a href=https://www.netmums.com/local/l/exceptional-yoga-classes-near-pinner>Read more</a>",,
Yogaflow With Eleanor,,GDOS,,,Hatch End,Pinner,Middlesex,HA5 4RL,Tel: 07968 779698,"Classes for all ages and all abilities. Many options given and props provided to support and assist your practice. A gentle hands on approach, working... <a href=https://www.netmums.com/local/l/yogaflow-with-eleanor>Read more</a>",,
Bounce Watford,,GDOS,Leavesden green community hub,Clarke way,,Watford,,WD25 0BW,Tel: 07834373215,((BOUNCE))  Fitness classes: 10 mins of bounce is the same as a 30 min run.((BOUNCE)) ClassOur 1 hour class features the first 40 mins of choreograph... <a href="https://www.netmums.com/local/l/bounce-watford-1">Read more</a>,,
Aldenham Parkrun,,GDOS,"Aldenham Country Park,","Aldenham Road,",,"Elstree, Hertfordshire,",,WD6 3BA,,"parkrun is a free, weekly, timed 5k run that takes place every Saturday at 9am. junior parkruns are 2k events specifically for 4 to 14 year olds, held... <a href=https://www.netmums.com/local/l/aldenham-parkrun>Read more</a>",,
Boxercise For Ladies Only,,GDOS,Cedars Community Centre ,Chicheley Road,Harrow Weald,Harrow Weald,London,HA3 6QH,Tel: 07783901553,"Boxercise is a fun, non- contact boxing and circuit training designed to get your body burning fat and to enable you to get into great shape! Heres a... <a href=https://www.netmums.com/local/l/boxercise-for-ladies-only>Read more</a>",,
Ladies Weightloss &Amp; Fitness Classes,,GDOS,Cedars Community Centre,Chicheley Road,Harrow Weald,Harrow Weald,London,HA3 6QH,Tel: 07783901553,"Ladies, does any of this seem familiar?Looked in the Mirror and felt that you need to take action?Got  a dress that you have'nt worn in ages or at all... <a href=https://www.netmums.com/local/l/boxercise-for-ladiesby-kixtraining>Read more</a>",,
Aspire Swim School,,GDOS,Aspire Leisure Centre,Wood Lane,,"Stanmore,",Middx,HA7 4AP,Tel: 020 8420 6723,At Aspire we provide a calm and relaxed environment where your child can learn to swim or improve their technique. All our swimming instructors are q... <a href="https://www.netmums.com/local/l/aspire-swimschool-1">Read more</a>,,
Post Natal Restorative Pilates,,GDOS,Manor way ,Croxley green ,Ricknansworth ,"Croxley Green, Rickmansworth ",Hertfordshire,WD3 3LU,Tel: 07967 659225,Post natal restorative pilates.Mum and baby classFrom the early days to progressive.Matwork or reformer.Group or private classes for mum and babySpeci... <a href="https://www.netmums.com/local/l/post-natal-restorative-pilates">Read more</a>,,
Pregnancy &Amp; Post Pregnancy - Wellbeing Pilates,,GDOS,Various,,,Three rivers Watford & surrounding area,Hertfordshire,WD3 3LU,Tel: 07967 659225,"Pregnancy classesThe ideal combination during pregnancy. Beneficial safe Pilates, Antenatal education and Active birth techniques. Enjoy a wonderful,... <a href=https://www.netmums.com/local/l/pregnancy-post-pregnancy-wellbeing-pilates>Read more</a>",,
Kumari Fitness - Barre Classes In Northwood And Rickmansworth,,GDOS,St. Helen's Ballet Studio,,,Northwood ,Buckinghamshire,HA6 1AF,Tel: 07938694144,"The intensive body shaping workout! Barre Flow fuses the precision of Pilates, the moves, technique and grace of Ballet and Conditioning exercises to ... <a href=https://www.netmums.com/local/l/kumari-fitness-barreconept>Read more</a>",,
24Fit Bootcamp Northwood Hills,,GDOS,St Helens Sport Centre,Green Lane,,Northwood ,,HA6 1AF,Tel: 07714824475,"*FREE FITNESS SESSIONS ARE BACK*Our FREE community 24 FIT BOOTCAMP 4 WEEK CHALLENGE is now back, just in TIME after NEW YEAR and FREE for all via pop... <a href=https://www.netmums.com/local/l/24fit-bootcamp-northwood-hills>Read more</a>",,
Post Natal Yoga &Amp; Baby Massage,,GDOS,,,,Croxley Green or from your home,HERTFORDSHIRE,WD3 3PY,Tel: 07905 410431,"GENTLY TONE UP, BOND WITH YOUR NEW BABY, MEET &amp; SHARE EXPERIENCES WITH OTHER NEW MUMS, IN A SUPPORTIVE, NON JUDGEMENTAL &amp; FRIENDLY ATMOSPHERET... <a href=https://www.netmums.com/local/l/post-natal-yoga-baby-massage>Read more</a>",,
Yoga With Gina,,GDOS,,,,Croxley Green Rickmansworth,,WD3 3PY,Tel: 07905410431,I teach personal yoga sessions Please contact for availability ... <a href="https://www.netmums.com/local/l/yoga-with-gina-1">Read more</a>,,
Croxley Hatha Yoga (Thursday),,GDOS,36 Dulwich Way,Croxley Green,,Rickmansworth ,Hertfordsire,WD3 3PY,Tel: 07905 410431,"Hatha yoga classes, we focus on Core strength, Flexibility, Stability, Mobility, balance, Co-ordination &amp; Focus. Although you will feel like your ... <a href=https://www.netmums.com/local/l/a-new-yoga-class-in-rickmansorth>Read more</a>",,
Croxley Yoga Tuesday Eve,,GDOS,36 Dulwich Way,Croxley Green,36 Dulwich Way,Rickmansworth,Hertfordshire,WD3 3PY,Tel: 07905 410431,"A Flowing Hatha yoga class for people who have done some yoga. We include breathwork, postures &amp; relaxation during the class. For fitness, Relaxat... <a href=https://www.netmums.com/local/l/croxley-yoga-tuesday-eve>Read more</a>",,
Croxley Wellness Centre Studio,,GDOS,129 New Road,,Croxley Green,Rickmansworth,Hertfordshire,WD3 3EN,Tel: 07912941445,We are a small friendly studio which offers a variet of classes.Corrective Pilates is a class suitable for those that wish to develop inner strength ... <a href="https://www.netmums.com/local/l/croxley-wellness-centre-studio">Read more</a>,,
Busylizzy Pregnancy Yoga And Pregnancy Pilates,,GDOS,The Northwood Venue,Oaklands Gate,,Northwood,,HA6 3AA,Tel: 0333 939 8787,"Why choose us?You can also choose any of the 3 pregnancy classes to attend each week &amp; if you can't make it on the day, simply cancel with no pena... <a href=https://www.netmums.com/local/l/busylizzy-pregnancy-yoga-1>Read more</a>",,
Busylizzy Mummy &Amp; Me Yoga,,GDOS,Northwood Methodist Church,Oaklands Gate,,Northwood,,HA6 3AA,Tel: 0333 939 8787,"This postnatal yoga class is designed to improve posture, help align your body, promote wellbeing and strengthen the core and lower back (important af... <a href=https://www.netmums.com/local/l/busylizzy-mummy-me-yoga-4>Read more</a>",,
Busylizzy Mummy &Amp; Me Pilates - Bring Baby Along,,GDOS,The Northwood Venue,Oaklands Gate,,Northwood,,HA6 3AA,Tel: 0333 939 8787,"Why choose Busylizzy? We're a unique one stop shop, hosting a range of post natal fitness and baby classes.  You don't have to book a term of a specif... <a href=https://www.netmums.com/local/l/busylizzy-mummy-me-pilates-6>Read more</a>",,
Busylizzy Mummy &Amp; Me Indoor Bootcamp  - Bring Baby Along!,,GDOS,Northwood Methodist Church,Oaklands Gate,,Northwood,,HA6 3AA,Tel: 0333 939 8787,"Why choose a Busylizzy class?We're a one stop shop,  hosting a variety of post natal fitness and baby classes. There are no rigid terms, and if you ca... <a href=https://www.netmums.com/local/l/mummy-me-bootcamp-indoors>Read more</a>",,
Fitworks Personal Training,,GDOS,In your own home,,,Herts,,WD6 3EG,Tel: 07970 824118,"If you would like to tone up, lose weight, improve your flexibility, learn how to exercise properly and safely, receive advice on nutrition, be motiva... <a href=https://www.netmums.com/local/l/personal-training-18>Read more</a>",,
Antonia Mori Pilates And Yoga,,GDOS,,,,Northwood,,HA6 1EE,Tel: 07568584238,Pilates and Yoga classes for 1 or 2 people in my Northwood studio. If you are interested in trying a personalised approach to Pilates or Yoga in a rel... <a href="https://www.netmums.com/local/l/antonia-mori-pilates-and-yoga-2">Read more</a>,,