Organisation Name,NACS Code,Organisation Type,Address1,Address2,Address3,Address4,Address5,PostCode,Telephone Number,Information supplied by,Value  (Information supplied by),Banding Classification  (Information supplied by)
Post Natal Yoga,,GDOS,Lumi Power Yoga,121 King Street,Hammersmith,London,,W6 9JG,Tel: 07951320141,"A gorgeous hour of post natal yoga for mummas, baby comes too.  Come and stretch out those tired shoulders and backs and gently restore strength to t... <a href=https://www.netmums.com/local/l/post-natal-yoga>Read more</a>",,
Facility Hire At Westside School,,GDOS,Westside School,Galena House,8-30 Galena Road,Hammersmith,London,W6 0LT,,"Westside School is proud to offer community hire, in the heart of Hammersmith.We have a range of facilities including large and small meeting spaces,... <a href=https://www.netmums.com/local/l/facility-hire-at-westside-school>Read more</a>",,
Dynamic Yoga Classes Online And In Real Life West London,,GDOS,Grove Neighbourhood Centre,7 Bradmore Park Road,,London,,W6 0DT,,"Dynamic Yoga classes in West London to create strength, flexibility and mobility, as you connect inwardly - most importantly, this is time for YOU!Cl... <a href=https://www.netmums.com/local/l/dynamic-yoga-classes-online-and-in-real-life-west-london>Read more</a>",,
Nautilus Swimming @ Latymer Upper,,GDOS,237 King Street,,,Hammersmith,,W6 9LR,Tel: 07841127185,The Nautilus Swimming Learn to Swim programme offers an array of different lessons to suit all levels of swimmers.Whether you are looking for Private ... <a href="https://www.netmums.com/local/l/nautilus-swimming-latymer-upper">Read more</a>,,
Jaz - New Saturday Swim School At St Paul'S Boys,,GDOS,St Paul's Boys School,Lonsdale Road,Barnes,London ,,SW13 9JT,,"Hi everyone,JaZ Swim School - new venue added St Paul's Barnes!Just wanted to let you know about a new swimming school, set up by the most experienced... <a href=https://www.netmums.com/local/l/jaz-new-saturday-swim-school-at-st-paul-s-boys>Read more</a>",,
Ante-Natal &Amp; Post-Natal Pilates,,GDOS,,,,London,London,W6 9EZ,Tel: 07900890439,I am a Body Control certified Pilates Teacher trained in ante-natal and post-natal Pilates. I offer bespoke private Pilates classes at home and small... <a href="https://www.netmums.com/local/l/pilates-by-helena">Read more</a>,,
Aqua Rangers Swimming School,,GDOS,The Printworks Health Club & Spa,10 Beaconsfield Terrace Road,,London,,W14 0PP,Tel: 020 8144 3895,"The Aqua Rangers Swimming School offer a wide range of swimming lessons, available Monday to Friday between 2pm and 6pm and Saturday 9am to 1pm.Our cl... <a href=https://www.netmums.com/local/l/aqua-rangers-swimming-school>Read more</a>",,
West Kensington Pilates,,GDOS,The Queen's Club,Palliser Road,West Kensington,London,,W14 9EQ,Tel: 07967 569 258,"SPECIAL INTRODUCTORY OFFER!5 (1-1) PRIVATE PILATES SESSIONS FOR £350!West Kensington Pilates is located on the premises of The Queens Club, with ... <a href=https://www.netmums.com/local/l/mina-stephens-pilates>Read more</a>",,
Nct Yoga For Pregnancy,,GDOS,Askew Road Church,Chiswick/Shepherd's Bush,,London,,W12 9RN,Tel: 079 3922 0917,"Join NCT antenatal teacher, Sarah Bradley, for her weekly NCT Yoga for Pregnancy class at Askew Road Church on Monday evenings 7.15pm - 8.45pm. The c... <a href=https://www.netmums.com/local/l/nct-yoga-for-pregnancy-relax-stretch-and-breathe-3>Read more</a>",,
Bounce - Shepherd'S Bush,,GDOS,Askew Road Church,Bassein Park Road,,London ,,W12 9RN,,"((BOUNCE)) is the Fun, Friendly &amp; Fierce rebounding workout delivered by uber friendly instructors. Simply bring a smile and your mojo! Completel... <a href=https://www.netmums.com/local/l/bounce-shepherd-s-bush>Read more</a>",,
Zumba At West 12 Shopping Centre,,GDOS,Fitness First Gym,Shepherd's Bush,West 12 Shopping Centre,London,UK,W12 8PP,Tel: 07919022757,"Join me every Sunday for a Fun Energetic &amp; Addictive Zumba Class in Shepherds Bush! Dance the calories away, improve your health &amp; make new fr... <a href=https://www.netmums.com/local/l/joins-us-for-zumba-every-sunday>Read more</a>",,
Zumba Fitness- Shepherds Bush,,GDOS,5 Gayford RD,St. Stephens Hall,,london,,W12 9BY,Tel: 447795101273,"If you are looking to get fit, stay in shape, lose weight, get healthier, have fun, learn to dance, and make friends then this is the class for you. E... <a href=https://www.netmums.com/local/l/zumba-fitness-177>Read more</a>",,
Yoga Fitness London,,GDOS,2 Northcroft court,61 Becklow road,,London,"London, City of",W12 9HE,Tel: 07894082544,"Organic Hot Yoga in the beautiful secret garden @ Ravenscourt park, naturally heated by a listed glasshouse, classes running all summer long. Classes... <a href=https://www.netmums.com/local/l/ms-87>Read more</a>",,
London Swim School,,GDOS,Fulham Pools,Normand Park,Lillie Road,Fulham,,SW6 7ST,Tel: 020 7471 0463,"Run a full range of swimming classes for children at Janet Adegoke Swimming Pool and Fulham Pool.  See their website for information on classes, futur... <a href=https://www.netmums.com/local/l/london-swim-school-3>Read more</a>",,
Core Kensington,,GDOS,375 Kensington High Stret,Kensington,,London,London,W14 8AZ,Tel: 02078541934,Bespoke Pilates Kensington. We offer a great variety of classes and private Pilates classes at our boutique studio. We offer dedicated Ante and Post ... <a href="https://www.netmums.com/local/l/core-kensington">Read more</a>,,
Get Into Shape For The Summer With Hip Pilates,,GDOS,Nuffield Health,Stevenage Road,,London,Hammersmith and Fulham (London borough),SW6 6PF,Tel: 07900890439,"Would you like to get into shape before the summer, tone up your arms, core, bottom and legs and improve your fitness level?Do you enjoy Pilates but w... <a href=https://www.netmums.com/local/l/get-into-shape-for-the-summer-with-hip-pilates>Read more</a>",,
Yoga And Barre Fitness Classes,,GDOS,Lucid Balance Studio,Kinnear Road,next to Wendell Park Primary,London,,W12 9LB,Tel: 07447605372,"Community-focused, friendly yoga and barre fitness studio. Lucid Balance is your sanctuary offering empowering and rejuvenating classes for everyone.... <a href=https://www.netmums.com/local/l/yoga-and-barre-fitness-classes>Read more</a>",,
Mindfulness Course Chiswick,,GDOS,Binns Road,Chiswick,,London ,Middlesex,W4 2BS,Tel: 020 8995 3352,MBSR (Mindfulness Stress Reduction)  course in Chiswick. This 8 week course has been scientifically proven to have a positive impact on overall wellbe... <a href="https://www.netmums.com/local/l/mindfulness-course-in-chiswick">Read more</a>,,
Gymclass Holland Park - Get In The Best Shape Of Your Life!,,GDOS,168 Holland Park Avenue,,,London,,W11 4UH,Tel: 0207 460 1764,"GymClass Holland park is a boutique fitness studio offering fun,effective and motivational workouts throughout the day. Located on Holland Park Avenu... <a href=https://www.netmums.com/local/l/gymclass-holland-park-get-in-the-best-shape-of-your-life>Read more</a>",,
Mamalates,,GDOS,The Hayloft studio,3 Bond Street,,London,Hounslow (London borough),W4 1QZ,Tel: +447719978870,"Mamalates is an OB/GYN endorsed perinatal restorative, Pilates-based exercise method that focuses on alignment, stability and safely reclaiming your ... <a href=https://www.netmums.com/local/l/mamalates>Read more</a>",,
Rbkc Leisure Services - Buggy Workout,,GDOS,Holland Park ,Ilchester Place,,London,,W8 6LU,Tel: 02079388182,"A post-pregnancy exercise, with a mixture of cardio, toning and core stability work to help regain your fitness while spending time with your baby and... <a href=https://www.netmums.com/local/l/rbkc-leisure-services>Read more</a>",,
Buggyfit Postnatal Fitness Class,,GDOS,The Children's Wellness Centre,27a Fisher's Lane,Chiswick,London,,W4 1RX,Tel: 07947252317,Buggyfit is a safe and effective low-impact full-body workout for new mums and their babies. The class is delivered by a qualified pre- and postnatal ... <a href="https://www.netmums.com/local/l/buggyfit-postnatal-fitness-class">Read more</a>,,
New Chiswick Pool,,GDOS,Edensor Road,,,Chiswick,,W4 2RG,Tel: 0345 456 6675,Welcome to New Chiswick Pool - your first choice for the whole family to stay fit and active.We've got fantastic facilities on offer including a 25m s... <a href="https://www.netmums.com/local/l/new-chiswick-pool-1">Read more</a>,,
Swim School At  New Chiswick Pool,,GDOS,Edensor Road,,,Chiswick,,W4 2RG,Tel: 0345 456 6675,Learn to swim or improve your technique with us and jump into one of our pools today! Our swim school programme has many great reasons for you or your... <a href="https://www.netmums.com/local/l/chiswick-pool-swimming-lessons">Read more</a>,,
Shapeshifter Fitness,,GDOS,Queen Elizabeth Walk ,Barn Elms Sports Centre,,Barnes,London,SW13 0DG,Tel: 07805128578,DONT QUIT NOW!!!!!! We are well on our way into the new year but how many of us have stuck to our health and fitness New Years resolution? Maybe it w... <a href="https://www.netmums.com/local/l/shapeshifter-fitness">Read more</a>,,
Cardio Tennis,,GDOS,Southfield Recreation Ground,"Southfield Road, Mansell Road and Hatfield Road",Hounslow,London,Middlesex,W4 1AN,Tel: 447944572802,Cardio Tennis is a social and fun class for players of all ability levels taught by a tennis teaching professional or fitness professional. If you've ... <a href="https://www.netmums.com/local/l/cardio-tennis-5">Read more</a>,,
Yoga With Alison,,GDOS,Dance Attic Fulham,368 North End Road,,London,,SW6 1LY,Tel: 07815 587606,Hatha yoga classes suitable for all levels*. The postures can be adapted to the individual. The class consists of Sun Salutations (warm up exercises) ... <a href="https://www.netmums.com/local/l/yoga-with-alison">Read more</a>,,
Kensington Leisure Centre Swimming Lessons,,GDOS,Kensington Leisure Centre,Walmer Road,,London,,W11 4PQ,Tel: 020 7727 9747,Discovery Duckling 1 and 2This class is aimed at infants from 3 months until they are able to walk with no support from an adult. An adult must accomp... <a href="https://www.netmums.com/local/l/kensington-leisure-centre-swimming-lessons">Read more</a>,,
Nautilus Swimming @ Holland Park School,,GDOS,"Airlie Gardens,",Campden Hill Road,,London.,,W8 7AF,Tel: 07841127185,The Nautilus Swimming Learn to Swim programme offers an array of different lessons to suit all levels of swimmers.Whether you are looking for Private... <a href="https://www.netmums.com/local/l/nautilus-swimming-holland-park-school">Read more</a>,,
Beachbody Live Workout,,GDOS,St Johns Church,,,Fulham,,SW6 1PB,Tel: 07796077749,"Free trial fitness class for NetMums &amp; friends. Let me help you regain your fitness, strength and pre bundle of joy body. The instructor led vers... <a href=https://www.netmums.com/local/l/beachbody-live-workout-piyo-inspired-by-pilates-and-yoga>Read more</a>",,
Pre And Post Natal Personal Training Fulham Sw6,,GDOS,809 Fulham Road ,,,London ,,SW6 5HE,Tel: 07779794041,"Improve your health and fitness, one to one with an expert women's health and fitness personal trainer. I have years of experience working as a quali... <a href=https://www.netmums.com/local/l/pre-and-post-natal-personal-training-and-health-improvement>Read more</a>",,
Family Yoga,,GDOS,Fulham Library,598 Fulham Road,,Fulham,,SW6 5NX,Tel: 07793202201,Family Yoga is a fantastic way to reconnect after a busy week apart. Start your Sunday in a relaxing and joyful way together.Our classes are themed co... <a href="https://www.netmums.com/local/l/family-yoga-1">Read more</a>,,
Lucid Balance,,GDOS,Old Sorting Office Community Arts Centre,49 Station Road,Barnes Green,Barnes,,SW13 0LF,Tel: 07447605372,"Get strong, toned and supple physically and mentally.  Classes combine the wisdom of yoga with the precision and core focus of Pilates to deliver an ... <a href=https://www.netmums.com/local/l/lucid-balance-yoga-pilates-barre-1>Read more</a>",,
Women Only Indoor Bootcamp,,GDOS,Goldhawk Road ,W12,3 Haddon Court,London ,,W3 7HT,Tel: 447795101273,"If you are looking to get fit, stay in shape, lose weight, get stronger, healthier and have fun at the same time, then this is for you. Indoor Bootcam... <a href=https://www.netmums.com/local/l/women-only-indoor-bootcamp>Read more</a>",,
Fulham Palace Parkrun,,GDOS,"Bishopâ€™s Park, ","Bishop's Avenue, London, ",,Fulham ,,SW6 6EA,,"parkrun is a free, weekly, timed 5k run that takes place every Saturday at 9am. junior parkruns are 2k events specifically for 4 to 14 year olds, held... <a href=https://www.netmums.com/local/l/fulham-palace-parkrun>Read more</a>",,
Clifford Studios: Barre/Pilates/Yoga/Ballet,,GDOS,Village Nursery Hall,3a Station Road,,Barnes,Richmond,SW13 0LP,Tel: 07739006506,"To celebrate the addition of ADULT BALLET + YOGA classes to our current timetable, we are running a FREE taster day for all adult classes on Saturday... <a href=https://www.netmums.com/local/l/f-r-e-e-t-a-s-t-e-r-d-a-y-barre-pilates-yoga-ballet>Read more</a>",,
Pregnancy Yoga Classes With Lulu Winfield,,GDOS,The Power Yoga Co,The Glasshouse,11 - 12 Lettice Street,London,,SW6 4EH,Tel: 07951 320 141,"A gorgeous and friendly pregnancy yoga class with the extra special add in of tea and birth or baby focused chat at the end, often with speakers.  The... <a href=https://www.netmums.com/local/l/pregnancy-yoga-classes-with-lulu-winfield>Read more</a>",,
Pre And Postnatal Yoga With Lulu Winfield Fulham,,GDOS,The Glass House,11-12 Lettice street,Fulham,London,,SW6 4EH,Tel: 07951 320141,"PREGNANCY YOGA Pregnancy Yoga prepares you for labour and birth with the use of breath, gravity and movement. We use adapted postures to release tens... <a href=https://www.netmums.com/local/l/pre-and-postnatal-yoga-with-lulu-winfield>Read more</a>",,
Kensington Leisure Centre Swimming Lessons,,GDOS,Kensington Leisure Centre,Silchester Road,,London,,W10 6EX,Tel: 020 7727 9747,Swim School Award Scheme  stages 1 -10Swimming lessons are available for all ages<a href="http://www.netmums.com/kensington-chelsea/local/index/presch... <a href="https://www.netmums.com/local/l/kensington-leisure-centre-swimming-lessons-1">Read more</a>,,
Sohpie'S Yoga Classes In Fulham,,GDOS,Vida Studios,2 Fulham High Street,,London,,SW6 3LQ,Tel: 07825156921,"Sophie teaches a vinyasa flow style of yoga where movement is syncronised with the breath.  Her class is energetic and will build strength, flexibili... <a href=https://www.netmums.com/local/l/yoga-classes-in-fulham>Read more</a>",,
Daily Pilates Classes - Vida Pilates In Putney / Fulham,,GDOS,Vida Studios,2 Fulham High Street,(5 min walk over Putney Bridge),London,,SW6 3LQ,,"VIDA Studios holds Pilates classes on a daily basis and is situated on the edge of Bishops Park, just a 5 minute walk over Putney Bridge. Movement is... <a href=https://www.netmums.com/local/l/vida-pilates-new-matwork-classes-in-putney>Read more</a>",,
Online Pregnancy Yoga Lessons - Antenatal Yoga,,GDOS,Online,,,London,London,SW6 4TJ,,PREGNANCY YOGAONLINE PRIVATE PREGNANCY YOGA CLASS40 mins Zoom online private pregnancy yoga class - £2060 mins Zoom - £30Groups of 2 - £40(£5 extr... <a href="https://www.netmums.com/local/l/online-pregnancy-yoga-lessons-antenatal-yoga">Read more</a>,,
Carifit Babywearing Workouts,,GDOS,Slice Studios ,11 Heathmans Road,Parsons Green,London,,SW6 4TJ,Tel: 07967777294,"Are you a new mum wanting to get fit and have fun whilst doing it? CARiFIT is the workout for you! The workout is a low impact, core strengthening an... <a href=https://www.netmums.com/local/l/carifit-babywearing-workouts>Read more</a>",,
Skieasy: Indoor Skiing In Chiswick,,GDOS,Dukes Meadows Golf and Tennis,Dan Mason Drive,,London,,W4 2SH,Tel: 02089943314,"We're an indoor snow-sports club in Chiswick, West London offering lessons for all ages. Come and join our School Run Ski Club on weekday mornings ... <a href=https://www.netmums.com/local/l/skieasy-indoor-skiing-in-chiswick-1>Read more</a>",,
Fantastic Fulham Gym Helping Mum'S Regain Their Fitness And Confidence,,GDOS,353 New Kings Road,,,London,,SW6 4RJ,Tel: 0207 7361441,"Evolve was established in 2016 and has been helping Fulham, Parsons Green and Putney residents build their fitness and confidence ever since. We offe... <a href=https://www.netmums.com/local/l/fantastic-fulham-gym-helping-mum-s-regain-their-fitness-and-confidence>Read more</a>",,
Totum Fitness And Wellbeing,,GDOS,Redcliffe Street,,,London,London,SW10 9DR,Tel: 07789888738,"Totum Fitness is a highly trained company trading for over 10 years in the Kensigton and Chelsea area. We specialise in pre/post natal, pregnancy, re... <a href=https://www.netmums.com/local/l/totum-fitness-and-wellbeing-pilates-personal-training-nordic-walking>Read more</a>",,
Reformer Pilates &Amp; Barre,,GDOS,Core The Studio,110 Kensington Church Street,,London,,W8 4BH,Tel: 07796557675,Pilates is fantastic for building your core and by this we mean not just your abdominals but also your pelvic &amp; back muscles. You will be able to ... <a href="https://www.netmums.com/local/l/reformer-pilates-barre">Read more</a>,,
Swimming Lessons At Virgin Active Kensington,,GDOS,"3rd Floor, 17A Old Ct Pl",,,London,,W8 4PL,,"At Virgin Active Kensington, we offer both private and group swimming lessons for all ages to help your children grow their skill, technique and confi... <a href=https://www.netmums.com/local/l/swimming-lessons-at-virgin-active-kensington>Read more</a>",,
Swimming Lessons For Children Of All Ages At Virgin Active Kensington,,GDOS,3rd Floor 17A Old Ct Place,,,Kensington,London ,W8 4PL,Tel: 020 8124 4131,"Are you looking to get your child in a swimming program and hoping to get fit yourself at the same time? At Virgin Active Health Club in Kensington, w... <a href=https://www.netmums.com/local/l/swimming-lessons-for-children-of-all-ages-at-virgin-active-kensington>Read more</a>",,
Yoga With Stretch Breathe Smile,,GDOS,Mary's Living and Giving Shop for Save the Children,28 New Kings Road,Parson's Green,London,,SW6 4ST,,"Thursday night yoga, 7-8pm, £8 (cash).An open yoga class for all levels, with half of all proceeds going to Save the Children (with added gift aid!).... <a href=https://www.netmums.com/local/l/yoga-114>Read more</a>",,
Wormwood Scrubs Parkrun,,GDOS,"Wormwood Scrubs Park, ",,,"Shepherd's Bush, ",,W12 0DF,,"parkrun is a free, weekly, timed 5k run that takes place every Saturday at 9am. junior parkruns are 2k events specifically for 4 to 14 year olds, held... <a href=https://www.netmums.com/local/l/wormwood-scrubs-parkrun>Read more</a>",,
Zumba!,,GDOS,Notting Hill Community Church,Kensington Park Road,,London,Greater London,W11 2ES,Tel: 07788 676774,"So, you may ask, why should I take a Zumba class? What's so great about it? Well, the reason is simple: It's a fitness class with a difference beca... <a href=https://www.netmums.com/local/l/zumba-462>Read more</a>",,
Miss Faran Cooper,,GDOS,Flat 4 ,22 Finborough Road,Chelsea,London,,SW10 9EQ,Tel: 07549940654,Certified and insured Pilates instructor in Chelsea offering a range of different styles of Pilates including dynamic and post-natal. Please visit my... <a href="https://www.netmums.com/local/l/miss-faran-cooper-1">Read more</a>,,
Fc Fitness - Private Pilates Instructor In London,,GDOS,27A,Fawcett Street,Chelsea,London,,SW10 9EY,Tel: 07549940654,"Certified and insured Pilates instructor in central London offering a range of different styles of Pilates including traditional, dynamic and post-na... <a href=https://www.netmums.com/local/l/miss-faran-cooper>Read more</a>",,
Brand New- Swingtrain Fitness Class,,GDOS,St Mary's Church,High Street,Putney,London,,SW15 1SN,Tel: 07742778713,"SwingTrain is a swing dance inspired workout programme that brings the joy, fun and community feeling of swing dancing to the gym! Burn up to 500 calo... <a href=https://www.netmums.com/local/l/swingtrain-fitness-class>Read more</a>",,
Adult Ballet Classes! Wednesday 8-915Pm,,GDOS,"St Mary's Church, Lancaster Room",High Street,,Putney,,SW15 1SN,,"Whether you are new to Ballet or returning, please join us for classes on Wednesday in Putney! We cover barre work and centre exercises, all set to be... <a href=https://www.netmums.com/local/l/adult-ballet-classes-wednesday-8-9-15pm>Read more</a>",,
Pilates Classes In Notting Hill,,GDOS,11 Lambton Place,Notting Hill,,London,,W11 2SH,Tel: 02072292291,"Our Pilates Reformer Studio is open to all. We offer an array of classes suited to all levels, from beginners to advanced. During each class our expe... <a href=https://www.netmums.com/local/l/pilates-classes-notting-hill>Read more</a>",,
Gym In Notting Hill,,GDOS,11 Lambton Pl,,,London,,W11 2SH,Tel: 0207 229 2291,"A state-of-the-art gym with cardio equipment, resistance machines, wide range of free weights, bespoke TRX area, Stretch and Functional spaces. With ... <a href=https://www.netmums.com/local/l/gym-in-notting-hill>Read more</a>",,
Yoga Class W10,,GDOS,Pangbourne House,2 Pangbourne Ave,,London,,W10 6BT,Tel: 07568 649 449,"A powerful workout to build strength and flexibility. Work your body and calm your mind. All levels welcome, mats provided.7:30 - 8:30pm Thursday eve... <a href=https://www.netmums.com/local/l/yoga-class-w10>Read more</a>",,
Pre-/Post-Natal Pilates Classes On Equipment,,GDOS,"Virgin Active Building 3, 566 Chiswick High Rd, Chiswick, London W4 5YA, UK",,,Chiswick,,W4 5YA,Tel: 07768762826,Pregnant and thinking of Pilates to prepare your body for birth? Suffering from pregnancy back aches? Concerned about your pelvic floor and core stre... <a href="https://www.netmums.com/local/l/pre-post-natal-pilates-classes-on-equipment">Read more</a>,,
Chelsea Swim Spa,,GDOS,Edith grove,,,London,,SW10 0NW,Tel: 07988431229,"Discover our luxury private hydropool swim spa in the heart of Chelsea, SW10, LondonOur swimming pool is heated to 33ºC (91ºF) with a built-in ozon... <a href=https://www.netmums.com/local/l/chelsea-swim-spa>Read more</a>",,
Agile Fitness,,GDOS,282 Portobello Road,,,Notting Hill,,W10 5TE,Tel: 07717 436 439,Personal training company that specialises in pre and post natal exercise in small groups or personal training... <a href="https://www.netmums.com/local/l/agile-fitness">Read more</a>,,
Mamawell Postnatal Bootcamp,,GDOS,Wandsworth park,Entrance near Deodar Road,Putney,London,,SW15 2NY,,"Get fit and strong after the birth of your baby, and meet other lovely mums at the same time. The Mamawell bootcamp incorporates high energy cardio a... <a href=https://www.netmums.com/local/l/mamawell-postnatal-bootcamp>Read more</a>",,
Family Fitness Classes Putney,,GDOS,GetSetGo! Family Clubs,Tileman House,133 Upper Richmond Road,Putney,,SW15 2TR,,"Heroes on TourBringing you your favourite classes and studio heroes to your home, park or garden.Whilst our team are working to bring the space to li... <a href=https://www.netmums.com/local/l/family-fitness-classes-putney>Read more</a>",,
Evolve Wellness Centre,,GDOS,10 kendrick mews,,,London,,SW7 3HG,Tel: (0)20 7581 4090,Yoga is the ideal exercise for pregnant woman who are over 14 weeks pregnant. Pregnancy yoga is widely recommended by midwives and doctors to expecta... <a href="https://www.netmums.com/local/l/evolve-wellness-centre">Read more</a>,,
Angel Swim London,,GDOS,Park Walk Primary School,,,London,,SW10 0AY,Tel: 07435278910,"Welcome to Angel Swim London, we teach babies, toddlers and children to swim in our warm pool, just off the King's Road in Chelsea. Heated between 30... <a href=https://www.netmums.com/local/l/angel-swim-london>Read more</a>",,
Angel Swim - Chelsea,,GDOS,Park Walk Primary School,,,Chelsea,,SW10 0AY,Tel: +447435278910,"Welcome to Angel Swim London! We teach babies, toddlers and children to swim at our warm pool (heated between 30-32 degrees), just off King's Road - ... <a href=https://www.netmums.com/local/l/angel-swim-london-kings-road-chelsea>Read more</a>",,