Organisation Name,NACS Code,Organisation Type,Address1,Address2,Address3,Address4,Address5,PostCode,Telephone Number,Information supplied by,Value  (Information supplied by),Banding Classification  (Information supplied by)
Gokay Fitness Personal Training,,GDOS,Dulwich,Old Alleynianâ€™s Sport Grounds,,London,,SE21 7HA,Tel: 07872486891,I help really busy people “ who have tried everything else but failed “ to set and meet a deadline for getting fit and healthy.I specialise in des... <a href="https://www.netmums.com/local/l/gokay-fitness-personal-training">Read more</a>,,
Gokay Fitness,,GDOS,Dulwich and surrounds,,,London,,SE21 7HA,Tel: 07872486891,"I specialise in designing fun and effective training programmes that ensure my clients reach their fitness goals, whether thats toning up, gettin... <a href=https://www.netmums.com/local/l/dulwich-personal-trainer>Read more</a>",,
Groove Fit,,GDOS,Dulwich College - Trevor Bailey Sports Ground,,,London,,SE21 7HA,Tel: 07912184865,"Groove Fit is a sassy, funky and fun fitness class!  Bringing together dance, cardio, toning and strength moves creating a total body workout that sui... <a href=https://www.netmums.com/local/l/groove-fit>Read more</a>",,
Free Exercise Class For Mums,,GDOS,10 Station Approach,Sydenham,,London,,SE26 5EU,Tel: 02087788111,"Want your regain body confidence? Yet nervous to go to a conventional gym? Why not try Shapers Fitness for Women? We are offering all mums a FREE, no... <a href=https://www.netmums.com/local/l/free-exercise-class-for-mums>Read more</a>",,
Twist Studios - Post Natal Pilates - Forest Hill,,GDOS,99a Dartmouth Road,Forest Hill,,London,,SE23 3HT,Tel: 07737785567,"Pilates can play a key role in helping your body recover from pregnancy and birth, regaining strength in your pelvic floor and abdominal muscles. Thur... <a href=https://www.netmums.com/local/l/twist-studios-post-natal-pilates>Read more</a>",,
Twist Studios - Boxercise - Forest Hill,,GDOS,99a Dartmouth Road,Forest Hill,,London,,SE23 3HT,Tel: 07737785567,"Boxing movements meet aerobics in this intense form of cross training! Instructor and owner of Twist Studios, Adam Double, is not only a keen boxer, b... <a href=https://www.netmums.com/local/l/twist-studios-boxercise-forest-hill>Read more</a>",,
Twist Studios Yoga - Forest Hill,,GDOS,99a Dartmouth Road,Forest Hill,,London,,SE23 3HT,Tel: 07737785567,"Hot Yoga, Yoga for Cyclists, Hatha and Vinyasa Yoga all on offer at Twist Studios!Hot Yoga - Monday, 8.15pmYoga for Cyclists - Tuesday, 7pmHatha Yoga ... <a href=https://www.netmums.com/local/l/yoga-twist-studios-forest-hill>Read more</a>",,
Mindful Flow Yoga - Sydenham,,GDOS,Sydenham Tennis Club,Lawrie Park Road Sydenham,,LONDON,London,SE26 6ET,Tel: 07404891872,"Yoga and mindfulness have been proven to enhance physical health and mental well being. These classes teach you yoga poses to develop balance, flexib... <a href=https://www.netmums.com/local/l/vinyasa-yoga>Read more</a>",,
Cadence Indoor Cycling Wattbikes,,GDOS,Cadence,2a Anerley Hill,,Crystal Palace,London,SE19 2AA,Tel: 02086768825,"Indoor cycling session, sessions every day of the week,  for all abilities, prices from £10 check out the website for times and the latest deals. Ope... <a href=https://www.netmums.com/local/l/cadence-indoor-cycling-wattbikes>Read more</a>",,
Cadence Yoga And Pilates,,GDOS,Cadence,2a Anerley Hill,,Crystal Palace,London,SE19 2AA,Tel: 02086768825,"Yoga and Pilates classes daily, prices from £10. Check out our website for details and the very latest deals. Open 7 days, classes every day, various... <a href=https://www.netmums.com/local/l/yoga-and-pilates-2>Read more</a>",,
Crystal Palace National Sports Centre,,GDOS,Ledrington Road,,,London,,SE19 2BB,Tel: 020 8778 0131,"They have a teaching pool, 25m training pool, 50m racing pool and a diving pool therefore every type of swimmer is catered for.  Also runs London swim... <a href=https://www.netmums.com/local/l/crystal-palace-national-sports-centre-5>Read more</a>",,
Pilates In Dulwich,,GDOS,Dulwich College PE Centre,Pond Cottages,,London,London,SE21 7LE,Tel: 07852191716,This is a friendly and informal little class where we take a 'mindful' approach to the lovely movement form of Pilates.  This class will challenge yo... <a href="https://www.netmums.com/local/l/pilates-in-dulwich">Read more</a>,,
Chasamba Latin Dance Exercise Class!,,GDOS,"Energie Forest Hill, 26-28 London Road",Forest Hill,,London,,SE23 3HF,,Combining a weekly weigh in (Body Composition Analysis - to track body fat percentage) and nutrition advice with a dance fitness class called ChaSamba... <a href="https://www.netmums.com/local/l/chasamba-latin-dance-exercise-class">Read more</a>,,
Strength &Amp; Conditioning Coaching For All Abilities,,GDOS,Performance 360 Strength & Conditioning Gym,"Unit 2c, Victory Place",,Crystal Palace,London,SE19 3RW,,It is my mission to help and empower women and mums to feel more confident and become stronger and fitter!My name is Nadine "Phoenix" Guy and I am a ... <a href="https://www.netmums.com/local/l/strength-conditioning-coaching-for-all-abilities">Read more</a>,,
Zumba Fitness With Justyna,,GDOS,Lewisham Polish Centre,8 Waldram Park Road,Forest Hill,London,,SE23 2PN,Tel: 07925514660,"Zapraszam na Fitness Party. GwarantujÄ™ intensywne spalanie kalorii w rytmie muzyki Latino, a przede wszystkim Å›wietnÄ… zabawÄ™.PoniedziaÅ‚ek godz. 1... <a href=https://www.netmums.com/local/l/zumba-with-justyna>Read more</a>",,
Dulwich Pulse Bootcamp,,GDOS,Dulwich Park,"Old College Gate, Collage Road",,London,,SE21 7BQ,Tel: 07770696426,"Dulwich Pulse Bootcamp Intensive 8 week fitness transformation bootcamp by top personal trainer, Jennifer Mbazira.  This class is limited to 10 places... <a href=https://www.netmums.com/local/l/dulwich-pulse-bootcamp>Read more</a>",,
Dulwich Parkrun,,GDOS,Dulwich park,,,London,,SE21 7BQ,,"Parkrun is a free, weekly, timed 5k run that takes place every Saturday at 9 am. junior parkruns are 2k events specifically for 4 to 14 year olds, hel... <a href=https://www.netmums.com/local/l/dulwich-parkrun>Read more</a>",,
Daily Yoga &Amp; Pilates Classes,,GDOS,The Shala,"Third Floor, 1 Chestnut Rd",,London,,SE27 9EZ,Tel: 020 8670 7711,"The Shala is a well-respected yoga and Pilates centre in West Norwood/West Dulwich, South London. Housed in a beautifully refurbished Victorian wareh... <a href=https://www.netmums.com/local/l/daily-yoga-pilates-classes>Read more</a>",,
Post-Natal Pilates 6-Week Course,,GDOS,The Shala,"Third Floor, 1 Chestnut Road",,London ,,SE27 9EZ,Tel: 020 8670 7711,The Shala's six-week post-natal Pilates course provides an extremely safe and effective way to get your body back in shape post-partum. Re-training a... <a href="https://www.netmums.com/local/l/post-natal-pilates-6-week-course">Read more</a>,,
Zumba,,GDOS,Anerley Town Hall,Anerley Road,London,London,Bromley,SE20 8BD,Tel: 07967 304844,"Zumba is a dance based workout to the hottest Latin inspired Zumba rhythms. You don't need to have any dance experience, just turn up and follow our l... <a href=https://www.netmums.com/local/l/zumba-475>Read more</a>",,
Zumba,,GDOS,Christ Central Church Penge,Green Lane,Penge,London,,SE20 7JA,,"This class is all about having fun, making new friends and getting fit at the same time. There is no pressure to do everything perfectly or absolutely... <a href=https://www.netmums.com/local/l/zumba-500>Read more</a>",,
London Fitness Bootcamps - Honor Oak,,GDOS,Blythe Hill Fields,Honor oak,,London,,SE23 1AS,Tel: 07508880139,"ladies-only fitness bootcamps! Morning and evening classes!class times: 6.15am and 7pm, classes run monday-fridaypost-natal welcome. typical weight lo... <a href=https://www.netmums.com/local/l/honor-oak-fitness-bootcamps>Read more</a>",,
The Bridge Leisure Centre,,GDOS,Kangley Bridge Road,Lower Sydenham,,Lewisham,,SE26 5AQ,Tel: 02087787158,"Our swimming lessons will teach your child how to,1 Enter the water safely2 Jump in3 Float on my front4 Float on my back5 Roll over6 Blow bubbles7 Swi... <a href=https://www.netmums.com/local/l/the-bridge-leisure-centre-7>Read more</a>",,
Katyb-Yoga,,GDOS,Penge Congregational Church,High Street Penge,,Penge,,SE20 7QS,Tel: 0208 659 5201,"First class HALF PRICE £4.50 Hatha Yoga mixed ability classes with an experienced BWY Yoga teacher, fully insured.These classes help you relax body a... <a href=https://www.netmums.com/local/l/hatha-yoga-classes-for-mixed-ability>Read more</a>",,
Mums (And Dads) And Baby Yoga,,GDOS,Scout Hut,Herschell Rd,,Forest Hill,,SE23 1JN,Tel: 07736228038,I'm a local mum passionate about teaching yoga to fellow parents. This class is so that the mums (and dads) can do yoga - the babies just watch. I be... <a href="https://www.netmums.com/local/l/mums-and-dads-and-baby-yoga">Read more</a>,,
Insanity Beach Body Workout,,GDOS,St Saviours Church Hall,Brockley Rise,,LONDON,,SE23 1JN,Tel: 0771 2051208,Are you INSANE enough to join us?!INSANITY is the American crazy  Beachbody workout based on Max Interval Training. It is a high energy workout that ... <a href="https://www.netmums.com/local/l/flex-stretchfemale-fitness-class">Read more</a>,,
Slow Flow Yoga Class Tulse Hill (First Class Free!),,GDOS,James Wilson Coffee,357 Norwood Road,,LONDON,Lambeth,SE27 9BQ,Tel: 07503 924920,Slow Flow Yoga Class in Tulse Hill. The first class (Thurs 26th June) is free. A perfect way to bridge the transition between the end working day and... <a href="https://www.netmums.com/local/l/slow-flow-yoga-class-tulse-hill-first-class-free">Read more</a>,,
Splish Splash Swim School,,GDOS,St Josephs College,Beulah Hill,,Upper Norwood,,SE19 3HL,Tel: 020 8761 9357 Mobile: 07765 258 438,"Our aim is to teach each individual the fundamentals of swimming, following a structured programme in a non-competitive, fun environment, safely. For ... <a href=https://www.netmums.com/local/l/splish-splash-swim-school-3>Read more</a>",,
Hsinhealing Yoga Classes - Beckenham,,GDOS,Ravenscroft Road,,,Beckenham,,BR3 4TR,Tel: 07796957678,Do you have a good relationship with your own body? Do you know our body send us messages whether we are ware of them or not?  Do you know yoga can h... <a href="https://www.netmums.com/local/l/align-and-shine-hatha-flow-in-beckenham">Read more</a>,,
Mixed Level Pilates Class With Reframe Pilates,,GDOS,"Grafton Hall, 7 Village Way",,,London,,SE21 7AW,Tel: 07530937546,"Hi, I'm Holly Spence, founder of ReFrame Pilates. I am passionate about promoting health, vitality and wellness and I love exploring the connection of... <a href=https://www.netmums.com/local/l/mixed-level-pilates-class-with-reframe-pilates-1>Read more</a>",,
Jelly Belly Physio + Restore,,GDOS,21 Blackwater Street,,,East Dulwich,,SE22 8RS,Tel: 02035448462,Having a baby is no walk in the park! You may be feeling quite battered and bruised and unsure of the recovery process. Is my pelvic floor ok? Are my ... <a href="https://www.netmums.com/local/l/physio-restore">Read more</a>,,
Kisfitness Kettle Bell Fitness,,GDOS,Waterside centre,"26 Avenue Road, ",,South Norwood,London,SE25 4DX,Tel: 07961 097 214,"Fantastic Kettle bell classes are held in the Waterside centre.  This no frills exercise class is hard work, but very rewarding.  Fat loss programmes ... <a href=https://www.netmums.com/local/l/kisfitness>Read more</a>",,
Kisfitness - Pilates,,GDOS,Waterside centre,"26 Avenue Road, ",,South Norwood,London,SE25 4DX,Tel: 07961 097 214,"This Pilates toning class will stretch, strengthen and tone your body whilst strengthening your core.  Great for strengthening weak muscles in the ba... <a href=https://www.netmums.com/local/l/kisfitness-pilates>Read more</a>",,
Qi Gong Workshops For Health Rejuvenation And Re Energising,,GDOS,HSBC Sports Club,Lennard Road,,Beckenham,Kent,BR3 1QW,Tel: 07984665331,"Sunday Qi Gong workshops - 3 hours of Qi Gong theory and practice to Rejuvenate, Re balance &amp; Re energize.Qi Gong - Energy skill - has evolved ov... <a href=https://www.netmums.com/local/l/qi-gong-workshops-for-health-rejuvenation-and-re-energising>Read more</a>",,
A New You With Hayley Cross Pilates,,GDOS,Trinity Rise,,,London,,SW2 2QP,Tel: 07773128342,"Small group and private matwork classes based in Herne Hill / Tulse Hill for all abilities. Come and try a free taster class, and see how Pilates can... <a href=https://www.netmums.com/local/l/a-new-you-with-hayley-cross-pilates>Read more</a>",,
Perfect Poise Pilates - Classes In Streatham,,GDOS,Leigham Court Road,Leigham Court Road,Streatham,Streatham,London,SW16 2SD,Tel: 07958 900 288,Pilates is an excellent way for us all to unwind and de-stress at any time of the day. Come along and enjoy a friendly mat class in a relaxed and cal... <a href="https://www.netmums.com/local/l/pilates-in-streatham">Read more</a>,,
Indoor And Outdoor Mum And Baby Hiit Exercise Class,,GDOS,"Beckenham, West Wickham, Crystal Palace, West Norwood",Beckenham,,London,,BR3 4NQ,Tel: 07703101424,"MAMA MOJO FITNESS - Specialist Post Natal Personal Trainer offering Indoor and Outdoor mum and baby HIIT fitness classes. in Beckenham, West Wickham,... <a href=https://www.netmums.com/local/l/indoor-and-outdoor-mum-and-baby-hiit-exercise-class>Read more</a>",,
Mim'S Mother And Baby Post-Natal Pilates Classes - Crofton Park,,GDOS,St Hilda's Church,Brockley Road,,London,,SE23 1PL,Tel: 07946543286,"Friendly, local mother and baby post-natal Pilates classes in Crofton Park.A great way to recover from pregnancy and childbirth, strengthen and tone, ... <a href=https://www.netmums.com/local/l/mim-s-pre-natal-pilates-classes-crofton-park>Read more</a>",,
The Noble Art Of Yoga Body Positive Yoga Class / Curvy Yoga,,GDOS,Dulwich Con,33 East Dulwich Grove,,London ,,SE22 8PW,Tel: 07956 842328,Body positive yoga classes.  for everyBODY... <a href="https://www.netmums.com/local/l/body-positive-yoga-class-curvy-yoga-1">Read more</a>,,
Yoga Class In Camberwell (Mixed Ability),,GDOS,Flaxman Sports Centre/High Trees Learning Centre,"Tulse Hill, Clapham Park, Camberwell","SW2 2NS, SE4 8LE, SE5 9DF",London,,SW2 2NS,Tel: 07792482484,"Join us for a good stretch and energising morning practice on Saturday (or evening practice on Monday, Tuesday, Wednesday) including more and less tr... <a href=https://www.netmums.com/local/l/yoga-class-in-camberwell-mixed-ability>Read more</a>",,
Hulafit,,GDOS,Venue 28,28 Beckenham Road,,Beckenham,,BR3 4LS,Tel: 07843563436,Prepare to bring your core to the floor!Beginners welcomeHoops Provided£8 (pre-book)What better way to get fit than with a hula hoop! Channel your in... <a href="https://www.netmums.com/local/l/hulafit-1">Read more</a>,,
Mixed Level Pilates With Reframe Pilates,,GDOS,130 Herne Hill,,,London,,SE24 9QL,Tel: 07530937546,"Hi, I'm Holly Spence, founder of ReFrame Pilates. I am passionate about promoting health, vitality and wellness and I love exploring the connection of... <a href=https://www.netmums.com/local/l/mixed-level-pilates-with-reframe-pilates>Read more</a>",,
Mum And Baby Yoga,,GDOS,Oru Space,20 â€“ 22 Lordship Lane ,,London,,SE22 8HN,,"Postnatal Yoga at Oru Space, for parents and babies from six weeks (10 weeks if c-section) postnatal. Stretch, strengthen, breathe and relax. Yoga fo... <a href=https://www.netmums.com/local/l/mum-and-baby-yoga-1>Read more</a>",,
Fine Strokes Swim School,,GDOS,St.Dunstans College,Stanstead Road,,Catford,,SE6 4TY,,"Learning life skills in a safe &amp; friendly environment.ASA qualified instructors.Lessons held at St.Dunstans College, Catford every Saturday 1.30-3... <a href=https://www.netmums.com/local/l/swimming-lessons-for-children-adults>Read more</a>",,
Swim School,,GDOS,Stansted Road ,,,Catford ,London ,SE6 4TY,Tel: 02086901111,Fantastic swim school based in St Duntstan's College . Offering a variety of classes for both children and adults.Monday Tuesday Wednesday Saturday S... <a href="https://www.netmums.com/local/l/swim-school-6">Read more</a>,,
St Dunstan'S Summer Swim,,GDOS,Stanstead Road,London ,,London,London,SE6 4TY,Tel: 02086 901 111,"Dear Mums,This summer we will be launching crash course swimming lessonsThese lessons will be fun, whilst improving your child's confidence and techn... <a href=https://www.netmums.com/local/l/st-dunstan-s-swimschool>Read more</a>",,
St Dunstan'S Swim School,,GDOS,St Dunstan's college ,stansted road ,,Catford ,London ,SE6 4TY,Tel: 02085167205,"St Dunstans Swim school Newly formed and striving  St Dunstans enterprises is located at St Dunstans college , on Stanstead road in the heart... <a href=https://www.netmums.com/local/l/st-dunstan-s-college-2>Read more</a>",,
St Dunstans Swimming Lessons,,GDOS,St Dunstans Leisure Centre,Stanstead Road,,Catford,London,SE6 4TY,Tel: 0208 690 1111,SWIMMING LESSONS Now StartedAre you looking for swimming lessons for your children? our swim school has been running for 3 years and is well establish... <a href="https://www.netmums.com/local/l/catford-swimming-lessons">Read more</a>,,
Pregnancy Yoga,,GDOS,Station Hall,Herne Hill,,London,,SE24 0JW,,Friendly pregnancy yoga classes in Herne Hill. If you're new to yoga you're very welcome!The weekly classes are a beautiful way to connect deeply wit... <a href="https://www.netmums.com/local/l/pregnancy-yoga-23">Read more</a>,,
Adult Beginner/Interm Pilates,,GDOS,Kent County Cricket Ground,,Worsley Bridge Road,Beckenham,,BR3 1RL,Tel: 07400599902,"Mondays1915 “ 2015 “ Beginner/intermediate Adult PilatesKent County Cricket Ground, Worsley Bridge Rd, Beckenham BR3 1RLWeekly classesThere are... <a href=https://www.netmums.com/local/l/adult-beginner-interm-pilates>Read more</a>",,
Adult Beginner/Intermediate Pilates,,GDOS,Kent County Cricket Ground,Worsley Bridge Road,,Beckenham,,BR3 1RL,Tel: 07400599902,This is a great class for those who are new or returning to Pilates. It is fantastic to rebuilding your fitness after having children and strengthens ... <a href="https://www.netmums.com/local/l/adult-beginner-intermediate-pilates">Read more</a>,,
Mummy &Amp; Baby Postnatal Yoga,,GDOS,Goose Green Clinic,59 East Dulwich Road,35 Spenser Road,East Dulwich,London,SE22 9AP,,"Designed to bring you 'back together' after birth using yoga breathing, toning, strengthening, stretching and relaxation techniques. You needn't have ... <a href=https://www.netmums.com/local/l/mummy-baby-postnatal-yoga>Read more</a>",,
Pilates East Dulwich,,GDOS,Goosegreen clinic ,59 East Dulwich road ,East Dulwich ,LONDON,Southwark ,SE22 9AP,Tel: 07920062597,"This class focuses on establishing a strong foundation but will encourage you to challenge yourself creating a stronger, leaner and healthier body.  O... <a href=https://www.netmums.com/local/l/pilates-east-dulwich>Read more</a>",,
The Spa Beckenham,,GDOS,24 Beckenham Road,,,Beckenham,Kent,BR3 4PF,Tel: 020 8650 0233,".The Spa at Beckenham won the title of 'Best Public Swimming Pool in the UK' as voted by the Independent Newspaper in 2004, and its easy to see why th... <a href=https://www.netmums.com/local/l/the-spa-beckenham-1>Read more</a>",,
Online Pregnancy + Post-Natal Yoga + Pilates,,GDOS,12A Surrey Road,,,London,London,SE15 3AU,,"Our dedicated and comprehensive Pre + Post-Natal Yoga + Pilates classes by our specialist and supportive teachers include Yoga flows, Pilates session... <a href=https://www.netmums.com/local/l/online-pregnancy-post-natal-yoga-pilates-5>Read more</a>",,
Zumba Classes Every Thursday At 630Pm Starting 8 November,,GDOS,Goose Green Centre,62a East Dulwich Road,,London,,SE22 9AT,,Come join the fun at our Zumba Fitness classes! Dance those blues away and have a dose of exercise without even realising it “ even if you think yo... <a href="https://www.netmums.com/local/l/zumba-classes-every-thursday-at-6-30pm-starting-8-november">Read more</a>,,
Beckenham Pilates77 (Small Groups),,GDOS,77 Cedars road,,,Beckenham ,,BR3 4JQ,Tel: 07881554136,"Pilates77 is an intimate studio in the hart of Beckenham that holds small Pilates classes with 4 people max, tailored for the individual needs. We te... <a href=https://www.netmums.com/local/l/pilates77>Read more</a>",,
Pre &Amp; Post Natal Pilates Beckenham,,GDOS,77,Cedars Road,,Beckenham,Kent,BR3 4JQ,Tel: 07881554136,˜Pilates77                                                    Is an intimate studio in the heart of Beckenham which caters for mums who would li... <a href="https://www.netmums.com/local/l/pre-post-natal-pilates-beckenham">Read more</a>,,
Zumba Every Day Whatever Time You Like,,GDOS,On demand,,,Wherever you choose,,SE5 8HW,,"Get your dance groove on, any time and any intensity you like, with on demand classes from YAY!Ba's Reggie every day of the week.Zumba is a dance fitn... <a href=https://www.netmums.com/local/l/zumba-every-day-whatever-time-you-like>Read more</a>",,
Mind Over Matter Boxing Mummies  Women Only &Amp; Family Boxing Classes,,GDOS,McKenzies boxing club,Hamlets Health Club,"Edgar Kail Way, Dog Kennel Hill",East Dulwich,London,SE22 8BD,Tel: 07910230296,I am a fellow mum of 2 boys (age 2 and 4) so I know how hard it is to find time to exercise and find child care. This is why I have started classes f... <a href="https://www.netmums.com/local/l/mind-over-matter-boxing-mummies-women-only-family-boxing-classes">Read more</a>,,
Personal Training 1-2-1,,GDOS,,,,beckenham,,BR3 1UE,Tel: 07472707775,Get your fitness with these affordable personal training session i am doing for a great deal. I am a young female personal trainer who can accommodate... <a href="https://www.netmums.com/local/l/1-2-1-personal-training">Read more</a>,,
Studio Kooks Yoga &Amp; Pilates,,GDOS,Studio Kooks,Beckenham Place Mansion,Beckenham Place Park,Beckenham,,BR3 1UH,,"A gorgeous new studio at the Mansion, Beckenham Place Park, offering yoga and Pilates for all ages and abilities: prentatal, mums &amp; babies, kids,... <a href=https://www.netmums.com/local/l/studio-kooks-yoga-pilates>Read more</a>",,
Brockwell Parkrun Herne Hill,,GDOS,Brockwell Park,,,London ,,SE24 0PA,,"parkrun is a free, weekly, timed 5k run that takes place every Saturday at 9 am. junior parkruns are 2k events specifically for 4 to 14 year olds, hel... <a href=https://www.netmums.com/local/l/brockwell-parkrun-herne-hill>Read more</a>",,
Mummy &Amp; Baby Postnatal Yoga,,GDOS,Brockwell Lido,Brockwell Park,Dulwich Road,Herne Hill,London,SE24 0PA,,"Designed to bring you 'back together' after birth using yoga breathing, toning, strengthening, stretching and relaxation techniques. You needn't have ... <a href=https://www.netmums.com/local/l/mummy-baby-postnatal-yoga-1>Read more</a>",,
Brockwell Lido London,,GDOS,Brockwell Lido,Brockwell Park,"Dulwich Road, Herne Hill",London,,SE24 0PA,Tel: 020 7274 3088,"Brockwell Lido was opened in 1937, and has been a much-loved South London landmark ever since.It is also one of the few remaining outdoor swimming poo... <a href=https://www.netmums.com/local/l/brockwell-lido-1>Read more</a>",,
Yoga With Chris Streatham,,GDOS,Wyatt Park Road,Streatham Hill,,Streatham,London,SW2 3TP,Tel: 07866 801177,"A safe and mindful approach to traditional Hatha yoga, with influences of Scaravelli and other yoga traditions.Maximum of 9 students per class, allowi... <a href=https://www.netmums.com/local/l/morning-yoga-in-streatham-hill>Read more</a>",,
Mums With Kids Pilates Classes,,GDOS,Albrighton Centre,37 Albrighton Road,London,East Dulwich,,SE22 8AH,Tel: 07958900288,Mums often struggle to find time for themselves and exercise is often the first thing to be sacrificed. Join my mums and kids Pilates class and spend... <a href="https://www.netmums.com/local/l/mum-and-kids-pilates-classes">Read more</a>,,
Peckham Rye Parkrun London,,GDOS,Peckham Rye Park,Colyton Road,Southwark,London,,SE15 4JR,,"Parkrun is a free, weekly, timed 5k run that takes place every Saturday at 9 am. junior parkruns are 2k events specifically for 4 to 14 year olds, hel... <a href=https://www.netmums.com/local/l/peckham-rye-parkrun>Read more</a>",,