Organisation Name,NACS Code,Organisation Type,Address1,Address2,Address3,Address4,Address5,PostCode,Telephone Number,Information supplied by,Value  (Information supplied by),Banding Classification  (Information supplied by)
Br Health &Amp; Fitness - Thursday Exercise Classes,,GDOS,GL3 Community Hub,Cheltenham Rd East,Churchdown,Gloucester,Gloucestershire,GL3 1HX,Tel: 07971885972,"Fun, friendly fitness classes suitable for everyone regardless of experience, all exercises easily adapted! We work hard but have a blast doing it, wi... <a href=https://www.netmums.com/local/l/br-health-fitness-thursday-exercise-classes>Read more</a>",,
Dance Fitness Gold,,GDOS,GL3 Community Hub,Cheltenham Road East,,Churchdown,Gloucestershire,GL3 1HX,Tel: 07747466807,"Taking place in the main hall, £4.00 per session, no need to book. Classes run on Thursdays at 10.00am and also Mondays at 11.30am. Classes are 45 mi... <a href=https://www.netmums.com/local/l/zumba-gold-25>Read more</a>",,
Dance Fitness At Gl3 Community Hub,,GDOS,GL3 Community Hub,Cheltenham Road East,,Churchdown,Gloucestershire,GL3 1HX,Tel: 07747466807,"A high calorie burner dancing to your favourite songs, guaranteed to leave with a smile on your face.  Come and give it a try!Dance Fitness @ GL3 Hub... <a href=https://www.netmums.com/local/l/zumba-69>Read more</a>",,
Boxercise,,GDOS,Stoke Orchard Community Centre,Armstrong Road,,Stoke Orchard,Glos,GL52 7SB,Tel: 07957308968,Boxercise is a great way to exercise whilst having fun and get rid of the stresses of the day.  Boxericse will improve your strength and aerobic fitne... <a href="https://www.netmums.com/local/l/boxercise-69">Read more</a>,,
Puddle Ducks Baby Toddler &Amp; Preschool Swimming Lessons,,GDOS,Sports Direct,Tewkesbury Road,,Cheltenham,,GL51 0SJ,Tel: 01452 473073,*** 10% Discount off your first payment to all Netmums ***The Puddle Ducks swimming programme has been developed over 17 years and each individual le... <a href="https://www.netmums.com/local/l/puddle-ducks-baby-toddler-preschool-swimming-lessons-2">Read more</a>,,
Pound Fitness,,GDOS,All Saints Academy,Blaisdon Way,,Cheltenham,Gloucestershire,GL51 0WH,Tel: 01684294690,Want to try the new craze. Come and check out the new workout with attitude. Ripstix are provided please bring a mat and a towel with you.Check out my... <a href="https://www.netmums.com/local/l/pound-3">Read more</a>,,
Annelize Provide Zuu,,GDOS,All Saints Academy,Blaisdon Way,,Cheltenham,,GL51 0WH,Tel: 07970585741,"ZUU is a great 30 min workout that is low impact but high intensity. Its great for injury prevention and anyone can do it, young or old, fit or unfit... <a href=https://www.netmums.com/local/l/annelize-provide-zuu>Read more</a>",,
Puddle Ducks Baby Toddler &Amp; Preschool Swimming Lessons,,GDOS,Juvenate Health Club,Jurys Inn,Gloucester Road,Cheltenham,,GL51 0TS,Tel: 01452 473073,*** 10% Discount off your first payment to all Netmums ***The Puddle Ducks swimming programme has been developed over 17 years and each individual le... <a href="https://www.netmums.com/local/l/puddle-ducks-baby-toddler-preschool-swimming-lessons-3">Read more</a>,,
Spin Baby Spin,,GDOS,Tewkesbury Leisure Centre,Gloucester Road,,Tewkesbury,,GL20 5SX,Tel: 01684 293740,Every Monday at 14:00 we will be running:Spin Baby Spin Class descriptionLove Spin but dont have child care then bring your baby along! No flashing... <a href="https://www.netmums.com/local/l/pre-post-natal-fitness-classes-2">Read more</a>,,
Puddle Ducks Baby Toddler And Preschool Swimming Lessons,,GDOS,The Milestone School,Longford Lane,Longlevens,Gloucester,,GL2 9EU,Tel: 01452 473073,*** 10% Discount off your first payment to all Netmums ***The Puddle Ducks swimming programme has been developed over 17 years and each individual le... <a href="https://www.netmums.com/local/l/puddle-ducks-baby-toddler-and-preschool-swimming-lessons">Read more</a>,,
Rivers Leisure Swimming Lessons,,GDOS,Milestone school ,Longlevens,,Gloucester,,GL2 9EU,Tel: 07585 772 579,"Swimming lessons for all ages offering group and one to one lessons,Friends and family discounts and discounts for multiple children.Adult and baby le... <a href=https://www.netmums.com/local/l/swimming-lessons-77>Read more</a>",,
Start Your Baby'S Swim Journey At Milestones School,,GDOS,Milestones School,Longford Lane,,Gloucester,,GL2 9EU,Tel: 01684 296296,"Join us next term at Milestone School in Longlevens.As an independent swim school, we can ensure all our experienced and qualified teachers are deliv... <a href=https://www.netmums.com/local/l/start-your-baby-s-swim-journey-with-aquatots-swimming-1>Read more</a>",,
Barefoot Yoga,,GDOS,Churchdown Methodist Church,Chapel Hay Lane,Churchdown,Gloucester,Glos,GL3 2ET,Tel: 07776 234587,A gentle yoga practice including asanas (postures) breathing techniques and relaxation. Suitable for all ages and levels of experience. Beginners wel... <a href="https://www.netmums.com/local/l/miixed-ability-yoga-classes">Read more</a>,,
Tewkesbury Parkrun,,GDOS,"Vineyards,","Gander Lane,",,"Tewkesbury,","Gloucestershire,",GL20 5PG,,"parkrun is a free, weekly, timed 5k run that takes place every Saturday at 9am. junior parkruns are 2k events specifically for 4 to 14 year olds, held... <a href=https://www.netmums.com/local/l/tewkesbury-parkrun>Read more</a>",,
Dance Fitness At Sir Thomas Richs School,,GDOS,Oakleaze,,,Gloucester,Gloucestershire,GL2 0LF,Tel: 07747466807,"A high calorie burner dancing to your favourite songs, guaranteed to leave with a smile on your face. Every Wednesday 6.00 -6.45pm, £4 per class, no ... <a href=https://www.netmums.com/local/l/fitness-pilates-15>Read more</a>",,
Bigwaves Swim School,,GDOS,Dean close School Pool,,Shelburne Raod,Cheltenham,Glos,GL51 6HE,Tel: 07887752655,Pre school Swimming   1-3yrs on sunday Mornings with Parents classes at 8.30a.m and 11.00amLongest established Swim school in cheltenham running lesso... <a href="https://www.netmums.com/local/l/bigwaves-swim-school">Read more</a>,,
Dance Fitness And Pilates At Elmbridge Junior School,,GDOS,Elmbridge Junior School ,Sissons Road,,Elmbridge,Gloucestershire,GL2 0PE,Tel: 07747466807,"Dance Fitness - Great calorie burner, dance away to your favourite songs from pop, latino, golden oldies and latest chart hits and leave with a smile... <a href=https://www.netmums.com/local/l/zumba-212>Read more</a>",,
Puddle Ducks Baby Toddler And Pre School Swimming,,GDOS,DW Fitness,St Oswolds Retail Park,,Gloucester,,GL1 2TE,Tel: 01452 473 073,*** 10% Discount off your first payment to all Netmums ***The Puddle Ducks swimming programme has been developed over 17 years and each individual le... <a href="https://www.netmums.com/local/l/puddle-ducks-baby-toddler-and-pre-school-swimming-3">Read more</a>,,
Puddle Ducks Swim Academy,,GDOS,DW Fitness Clubs,St Oswolds Retail Park ,,Gloucester,,GL1 2TE,Tel: 01452 473073,Swim Academy is a range of classes offered by Puddle Ducks for primary school-aged children who want to learn to swim in a fun and structured atmosph... <a href="https://www.netmums.com/local/l/puddle-ducks-swim-academy-4">Read more</a>,,
Pilates For Runners,,GDOS,Spirit Health Club,Holiday Inn,Barnwood,Gloucester,Gloucestershire,GL4 3RX,Tel: 07305115940,"Pilates for Runners is for people who run, jog or jeff. or who run in their sport such as netball, hockey, football or rugby, triathletes etc. Whethe... <a href=https://www.netmums.com/local/l/pilates-for-runners>Read more</a>",,
Vinyasa Yoga For Fitness &Amp; Flexibility,,GDOS,CLC Sports Centre,,,Cheltenham,Gloucestershire,GL50 2NX,Tel: 07581 861 906,A fairly fast paced vinyasa yoga class. Membership to the sports centre is not required. This class is open to everyone and 18+This yoga is a physical... <a href="https://www.netmums.com/local/l/vinyasa-yoga-for-fitness-flexibility">Read more</a>,,
Clc Sports Centre,,GDOS,Malvern Road,,,Cheltenham,Gloucestershire,GL50 2NX,Tel: 01242 707484,Our pool isnt like most others. Thats because we have a state-of-the-art 25m pool with an ozone cleansing system. You wont smell of chlorine... <a href="https://www.netmums.com/local/l/clc-sports-centre">Read more</a>,,
Puddle Ducks Baby And Toddler Swimming,,GDOS,Honeybourne Gate,,,Cheltenham,,GL51 8DW,Tel: 01452 473073,*** 10% Discount off your first payment to all Netmums ***The Puddle Ducks swimming programme has been developed over 17 years and each individual le... <a href="https://www.netmums.com/local/l/puddle-ducks-baby-and-toddler-swimming-9">Read more</a>,,
Groupfit Gloucester Is A Community Centre Based Fitness Classes,,GDOS,Elmscroft Community Centre ,Coronation Grove ,,Gloucester,England,GL2 0SS,Tel: 07985317861,GroupFit Gloucester Is community centre fitness studio. The studio houses a range of Training Equipment and it is a great way of adding variety to yo... <a href="https://www.netmums.com/local/l/groupfit-gloucester-is-a-community-centre-based-fitness-classes">Read more</a>,,
Gloucestershire Fit Club,,GDOS,Greatfield Park Primary School,Hulbert Crescent,,Cheltenham,,GL51 3FZ,Tel: 07737 347854,"12 Weeks Body Transformation Outdoor Fit Club, for all ages, ability and fitness levels.GLOUCESTERSHIRE FIT CLUB is the brainchild of Luciano and Rob,... <a href=https://www.netmums.com/local/l/gloucestershire-fit-club-1>Read more</a>",,
Start Your Baby'S Swim Journey At Bettridge School,,GDOS,Bettridge School,Warden Hill Road,Up Hatherley,Cheltenham,,GL51 3AT,Tel: 01684 296296,"Join Us our next term at Bettridge School as we celebrate over two decades of excellence in baby swimming. As an independent swim school, we can ensu... <a href=https://www.netmums.com/local/l/start-your-baby-s-swim-journey-with-aquatots-swimming-2>Read more</a>",,
Puddle Ducks Swim Academy Cheltenham,,GDOS,The Bettridge School,Warden Hill Road,,Cheltenham,,GL51 3AT,Tel: 01452 473073,Swim Academy is a range of classes offered by Puddle Ducks for primary school-aged children who want to learn to swim in a fun and structured atmosph... <a href="https://www.netmums.com/local/l/puddle-ducks-swim-academy-6">Read more</a>,,
Stage One Swimming For 5-7 Year Olds In Cheltenham,,GDOS,Bettridge School,Warden Road,,Cheltenham ,,GL51 3AT,Tel: 01684 296 296,Aquatots will teach your child the nationally recognised Learn to Swim Programme for Stage One which is suitable for complete beginners between the ag... <a href="https://www.netmums.com/local/l/stage-one-swimming-for-5-7-year-olds-in-cheltenham">Read more</a>,,
Aquabumps - Aqua Natal Yoga With Aquatots,,GDOS,Bettridge School,Warden Hill Road,Up Hatherley,Cheltenham ,,GL51 3AT,Tel: 01684 296 296,"Aquatots now has Aqua Natal Yoga classes running in Cheltenham, Stroud and Worcester.Our water based Aquanatal Yoga classes are one of the best classe... <a href=https://www.netmums.com/local/l/aquabumps-aqua-natal-yoga-with-aquatots>Read more</a>",,
Leisure At Cheltenham,,GDOS,Tommy Taylors Lane,,,Cheltenham,Gloucestershire,GL50 4RN,Tel: 01242 528764,Swimming lessons from age 3 years to adults.12 week terms following the ASA National Plan.  All teachers are ASA Level 2 qualified... <a href="https://www.netmums.com/local/l/leisure-cheltenham-1">Read more</a>,,
Leisure@Cheltenham,,GDOS,Tommy Taylors Lane,,,Cheltenham,Gloucestershire,GL50 4RN,Tel: 01242 528764,Leisure at Cheltenham is brought to you by The Cheltenham Trust in partnership with Cheltenham Borough CouncilThese facilities and services are to ins... <a href="https://www.netmums.com/local/l/leisure-cheltenham">Read more</a>,,
Fitness For Any Stage Of Motherhood,,GDOS,Aspen Centre ,Studio Fit Gloucester ,Horton Road ,Gloucester ,Gloucestershire ,GL1 3PX,Tel: 07436 921240,We providePregnancy yogaMum and baby/toddler fitness classesFitness classes beyond whether you have just returned to work after having a baby or your... <a href="https://www.netmums.com/local/l/fitness-for-any-stage-of-motherhood">Read more</a>,,
Swing Train,,GDOS,"Fitness4Females, 100 Insley Gardens",Hucclecote,,Gloucester,,GL3 3BA,Tel: 01452 611 161,"A BRAND NEW fitness class inspired by the soulful sounds of Hot Jazz, Charleston and more! Fitness4Females is proud to be the first gym/fitness studi... <a href=https://www.netmums.com/local/l/swing-train>Read more</a>",,
Fitnss4Females,,GDOS,100 Insley Gardens,Hucclecote,,Gloucester,Gloucestershire,GL3 3BA,Tel: 01452611161,Wed love to see you at Fitness4Females where youre guaranteed personal fitness advice and a friendly atmosphere.  Staffed by a highly skilled t... <a href="https://www.netmums.com/local/l/fitnss4females">Read more</a>,,
Beginner Toddler Swimming Lessons In Gloucester,,GDOS,Gloucestershire Royal Hospital,Great Western Road,,Gloucester,,GL1 3NN,Tel: 01684 296 296,If your little one is aged between 18 months and 3 years old then we have the perfect swimming course for you! The aim of Aquatots Toddler lessons is... <a href="https://www.netmums.com/local/l/beginner-toddler-swimming-lessons">Read more</a>,,
Start Your Baby'S Swim Journey At Gloucestershire Royal Hospital,,GDOS,Gloucester Royal Hospital,Great Western Road,,Gloucester,,GL1 3NN,Tel: 01684 296296,"Join us next term at Gloucestershire Royal HospitalAs an independent swim school, we can ensure all our experienced and qualified teachers are delive... <a href=https://www.netmums.com/local/l/start-your-child-s-swim-journey-with-aquatots-swimming>Read more</a>",,
Start Your Baby'S Swim Journey At Tewkesbury School,,GDOS,Tewkesbury School,Ashchurch Road,,Tewkesbury,,GL20 8DF,Tel: 01684 296296,"Join Us for our next term at Tewkesbury School as we celebrate over two decades of excellence in baby swimming. As an independent swim school, we can... <a href=https://www.netmums.com/local/l/start-your-baby-s-swim-journey-with-aquatots-swimming-3>Read more</a>",,
Tewkesbury School Sports Centre,,GDOS,Ashchurch Road,,,Tewkesbury,Gloucestershire,GL20 8DF,Tel: 01684 293953,A new swim school with small class sizes to help children progress really well.  Following the ASA National Teaching Plan.   All teachers are fully qu... <a href="https://www.netmums.com/local/l/tewkesbury-school-sports-centre">Read more</a>,,
Mk Pilates,,GDOS,St Paul's Church,St Paul's Road,,"St Pauls, Cheltenham",,GL50 4EZ,Tel: 07794548822,"Megan is a qualified physiotherapist, trained in teaching Matwork Pilates and is able to use her knowledge and expertise to modify the exercises to su... <a href=https://www.netmums.com/local/l/pilates-for-beginners-6>Read more</a>",,
Sling Beat,,GDOS,Danceworks,St George's Street,,Cheltenham ,Gloucestershire,GL50 4AF,,"Are you looking for a fun fitness class where you can improve your health and wellbeing, without the worry of arranging childcare? Look no further! Sl... <a href=https://www.netmums.com/local/l/sling-beat>Read more</a>",,
Cheltenham Parkrun,,GDOS,"Pittville Park, ",,,Cheltenham.,,GL50 4PJ,,"parkrun is a free, weekly, timed 5k run that takes place every Saturday at 9am. junior parkruns are 2k events specifically for 4 to 14 year olds, held... <a href=https://www.netmums.com/local/l/cheltenham-parkrun>Read more</a>",,
Circuit Training (Popular For Women),,GDOS,Corse & Staunton Village Hall,Gloucester Road,,Staunton,,GL19 3RQ,Tel: 07963039106,"CAPT Circuit Training is proving popular for the ladies and provides a fun, challenging and extremely effective way to get fit, energise and tone up!... <a href=https://www.netmums.com/local/l/circuit-training-popular-for-women>Read more</a>",,
Cheltenham Morning Hatha Yoga With Ruth,,GDOS,Yoga Well,Parmoor House,13 Lypiatt Terrace,Cheltenham,,GL50 2SX,Tel: 07702 943593,"Get in your yoga practice after the school run, awakening the body, and activating joints and muscles.  We stretch and strengthen with the breath, br... <a href=https://www.netmums.com/local/l/cheltenham-morning-hatha-yoga-with-ruth>Read more</a>",,
Zumba Class With Amy,,GDOS,Warden Hill Primary School,Durham Close,,Cheltenham,Gloucestershire,GL51 3DF,Tel: 07932744848,"All levels welcome. 6.30-7.30pm Mondays and 7pm Thursdays. Charty tracks, great moves and you will leave on a high knowing you have burned some serio... <a href=https://www.netmums.com/local/l/zumba-fitness-184>Read more</a>",,
Annelize Provide Onefitcore Cheltenham,,GDOS,The Brizen Young Peoples Centre,"Up Hatherley Way, ",,Cheltenham,,GL51 4BB,Tel: 07970585741,The OneFitCore is a 6 week specialist course designed by a leading womens physio therapist to provide you with the tools to help strengthen and resto... <a href="https://www.netmums.com/local/l/annelize-provide-onefitcore-cheltenham">Read more</a>,,
Zumba Gold (Low Impact)  @ Hucclecote Community Centre Gloucester,,GDOS,Hucclecote Community Centre,Hucclecote Road,Hucclecote,"Gloucester,",Gloucestershire,GL3 3RT,Tel: 07704 600 583,"If you want to lose weight and get healthy...but œregular exercise programs seem intimidating, painful or boring, youre not alone¦More and ... <a href=https://www.netmums.com/local/l/zumba-gold-hucclecote-community-centre>Read more</a>",,
Quay Yoga Studio,,GDOS,Suite4Fullers Court,Lower Quay Street,,Gloucester,Gloucestershire,GL1 2LW,Tel: 07778507838,"Quay Yoga Studio is Gloucester's local yoga studio. We are a vibrant, friendly and bespoke studio offering a variety of yoga and fitness classes with ... <a href=https://www.netmums.com/local/l/quay-yoga-studio>Read more</a>",,
Turtle Tots Baby &Amp; Toddler Swimming Lessons In Gloucester,,GDOS,Turtle Tots Gloucestershire,Bruton Way,,Gloucester,,GL1 1DT,Tel: 07718220642,Turtle Tots are incredibly proud to run our swim school in a child-led approach and all our teachers training is based on the very latest research on... <a href="https://www.netmums.com/local/l/turtle-tots-baby-toddler-swimming-lessons-in-gloucester">Read more</a>,,
Swim School At Gl1 Leisure Centre,,GDOS,Bruton Way,,,Gloucester,,GL1 1DT,Tel: 0845 643 4203,GL1 award winning Swim School offers all kids the opportunity to learn to swim in a well structured environment.The ASA National teaching plan is a mu... <a href="https://www.netmums.com/local/l/swim-school-at-gl1-leisure-centre">Read more</a>,,
Gl1 Leisure Centre - Group Exercise Classes,,GDOS,GL1 Leisure Centre,Bruton Way,,Gloucester,Gloucestershire,GL1 1DT,Tel: 0845 643 4203,"With a large and well-equipped gym, the innovative Xpress Fitness Suite and a huge range of over 50 group exercise classes per week, GL1 Leisure Centr... <a href=https://www.netmums.com/local/l/group-exercise-classes-at-gl1-leisure-centre>Read more</a>",,
Gl1 Leisure Centre Xpress Fitness Studio,,GDOS,GL1 Leisure Centre,Bruton Way,GL1 Leisure Centre,Gloucester,Gloucestershire,GL1 1DT,Tel: 0845 643 4203,Xpress at GL1 is a multi-functional fitness studio. The studio houses a range of Keiser Equipment and it is a great way of adding variety to your work... <a href="https://www.netmums.com/local/l/xpress-fitness-studio-at-gl1-leisure-centre">Read more</a>,,
Ann Morley Yoga,,GDOS,Cheltenham Holistic Health Centre,Camargue House,32 Wellington Rd,Cheltenham,,GL52 2AG,Tel: 07521684883,"I offer yoga classes in Cheltenham, with a range of styles. I love both the more dynamic physically demanding and slower meditative classes - each has... <a href=https://www.netmums.com/local/l/ann-morley-yoga>Read more</a>",,
Cheltenham Fitness Kickboxing,,GDOS,Cheltenham Martial Arts,66 Albion Street,,Cheltenham,Gloucestershire,GL52 2RW,Tel: 01242 245914,"We combine cardio, resistance and interval training to give you the most energising workout possible. Individually, each of these forms of exercise i... <a href=https://www.netmums.com/local/l/cheltenham-martial-arts>Read more</a>",,
Sweaty Mama Class,,GDOS,Badgeworth Lane,Shurdington,,Cheltenham,,GL51 4TB,Tel: 07360 131 662,"Sweaty Mama is a fab, fun workout with your child. Enjoy exercise while you bond with your baby, toddler or pre-schooler. Sweaty Mama has music and m... <a href=https://www.netmums.com/local/l/sweaty-mama-class-5>Read more</a>",,
Your Happy Size From Helen Yarnold,,GDOS,All Saints Academy,,,Cheltenham,Gloucestershire,GL52 3AL,Tel: 07740309750,Want to lose weight and love your shape? Classes in Cheltenham for those of you who are sick of dieting and want support from someone who has been the... <a href="https://www.netmums.com/local/l/your-happy-size-from-helen-yarnold">Read more</a>,,
Swimming By Design,,GDOS,,,,Cheltenham,,GL53 7HT,Tel: 01242 279 599,Expert swimming lessons for children &amp; adults. Our modern scientific approach encourages all our students to learn good habits from the outset. Sm... <a href="https://www.netmums.com/local/l/swimming-by-design">Read more</a>,,
Postnatal Yoga With Your Baby,,GDOS,Ashchurch Village Hall,Ashchurch,,Tewkesbury,,GL20 8JX,Tel: 01242 572068,"Focusing on postnatal recovery, this 6 week course is a great way to enjoy gentle, appropriate, exercise after the birth of your baby, in the supporti... <a href=https://www.netmums.com/local/l/postnatal-yoga-with-your-baby-1>Read more</a>",,
Annelize Provide Onefitmama Brockworth,,GDOS,St Georges Church Centre,Court Road,,Brockworth,,GL3 4QU,Tel: 07970585741,Exercise for mums with or without their baby and/or toddler.OneFitMama classes are designed to help mums get into shape without having to arrange chi... <a href="https://www.netmums.com/local/l/annelize-provide-onefitmama-brockworth">Read more</a>,,
Onefitmama Brockworth,,GDOS,St Georges Church Centre,Court Road,,Brockworth,,GL3 4QU,Tel: 07970585741,Exercise for mums with or without their babies and/or toddler.OneFitMama classes are designed to help mums get into shape without having to arrange c... <a href="https://www.netmums.com/local/l/onefitmama-brockworth">Read more</a>,,
Turtle Tots Baby And Toddler Swimming Lessons In Cheltenham,,GDOS,Turtle Tots Gloucestershire,Oxford Street,,Cheltenham,,GL52 6DT,Tel: 07718 220642,Turtle Tots are incredibly proud to run our swim school in a child-led approach and all our teachers training is based on the very latest research on... <a href="https://www.netmums.com/local/l/turtle-tots-gloucestershire-baby-and-toddler-swimming-lessons">Read more</a>,,
Sandford Parks Lido Cheltenham,,GDOS,Sandford Parks Lido,Keynsham Rd,,Cheltenham,Gloucestershire,GL53 7PU,Tel: 01242524430,"Sandford Parks Lido is a great day out in the heart of Cheltenham, on the edge of the Cotswolds. It is a children's paradise with slides, a children's... <a href=https://www.netmums.com/local/l/sandford-parks-lido-2>Read more</a>",,
Chichi Fit With Ginny: Musical Theatre Dance Fitness,,GDOS,Brockworth Community Centre,,,Brockworth,,GL3 4ET,,"Dance along to The Greatest Showman, Lion King, 42nd Street, Footloose, Chicago and more! No dance experience necessary and all ages from 0-100 are w... <a href=https://www.netmums.com/local/l/chichi-fit-with-ginny-musical-theatre-dance-fitness>Read more</a>",,
Capt Circuit Training,,GDOS,Highnam Community Centre,Parish Rooms,Newent Road,Highnam,,GL2 8DG,Tel: 07963039106,"CAPT Circuit Training is proving popular for the ladies and provides a fun, challenging and extremely effective way to get fit, energise and tone up!... <a href=https://www.netmums.com/local/l/capt-circuit-training>Read more</a>",,
Turtle Tots Baby &Amp; Toddler Swimming Lessons At Leonard Cheshire Home,,GDOS,Turtle Tots Gloucestershire,Leonard Cheshire Home,Charlton Lane,Cheltenham,,GL53 9HD,Tel: 07718220642,Turtle Tots are incredibly proud to run our swim school in a child-led approach and all our teachers training is based on the very latest research on ... <a href="https://www.netmums.com/local/l/turtle-tots-baby-toddler-swimming-lessons-in-cheltenham">Read more</a>,,