Organisation Name,NACS Code,Organisation Type,Address1,Address2,Address3,Address4,Address5,PostCode,Telephone Number,Information supplied by,Value  (Information supplied by),Banding Classification  (Information supplied by)
Fitt Fitness - Fittyoga,,GDOS,Thisleworth Tennis Club,"129a Ridgeway Road North,",Osterley,Isleworth,Surrey,TW7 5LX,Tel: 07766950650,Do you have dreams of a regular yoga practice ? But then life gets in the way it just never happens? You spend a lot of your time caring for your fami... <a href="https://www.netmums.com/local/l/yoga-class-22">Read more</a>,,
Fitt Fitness - Fittbodytone,,GDOS,Thisleworth Tennis Club,129a Ridgeway Road North,,"Osterley, Isleworth ",,TW7 5LX,Tel: 07766950650,Are you  TIRED all the time?Are you sleep deprived and feel unfitt ?Are you CONFUSED about nutrition and what workouts is good for you and all the con... <a href="https://www.netmums.com/local/l/fittbodytone">Read more</a>,,
London Baby Swim - Osterley,,GDOS,178 WOOD LANE,,,ISLEWORTH,Middlesex,TW7 5EH,Tel: 020 8400 9091,London Baby Swim offer Baby &amp; Toddler Swimming lessons with water confidence and safety as our number one priorities. We provide a gentle introdu... <a href="https://www.netmums.com/local/l/london-baby-swim-osterley">Read more</a>,,
London Baby Swim,,GDOS,178 Wood Lane,,,Osterley,Middlesex,TW7 5EH,Tel: 02084009091,At London Baby Swim we offer safe and fun swimming lessons for babies from six weeks old up to toddlers of four years of age.Our privately owned cent... <a href="https://www.netmums.com/local/l/london-baby-swim">Read more</a>,,
Osterley Parkrun,,GDOS,Osterley Park ,Jersey Road,,Isleworth,,TW7 4RB,,"Parkrun is a free, weekly, timed 5k run that takes place every Saturday at 9 am. junior parkruns are 2k events specifically for 4 to 14 year olds, hel... <a href=https://www.netmums.com/local/l/osterley-parkrun>Read more</a>",,
Grounded Yoga,,GDOS,St John's Centre,St John's Road,,Isleworth,,TW7 6NW,Tel: 07779617895,"Grounded Yoga - yoga for allRelax, reinvigorate and get ready for the weekend with a yoga class to make your mind and body both energised and at ease... <a href=https://www.netmums.com/local/l/grounded-yoga>Read more</a>",,
Pilates And Mother And Baby Exercise Class @ Vcr Fitness,,GDOS,116 Syon Lane,"SYON LANE,",,Isleworth,,TW7 5NJ,Tel: 07961002185,mother and baby exercise class Thursdays 1.30Mummy quiet time in Pilates class Tuesday 10am or Thursday 8pmWork those problem areas and get your body... <a href="https://www.netmums.com/local/l/pilates-and-mother-and-baby-exercise-class-vcr-fitness-isleworth">Read more</a>,,
Yoga Classes In Hounslow,,GDOS,Aham Yoga Home ,"Unit 4, 1st floor Amber house,Opp to TK max",Hounslow High Street,Hounslow,,TW3 1EF,Tel: 07869348834,Yoga for all !! At Aham Yoga home Studio on Hounslow High Street.Daily various Yoga style classes : Tue - Fri At 7.30am-8.30am &amp;7.30pm-8.30pmKIds... <a href="https://www.netmums.com/local/l/yoga-classes-39">Read more</a>,,
Heston Pools And Fitness,,GDOS,New Heston Road,,,Heston,,TW5 0LW,Tel: 0345 456 6675,"Opened in 2016, the centre offers an array of fantastic facilities including two swimming pools, gym with all the latest fitness equipment, an extens... <a href=https://www.netmums.com/local/l/heston-pools-and-fitness>Read more</a>",,
Swim School At Heston Pools And Fitness,,GDOS,New Heston Road,,,Heston,,TW5 0LW,Tel: 0345 456 6675,Learn to swim or improve your technique with us and jump into one of our pools today! Our swim school programme has many great reasons for you or you... <a href="https://www.netmums.com/local/l/swim-school-at-heston-pools-and-fitness">Read more</a>,,
Isleworth Leisure Centre,,GDOS,Twickenham Road,,,London,,TW7 7EU,Tel: 0345 456 6675,"Visitors can take advantage of 2 swimming pools, a 100 station gym with the latest fitness equipment, a cafe-bar, crÃ¨che, health suite and outdoor c... <a href=https://www.netmums.com/local/l/isleworth-leisure-centre>Read more</a>",,
Swim School At Isleworth Leisure Centre,,GDOS,Twickenham Road,,,Isleworth,,TW7 7EU,Tel: 0345 456 6675,"many great reasons for you or your child to improve your swimming ability, such as:¢	Badges and certificates to celebrate your success¢	Swim Engla... <a href=https://www.netmums.com/local/l/swim-school-at-isleworth-leisure-centre>Read more</a>",,
Isleworth Leisure Centre &Amp; Library,,GDOS,Twickenham Road,,,Isleworth,Middlesex,TW7 7EU,Tel: 0345 456 6675,Welcome to Isleworth Leisure Centre &amp; Library - your first choice for the whole family to stay fit and active in the heart of Hounslow. Visitors c... <a href="https://www.netmums.com/local/l/isleworth-leisure-centre-library">Read more</a>,,
Swim School At Isleworth Recreation Centre,,GDOS,Twickenham Road,,,Isleworth,Middlesex,TW7 7EU,Tel: 0345 456 6675,We offer a comprehensive learn to swim programme working in partnership with Swim England's National Plan for Teaching Swimming.Our award winning less... <a href="https://www.netmums.com/local/l/swimming-lessons-isleworth-recreation-centre">Read more</a>,,
Puddle Ducks,,GDOS,Heston Hyde Lane ,,Hounslow,Middlesex,,TW5 0EP,Tel: 02085468470,"Classes are packed full of fun, watch as your little one develops into a confident swimmer without even realising they are learning to swim! We recog... <a href=https://www.netmums.com/local/l/puddle-ducks-heston-hyde-hotel>Read more</a>",,
Baby And Toddler Swimming With Turtle Tots,,GDOS,Heston Hyde Hotel,North Hyde Lane,,Houndslow,,TW5 0EP,Tel: 07402528860,Turtle Tots is a unique and innovative swimming programme that begins with aqua-natal yoga for mums-to-be and continues with our specialised and prog... <a href="https://www.netmums.com/local/l/baby-and-toddler-swimming-with-turtle-tots-4">Read more</a>,,
Clubbercise Isleworth,,GDOS,Isleworth Public Hall,South Street,,Isleworth,Middlesex,TW7 7BG,Tel: 07714 899 624,Bringing a night out to your fitness workout!&gt;&gt;&gt;Disco Lights &gt;&gt;&gt;Glow Sticks &gt;&gt;&gt;Cub Anthems &gt;&gt;&gt;Simple RoutinesWhat ... <a href="https://www.netmums.com/local/l/clubbercise-isleworth">Read more</a>,,
Pilates Studio Ealing - Pilates Body Shape,,GDOS,20 Boston Parade,,,Hanwell,,W7 2DG,Tel: 0 794 782 2911,"Looking for Pilates Studio Ealing? If yes, then Pilates Body Shape is the best choice for you. We have a group of completely qualified Pilates Instru... <a href=https://www.netmums.com/local/l/pilates-studio-ealing-pilates-body-shape>Read more</a>",,
Private Swimming Lessons,,GDOS,Whitton,Twickenham,,Twickenham,Middlesex,TW2 7ED,,"I am a qualified level 2 aquatics teacher, teaching all ages and abilities in a very warm private pool in my NEW LOCATION, WHITTON TWICKENHAM.Please ... <a href=https://www.netmums.com/local/l/swimming-lessons-49>Read more</a>",,
Barre With Your Baby,,GDOS,383 St Margaretâ€™s Road ,,,Twickenham ,,TW1 1PP,,"Find some ME time, move your body again and meet new parents. I know motherhood can sometimes feel lonely and Ive created this class to support ne... <a href=https://www.netmums.com/local/l/barre-with-your-baby>Read more</a>",,
Physiotherapist Led Pilates Classes,,GDOS,383 St Margarets Rd,St Margarets,,Twickenham,,TW1 1PP,Tel: 020 3719 7256,"At the St Margarets Physiotherapy Clinic we offer a wide range of treatments including Physiotherapy, Acupuncture, Massage and Pilates for beginners,... <a href=https://www.netmums.com/local/l/physiotherapist-led-pilates-classes-1>Read more</a>",,
Amanda Wilkes Yoga,,GDOS,St Philip & St James Church,Hounslow Road,,Whitton,Middlesex,TW2 7DY,Tel: 07985 598463,"Start your Thursdays off in the best possible way by joining me for an hour of gentle beginners Vinyasa Flow Yoga.Patanjali, the great sage and autho... <a href=https://www.netmums.com/local/l/beginners-gentle-vinyasa-flow-yoga-1>Read more</a>",,
Zumba Class In Whitton,,GDOS,St Phillip & St James Church,Kneller Road off Hounslow Road,Whitton,Twickenham,Middlesex,TW2 7DY,Tel: 07974948656,7.30pm Zumba for an hour £7 on Friday. 9.30am Zumba Gold 45 minute class £5 on Wednesday. Come to our friendly classes and blast away those calorie... <a href="https://www.netmums.com/local/l/zumba-286">Read more</a>,,
Beginners/Gentle Vinyasa Flow Yoga In Whitton,,GDOS,St Philip & St James Church,Hounslow Road,,Whitton,Middlesex,TW2 7DY,Tel: 07985 598463,"Join me for an hour's gentle flow yoga on Thursday mornings, starting on 14th AprilYoga philosophy tells us that yoga is a state of being. It occurs ... <a href=https://www.netmums.com/local/l/beginners-gentle-vinyasa-flow-yoga>Read more</a>",,
Swingtrain,,GDOS,St.Paulâ€™s Church Hall,Ridley Avenue ,Ealing,London,,W13 9XW,Tel: 07885750504,"SWINGTRAIN IS¦A FUN AND EFFECTIVE DANCE CARDIO WORKOUT INSPIRED BY THE JOYFUL, ENERGETIC SOUNDS OF CHARLESTON, SWING, GOSPEL, ELECTRO SWING AND HOT... <a href=https://www.netmums.com/local/l/swingtrain-6>Read more</a>",,
Chi Kung Shibashi Classes,,GDOS,Fielding Primary School,Wyndham Road,,Northfields,,W13 9TE,Tel: 07973 756006,"Shibashi Chi Kung (also known as Qigong) is a gentle form of exercise which helps to improve energy levels, physical flexibility and mobility and bala... <a href=https://www.netmums.com/local/l/chi-kung-shibashi-classes>Read more</a>",,
Mum And Baby Yoga South Ealing,,GDOS,Blondin Pavilion,Blondin Park,,Ealing,London,W5 4UL,Tel: 07825154913,"Postnatal mum and baby yoga in the heart of beautiful Blondin Park. Class includes gentle hatha yoga to help stretch, relax and build strength after ... <a href=https://www.netmums.com/local/l/mum-and-baby-yoga-south-ealing>Read more</a>",,
Mum And Baby Yoga Northfields,,GDOS,Blondin Pavilion,Blondin Park ,,Ealing,London,W5 4UL,Tel: 07825154913,Postnatal mum and baby yoga in the heart of beautiful Blondin Park. Every Tuesday at 11.30amTry your first class for £5Class includes gentle hatha y... <a href="https://www.netmums.com/local/l/mum-and-baby-yoga-south-ealing-2">Read more</a>,,
Phoenix Yogis - New Yoga And Mindfulness Classes - Twickenham,,GDOS,All Hallows Church,138 Chertsey Road,,Twickenham,Surrey,TW1 1EW,Tel: 07842 821 015,"Local weekly Yoga and Mindfulness classes in Twickenham Teaching incorporates physical postures (asana), breathing techniques (pranayama), meditation ... <a href=https://www.netmums.com/local/l/new-yoga-and-mindfulness-classes-twickenham>Read more</a>",,
Wildcats Combat Martial Arts &Amp; Life Skills - Ealing,,GDOS,Ealing Fields High School,,,Ealing,,W5 4EJ,Tel: 020 8156 4747,"Were on a mission to help children build unshakeable confidence and develop key developmental skills such as; Perseverance, Leadership, Disciplin... <a href=https://www.netmums.com/local/l/wildcats-combat-martial-arts-life-skills-ealing>Read more</a>",,
New Fitness Class Starting Friday The 11Th Of May,,GDOS,St Pauls Recreation Ground,Brentford ,,Brentford ,,TW8 0PN,Tel: 07990552354,"Hi all,A new fitness class, that is affordable and doesn't need a babysitter! Starting this Friday the 11th of May. It's £5, and a drop in. Bring any... <a href=https://www.netmums.com/local/l/how-do-i-keep-fit-and-healthy-during-and-after-pregnancy>Read more</a>",,
Pregnancy Yoga,,GDOS,The National Sikh Resource Centre,First Floor,Dominion Road,Southall,,UB2 5AA,Tel: 07951333661,"Juliane leads weekly pregnancy yoga classes from the Kundalini yoga lineage, inviting self awareness through gentle exercises and breathing techniques... <a href=https://www.netmums.com/local/l/pregnancy-yoga-373>Read more</a>",,
Kundalini Yoga,,GDOS,The National Sikh Resource Centre ,1st Floor,Dominion Road,Southall,,UB2 5AA,Tel: 07951333661,"A daytime Kundalini Yoga class ideal for flexible schedules. This class is term based and open to all levels. Using various breathing techniques, warm... <a href=https://www.netmums.com/local/l/kundalini-yoga-10>Read more</a>",,
Hulabop Hula Hoop Fitness Classes For Grown Ups,,GDOS,All souls church hall,Northcote Rd,St Margarets,Twickenham,Middlesex,TW1 1RR,Tel: 07817850829,"Learn to hula hoop and burn 400 calories an hour doing it! It's loads of fun.Tones abs, hips, bum,arms and thighs. Relaxed classes with lots of laugh... <a href=https://www.netmums.com/local/l/hulabop-hula-hoop-fitness-classes-for-grown-ups>Read more</a>",,
Zumba Gold,,GDOS,Hanwell Methodist Church Hall,16 Church Road,,Hanwell,,W7 1DJ,Tel: 07928065832,Zumba Gold takes the popular Latin-dance inspired workout of Zumba and simplifies the steps to makes it accessible for all.Zumba Gold builds cardiova... <a href="https://www.netmums.com/local/l/zumba-gold">Read more</a>,,
Prima Pilates,,GDOS,Kingsdown Methodist Church Hall,Corner on Kingsdown Ave & Northfields Ave,Northfields,West Ealing,London,W13 9PR,Tel: 07506001406,"Pilates is for everyone interested in improving their posture, lifestyle and well-being. It is an excellent way to achieve better core strength, heal... <a href=https://www.netmums.com/local/l/prima-pilates-2>Read more</a>",,
Movers &Amp; Shapers! Brand New Class,,GDOS,125 St Margarets Road,St Margarets,Richmond,Twickenham,,TW1 1RG,Tel: 020 8892 9158,BRAND NEW FITNESS CONCEPT...DOUBLE YOUR RESULTS IN HALF THE TIME with equipment based Group Personal Training.  Offering all the benefits of a Person... <a href="https://www.netmums.com/local/l/movers-shapers-4">Read more</a>,,
My Yoga - Foundation Course Yoga - Now Online!,,GDOS,141 Broadway,,,"Ealing, London",,W13 9BE,Tel: 07944416077,NEW YOGA FOUNDATION COURSESix classes course to get your yoga foundations now available online so that you can practice in your time and space! Click ... <a href="https://www.netmums.com/local/l/foundation-course-yoga">Read more</a>,,
Relax With Yoga Nidra - The Yogic Sleep,,GDOS,141 Broadway,Pamela Howard School of dance,"141 Broadway, W13 9BE",london,,W13 9BE,Tel: 07944416077,"YOGA NIDRA WORKSHOPS - The Art of Yogic Relaxation19 October, 9 &amp; 23 November 8:00 to 10:00pmI really enjoyed the yoga nidra session. Doing yoga ... <a href=https://www.netmums.com/local/l/relax-with-yoga-nidra-the-yogic-sleep>Read more</a>",,
Pilates &Amp; Yoga In Ealing,,GDOS,Christadelphian Hall,65A Dorset Road,,Ealing,,W5 4HX,Tel: 07776 120696,"Practicing Pilates and Yoga increases strength, flexibility, coordination and balance as well as helps to relax and manage stress. Their benefits can ... <a href=https://www.netmums.com/local/l/pilates-yoga-in-ealing>Read more</a>",,
Yoga In South Ealing Garden Studio,,GDOS,Dorset Road,,,Ealing ,London,W5 4HX,Tel: 07825154913,"Start your week right with a slow flow yoga class, breathing practice and lovely long relaxation. Suitable for all abilities no experience necessary.... <a href=https://www.netmums.com/local/l/yoga-in-south-ealing-garden-studio>Read more</a>",,
121 Fitness Female Friendly Personal Training,,GDOS,The Training Works,120 St Margarets Road,,Twickenham,Middlesex,TW1 2AA,Tel: 07946 256982,25% discount on a block of 10 hours of female friendly personal training on Wednesday and Friday mornings. Core stability.Pelvic Floor. Body sculptin... <a href="https://www.netmums.com/local/l/121-fitness-female-friendly-personal-training">Read more</a>,,
Fuel Training Ldn Hiit Bootcamp Classes,,GDOS,Moore Mead Park,St Margarets,,Richmond,,TW1 1JN,Tel: 07731818180,"60 minutes of High Intensity, Athletic Interval Training, with Fitness, Functional Movements &amp;  Resistance Work. Find out what all the hype is ab... <a href=https://www.netmums.com/local/l/outside-the-box-weighted-bootcamp>Read more</a>",,
Swimexpert 1-2-1 Private Swimming Lessons (Brentford),,GDOS,"Novotel London Brentford, Great West Way",,,Brentford,,TW8 0GP,Tel: 0330 111 29 29 (local rate),"SwimExpert is the number one Swimming Improvement Service in the UK, offering private swimming lessons for Children (age 2+) and Adults.  —‹ ASA and ... <a href=https://www.netmums.com/local/l/swimexpert-private-swimming-lessons-in-brentford-and-heathrow>Read more</a>",,
Strong Mamas Bootcamp,,GDOS,Lammas Park,,,Northfields ,,W13 9QD,Tel: 07557363875,Pre and post natal safe workout class! Each class will include a full body workout for overall fitness with extra focus on areas that are important t... <a href="https://www.netmums.com/local/l/strong-mamas-bootcamp">Read more</a>,,
Pools On The Park,,GDOS,Old Deer Park,Twickenham Road,,Richmond,,TW9 2SF,Tel: 020 3772 2999,An unique club which caters for all the familys needs and is located in superb surroundings on the famous Old Deer Park close to Richmond Train Sta... <a href="https://www.netmums.com/local/l/pools-on-the-park">Read more</a>,,
Buggyfit - Old Deer Park,,GDOS,Twickenham Road,,,"Richmond, Surrey",,TW9 2SF,Tel: 07762886527,"Buggyfit Old Deer ParkBuggfit (Old Deer Park, Richmond) is the best way to get back in shape after your new arrival. Whatever your post-natal stage w... <a href=https://www.netmums.com/local/l/buggyfit-old-deer-park>Read more</a>",,
Heart Twickenham,,GDOS,67A Holly Road,,,Twickenham,Middleses,TW1 4FH,Tel: 07970792680,A variety of yoga and pilates classes to suit all abilities and preferences held at HEART TWICKENHAM (in front of Holly Road Car Park &amp; behind M &... <a href="https://www.netmums.com/local/l/heart-twickenham">Read more</a>,,
Group Fitness Classes Whitton Twickenham Perfect For Beginners,,GDOS,The Wining post,,,Twuckenham,Middlesex,TW2 6LS,,"Im a qualified personal trainer and group fitness instructor teaching group exercise classes &amp; 1:1 in the community in Whitton, Twickenham, TW... <a href=https://www.netmums.com/local/l/group-fitness-classes-whitton-twickenham-perfect-for-beginners>Read more</a>",,
Old Deer Park Parkrun,,GDOS,,,,Richmond upon Thames,,TW9 2RA,,"parkrun is a free, weekly, timed 5k run that takes place every Saturday at 9am. junior parkruns are 2k events specifically for 4 to 14 year olds, held... <a href=https://www.netmums.com/local/l/old-deer-park-parkrun-1>Read more</a>",,
Fg Training - Personal Training,,GDOS,Twickenham,,,Twickenham,,TW1 3QS,Tel: 07581170282,"Whether you're a new mum wanting to get back to your pre-baby shape, or just want to improve your health and fitness, then I can help! I offer 1-2-1 p... <a href=https://www.netmums.com/local/l/fg-training-personal-training>Read more</a>",,
Mamahugz Yoga,,GDOS,"Richmond , St Margarets ",,,"Richmond, St Margarets and Surrounding area ",,TW9 2RE,Tel: 07734958848,MamaHugz Yoga for Pregnancy classes are gentle and safe for all pregnant women  whether new to Yoga or with years of practice. This is more than just ... <a href="https://www.netmums.com/local/l/pregnancy-yoga-mum-and-baby-yoga-yogabellies-in-richmond-1">Read more</a>,,
8-Week Yoga Therapy Course For The Mind  Stress Anxiety &Amp; Depression,,GDOS,The ETNA Community Centre,13 Rosslyn Road,,East Twickenham,,TW1 2AR,Tel: 07758 866834,"Developed by 'The Minded Institute', and delivered by local Yoga Therapist Sammie Mason, this 8-week yoga therapy course is a comprehensive and evide... <a href=https://www.netmums.com/local/l/8-week-yoga-therapy-course-for-stress-anxiety-depression>Read more</a>",,
Youla - Yoga Classes Richmond All Levels Welcome,,GDOS,,Quadrant Hall ,Quadrant Road,Richmond,Surrey,TW9 1DH,Tel: 07802242686,"Vinyasa Flow Classes in central Richmond every Saturday, 12.00 - 1.00pm. Vinyasa is a dynamic practice focusing on the link between breath and movemen... <a href=https://www.netmums.com/local/l/vinyasa-flow-yoga-friday>Read more</a>",,
Studio K Dance - Free Dynamic Flow Yoga Class,,GDOS,Richmond Station Left ,Kew Road,,Richmond,,TW9 2NA,Tel: 02034174070,"***FREE Yoga Classes In Richmond***Feeling sluggish and stressed?Want to feel calmer, focused and energised?Want to improve flexibility and build cor... <a href=https://www.netmums.com/local/l/free-dynamic-flow-yoga-class-at-studio-k>Read more</a>",,
Mummy&Amp;Me Pilates - Busylizzy Richmond &Amp; Twickenham,,GDOS,St John the Divine church hall,Kew Road,,Richmond,London,TW9 2NA,Tel: 020 3627 3135,"A relaxed yet focused class, specially developed by Busylizzy for postnatal mums wanting to get back into pre-pregnancy shape. Our innovative approac... <a href=https://www.netmums.com/local/l/busylizzy-richmond-twickenham-mummy-me-pilates>Read more</a>",,
Low Impact Indoor Bootcamp - Busylizzy Richmond &Amp; Twickenham,,GDOS,St John the Divine,Kew Road,,Richmond,,TW9 2NA,Tel: 0203 6273135,Come and try our postnatal Low Impact Bootcamp class for free! Takes place Fridays 9:30am in Richmond (2 minutes from Richmond train station).This cl... <a href="https://www.netmums.com/local/l/low-impact-indoor-bootcamp-busylizzy-richmond-twickenham">Read more</a>,,
Align Pilates Richmond,,GDOS,One-to-One & Two-to-One Sessions,,,Richmond,,TW9 1TW,Tel: 07775591033,Free Pilates taster session for every Netmum!  With summer here many of us are focused on getting back into shape.  I'm a Stott Pilates Matwork &amp; ... <a href="https://www.netmums.com/local/l/align-pilates-one-to-one-two-to-one-sessions">Read more</a>,,
Amazons Bootcamp - Personal Training In Richmond Amersham Surrey,,GDOS,"Buckinghamshire, Surrey, Berkshire",,,Twickenham,,TW9 1AE,Tel: 0793 018 2780,"Ready for Summer?Friendly, goal driven personal training for women by a female personal trainer.Book by 30st April &amp; quote #summer to receive 20% ... <a href=https://www.netmums.com/local/l/amazons-personal-training-loved-by-vogue-elle-red-grazia>Read more</a>",,
Accredited Mum &Amp; Baby Yoga Classes In Richmond London,,GDOS,Studio17 Pilates,394 Richmond Road,,Richmond,,TW1 2DY,Tel: 07837812152,"Weekly Mum and Baby yoga classes in Richmond, London and online run by a highly qualified and experienced instructor, and mother of two!A nourishing ... <a href=https://www.netmums.com/local/l/baby-me-baby-massage-classes-with-babyblossom>Read more</a>",,
Pregnancy Yoga In Richmmond,,GDOS,Studio17 Pilates,394 Richmond Road,,Richmond,London,TW1 2DY,,"Welcoming pregnancy yoga classes in Richmond, London - open from the first trimester of pregnancy - offering you a safe, calming space to move, stret... <a href=https://www.netmums.com/local/l/babyblossomyoga-yoga-for-pregnancy-and-birth>Read more</a>",,
Mummy&Amp;Me Aerobics (Outdoor) - Busylizzy Richmond Twickenham,,GDOS,Marble Hill Park,Richmond Rd,,Twickenham,,TW1 2PD,Tel: 020 3627 3135,"Come along to a FREE Mum &amp; Baby Outdoor Aerobics taster class on Thursday at 12:45pm, taking place in stunning Marble Hill Park, Twickenham.This ... <a href=https://www.netmums.com/local/l/busylizzy-richmond-twickenham-mummy-me-aerobics>Read more</a>",,
Pregnancy Yoga - Busylizzy Richmond &Amp; Twickenham,,GDOS,"Crossway Centre, nr St Stephen's Church",Richmond Road,,Twickenham,,TW1 2PD,Tel: 0203 6273135,"Come and try a FREE Pregnancy Yoga class - taking place on Saturdays at 9:30am at Crossways Centre, near Marble Hill Park in Twickenham.Pregnancy Yog... <a href=https://www.netmums.com/local/l/busylizzy-pregnancy-yoga-2>Read more</a>",,
Buggyfitness (Outdoor) - Busylizzy Richmond &Amp; Twickenham,,GDOS,Marble Hill Park,Richmond Rd,,Twickenham,London,TW1 2PD,Tel: 020 3627 3135,"Come and try our outdoor postnatal Buggyfitness class for free! Takes place on Monday at 11am in Marble Hill Park, Twickenham.Enjoy invigorating outd... <a href=https://www.netmums.com/local/l/buggyfitness-indoor-busylizzy-richmond-twickenham>Read more</a>",,
Nct Postnatal Yoga,,GDOS,Whitton Community Centre,Percy Rd,Whitton,Twickenham,,TW2 6JL,Tel: 07817274478,"A great way to take time for yourself as new mum, while also enjoying time with your baby. The sessions are friendly and relaxed,and focus on gently ... <a href=https://www.netmums.com/local/l/nct-postnatal-yoga>Read more</a>",,
Body Logic - Clinical Pilates Classes Twickenham,,GDOS,8 Staines Road,,,Twickenham,,TW2 5AH,Tel: 020 8898 1231,Body Logic Pilates classes in Twickenham Green are run by an experienced and chartered physiotherapist trained with the Australian Physiotherapy and ... <a href="https://www.netmums.com/local/l/pilates-classes-at-body-logic-physio-in-twickenham">Read more</a>,,