Organisation Name,NACS Code,Organisation Type,Address1,Address2,Address3,Address4,Address5,PostCode,Telephone Number,Information supplied by,Value  (Information supplied by),Banding Classification  (Information supplied by)
Hilly Fields Parkrun,,GDOS,"Hilly Fields, off Adelaide Avenue",,Ladywell,Lewisham,,SE4 1LD,,"parkrun is a free, weekly, timed 5k run that takes place every Saturday at 9am. junior parkruns are 2k events specifically for 4 to 14 year olds, held... <a href=https://www.netmums.com/local/l/hilly-fields-parkrun>Read more</a>",,
Bear Well Personal Training,,GDOS,Ladywell,,,London,,SE13 7DG,,"Hi my name is Stef, I am a Pre and Postnatal personal trainer and I am on a mission to create powerful and strong women at every stage of their life. ... <a href=https://www.netmums.com/local/l/personal-training-123>Read more</a>",,
Catford Pilates,,GDOS,Silvermere Road,Lewisham,,London,,SE6 4QX,Tel: 07786 072337,"Catford Pilates offers group matwork, 121 individual, small private group and group matwork classes. Small class sizes, personalised approach. Pilate... <a href=https://www.netmums.com/local/l/catford-pilates>Read more</a>",,
Royal Caribbean Runners - Hot Chics Running Group,,GDOS,Ladywell Arena,"Silvermere road,",,Lewisham,,SE6 4QX,,I am a fitness instructor extremely passionate about exercise and love to motivate people. I find running really rewarding as it a great way to distre... <a href="https://www.netmums.com/local/l/royal-caribbean-runners-hot-chics-running-group">Read more</a>,,
The Sunflower Centre Postnatal Pilates Class,,GDOS,The Sunflower Centre,81 Tressillian Road,Hilly Fields,Brockley,,SE4 1XZ,Tel: 07960439212,New course starts 7th NovemberPostnatal Mother and Baby Pilates.  A small friendly class to enable individual attentionFriday afternoons At The SunFlo... <a href="https://www.netmums.com/local/l/mother-and-baby-pilates-class">Read more</a>,,
Dance Fitness,,GDOS,136 Hither Green Lane ,,,Lewisham ,,SE13 6QA,Tel: 07999357008,"Nia is a barefoot fitness workout that blends dance, martial, and healing arts that encourages Self-awareness, Expression, Joy, healing and so much m... <a href=https://www.netmums.com/local/l/dance-fitness-11>Read more</a>",,
London Fitness Life Bootcamps - Hither Green,,GDOS,Mountsfield Park,Hither Green,,London,,SE6 2BT,Tel: 07508880139,"Ladies-only fitness /weight loss classes -starts 13th April!drop 2 dress sizes in first two months, 4 classes to choose from per day!Class times: 6am... <a href=https://www.netmums.com/local/l/london-fitness-life-bootcamps>Read more</a>",,
Boxing And Weight Loss Bootcamps!,,GDOS,59c ringstead road,catford,,London,,SE6 2BT,Tel: 07508880139 / 02086976216,"BOXING AND WEIGHT LOSS BOOTCAMPS*sessions run Monday -Friday .*choice of 3 time slots (6am, 12pm, 6.30pm and 7.30pm).*ladies only.*regular check ups ... <a href=https://www.netmums.com/local/l/bellingham-12-week-fitness-bootcamp>Read more</a>",,
Mum And Baby Aerobics,,GDOS,Hither Green Baptist Church,Theodore road,Lewisham,London,,SE13 6HT,Tel: 07575578287,"All mums welcome to join. If you are pregnant and want to get fit before birth, just had a baby and your ready to start getting your body back or if y... <a href=https://www.netmums.com/local/l/mum-and-baby-aerobics>Read more</a>",,
St Dunstans Swimming Lessons,,GDOS,St Dunstans Leisure Centre,Stanstead Road,,Catford,London,SE6 4TY,Tel: 0208 690 1111,SWIMMING LESSONS Now StartedAre you looking for swimming lessons for your children? our swim school has been running for 3 years and is well establish... <a href="https://www.netmums.com/local/l/catford-swimming-lessons">Read more</a>,,
St Dunstan'S Swim School,,GDOS,St Dunstan's college ,stansted road ,,Catford ,London ,SE6 4TY,Tel: 02085167205,"St Dunstans Swim school Newly formed and striving  St Dunstans enterprises is located at St Dunstans college , on Stanstead road in the heart... <a href=https://www.netmums.com/local/l/st-dunstan-s-college-2>Read more</a>",,
St Dunstan'S Summer Swim,,GDOS,Stanstead Road,London ,,London,London,SE6 4TY,Tel: 02086 901 111,"Dear Mums,This summer we will be launching crash course swimming lessonsThese lessons will be fun, whilst improving your child's confidence and techn... <a href=https://www.netmums.com/local/l/st-dunstan-s-swimschool>Read more</a>",,
Fine Strokes Swim School,,GDOS,St.Dunstans College,Stanstead Road,,Catford,,SE6 4TY,,"Learning life skills in a safe &amp; friendly environment.ASA qualified instructors.Lessons held at St.Dunstans College, Catford every Saturday 1.30-3... <a href=https://www.netmums.com/local/l/swimming-lessons-for-children-adults>Read more</a>",,
Swim School,,GDOS,Stansted Road ,,,Catford ,London ,SE6 4TY,Tel: 02086901111,Fantastic swim school based in St Duntstan's College . Offering a variety of classes for both children and adults.Monday Tuesday Wednesday Saturday S... <a href="https://www.netmums.com/local/l/swim-school-6">Read more</a>,,
Mim'S Mother And Baby Post-Natal Pilates Classes - Crofton Park,,GDOS,St Hilda's Church,Brockley Road,,London,,SE23 1PL,Tel: 07946543286,"Friendly, local mother and baby post-natal Pilates classes in Crofton Park.A great way to recover from pregnancy and childbirth, strengthen and tone, ... <a href=https://www.netmums.com/local/l/mim-s-pre-natal-pilates-classes-crofton-park>Read more</a>",,
Zumba In Lewisham Way,,GDOS,St John's Church,,Sydenham,Lewisham,London,SE8 4EA,Tel: 07404686074,Zumba dance class Every Monday from 7pm to 8pm at St Jonh's Church Lewisham Way (in front of the Lewisham College)No booking is Required £7 per clas... <a href="https://www.netmums.com/local/l/zumba-in-lewisham-way">Read more</a>,,
Capoeira Agora Classes For Adults On Mondays,,GDOS,St.John's Church,Saint John's Vale,St. Johns,London,,SE8 4EA,Tel: 07977151362,Capoeira can be practised by anybody regardless of their fitness level. My approach to teaching is to work with everyone individually to take them to... <a href="https://www.netmums.com/local/l/capoeira-agora-classes-for-adults">Read more</a>,,
Mums (And Dads) And Baby Yoga,,GDOS,Scout Hut,Herschell Rd,,Forest Hill,,SE23 1JN,Tel: 07736228038,I'm a local mum passionate about teaching yoga to fellow parents. This class is so that the mums (and dads) can do yoga - the babies just watch. I be... <a href="https://www.netmums.com/local/l/mums-and-dads-and-baby-yoga">Read more</a>,,
Insanity Beach Body Workout,,GDOS,St Saviours Church Hall,Brockley Rise,,LONDON,,SE23 1JN,Tel: 0771 2051208,Are you INSANE enough to join us?!INSANITY is the American crazy  Beachbody workout based on Max Interval Training. It is a high energy workout that ... <a href="https://www.netmums.com/local/l/flex-stretchfemale-fitness-class">Read more</a>,,
Muma &Amp; Bubba Work Out,,GDOS,Manor House Library,34 Old Rd,,Lewisham,,SE13 5SY,Tel: 07415060420,Postnatal Fitness Classes for all mamas and bubbas. Toys available in classes to entertain your little ones whilst you work out and De-stress.We do f... <a href="https://www.netmums.com/local/l/muma-and-bubba-work-out">Read more</a>,,
Yoga With Anna - Vinyasa Flow Classes In Hither Green,,GDOS,Manor House Gardens Library,,,London,,SE13 5SY,Tel: 07775610448,"Yoga with Anna aims to make yoga accessible, un-intimidating and above all enjoyable. Anna encourages her students to use yoga to build strength and ... <a href=https://www.netmums.com/local/l/yoga-with-anna-vinyasa-flow-classes-in-hither-green>Read more</a>",,
Yoga With Anna In Hither Green,,GDOS,Manor House Library,Old Road,Hither Green,London,,SE13 5SY,Tel: 07775610448,"Welcome to Yoga with Anna. I am a qualified Yoga Teacher based in Hither Green, London. I teach privately and also host group yoga classes in Manor H... <a href=https://www.netmums.com/local/l/yoga-with-anna>Read more</a>",,
Online Pregnancy + Post-Natal Yoga + Pilates,,GDOS,12A Surrey Road,,,London,London,SE15 3AU,,"Our dedicated and comprehensive Pre + Post-Natal Yoga + Pilates classes by our specialist and supportive teachers include Yoga flows, Pilates session... <a href=https://www.netmums.com/local/l/online-pregnancy-post-natal-yoga-pilates-5>Read more</a>",,
Post Natal Pilates Class In Lee/Hither Green,,GDOS,Complementary Health Centre - Lee,172 - 174 Manor Lane,,London,,SE12 8LP,Tel: 07939083005,A small mat Pilates class for mums with their babies.2.00pm - 3.00pm on Wednesday afternoons.  ... <a href="https://www.netmums.com/local/l/post-natal-pilates-class-4">Read more</a>,,
Chc-Lee Pre Natal Pilates Class In Lee/Hither Green,,GDOS,Complementary Health Centre - Lee,172 - 174 Manor Lane,,London,,SE12 8LP,Tel: 07939083005,A small mat Pilates class for pregnant women. 6.15pm - 7.15pm on Thursday evenings.... <a href="https://www.netmums.com/local/l/pre-natal-pilates-class-in-lee-hither-green">Read more</a>,,
London Fitness Bootcamps - Honor Oak,,GDOS,Blythe Hill Fields,Honor oak,,London,,SE23 1AS,Tel: 07508880139,"ladies-only fitness bootcamps! Morning and evening classes!class times: 6.15am and 7pm, classes run monday-fridaypost-natal welcome. typical weight lo... <a href=https://www.netmums.com/local/l/honor-oak-fitness-bootcamps>Read more</a>",,
Slow Flow Beginner'S Yoga,,GDOS,Telegraph Hill Centre,Kitto Road,Telegraph Hill,London,,SE14 5TY,,These classes flow softly and have a strong focus on healthy alignment and posture to promote ease of movement and help release tension in the body. ... <a href="https://www.netmums.com/local/l/slow-flow-beginner-s-yoga">Read more</a>,,
Postnatal Pilates At The Telegraph Hill Centre,,GDOS,Telegraph Hill Centre Pepys Road,Behind st Catherine's church ,,Telegraph Hill ,,SE14 5TY,Tel: 07855438767,"Fun, friendly, functional and effective Postnatal  pilates class at the Telegraph Hill Centre with Top Kat Training.  I have been running PILATES and ... <a href=https://www.netmums.com/local/l/mum-and-baby-pilates-in-peckham-with-top-kat-training>Read more</a>",,
Beginners Iyengar Yoga,,GDOS,Goldsmiths Community Centre,Castillon Road,,London,,SE6 1SL,,Beginners session to be introduced to Iyengar techniques £6 per session ... <a href="https://www.netmums.com/local/l/beginners-iyengar-yoga-1">Read more</a>,,
Strong! By Zumba,,GDOS,Goldsmiths Community Centre,Castillon Road,,London,,SE6 1SL,,Energetic fun workout with the fab Ema!£5 per session... <a href="https://www.netmums.com/local/l/strong-by-zumba-3">Read more</a>,,
Greenwich Runners - Blackheath,,GDOS,,,,Blackheath ,,SE10 8UJ,,Greenwich Runners has been established in Greenwich for over five years. This fun and supportive group is for all levels; be it returning to running a... <a href="https://www.netmums.com/local/l/greenwich-runners-blackheath">Read more</a>,,
Zumba,,GDOS,111-113 Lee Reformed Church Hall,,,Lee,London,SE12 8RA,Tel: 07969323308,"Come have fun, love your sweat and stay fit with energised rhythms and moves.Zumba allows you to have fun and be fit without being a great dance. All ... <a href=https://www.netmums.com/local/l/zumba-468>Read more</a>",,
Adult Hip Hop Classes:,,GDOS,The Hatch club,23 Lewisham Way,,London,,SE14 6PP,Tel: 07904424504,Adult Hip hop classes in South East London!Some of our classes are in heels (However optional if you don't want  to wear them)Some classes are just a ... <a href="https://www.netmums.com/local/l/adult-hip-hop-classes">Read more</a>,,
Zumba Fitness With Justyna,,GDOS,Lewisham Polish Centre,8 Waldram Park Road,Forest Hill,London,,SE23 2PN,Tel: 07925514660,"Zapraszam na Fitness Party. GwarantujÄ™ intensywne spalanie kalorii w rytmie muzyki Latino, a przede wszystkim Å›wietnÄ… zabawÄ™.PoniedziaÅ‚ek godz. 1... <a href=https://www.netmums.com/local/l/zumba-with-justyna>Read more</a>",,
Wavelengths Leisure Centre,,GDOS,Giffin Street,,,Deptford,London,SE8 4RJ,Tel: 020 8452 0606 or 020 8452 0616,"CALLING ALL TINY SWIMMERS!!!!!!We are BORN TO SWIM, teaching little ones from 8 weeks old and upwards. We understand that swimming should be fun but w... <a href=https://www.netmums.com/local/l/wavelengths-leisure-centre-5>Read more</a>",,
Babysplash (At Wavelengths),,GDOS,Giffin Street,,,Deptford,,SE8 4RJ,Tel: 07846 464 290,I would wholeheartedly recommend Suzanne's class; she is an amazing teacher who really builds up a rapport with the children. I've been taking my son ... <a href="https://www.netmums.com/local/l/babysplash-at-wavelengths">Read more</a>,,
London Fitness Bootcamps - New Cross,,GDOS,fordham park,,,New Cross,,SE14 6AY,Tel: 07508880139,"fitness bootcamps -post natal welcomeClass times: 6am and 7pm , Monday-FridayClients typically achieve weight loss of two dress sizes over their firs... <a href=https://www.netmums.com/local/l/new-cross-fitness-bootcamps>Read more</a>",,
Sexy Workout,,GDOS,Greenwich West Community & Arts Centre,141 Greenwich High Rd,,London,,SE10 8JA,Tel: 07871193020,Ever wanted to workout and keep it sexy at the same time? of Maybe you want to learn some sexy dance moves? If so these are the classes for you. All l... <a href="https://www.netmums.com/local/l/sexy-workout">Read more</a>,,
Kripalu Yoga With Lou,,GDOS,Greenwich West Community & Arts Centre ,141 Greenwich High Road ,,London,London,SE10 8JA,Tel: 07866 556 209,"My yoga is hopefully nurturing and allows you, the student to find a confidence in who you are and your abilities. It is akin to a Hatha style practic... <a href=https://www.netmums.com/local/l/kripalu-yoga-with-lou>Read more</a>",,
Cheerobics With Ellie!,,GDOS,Greenwich West Community Centre,Greenwich High Road,,Greenwich/Blackheath,,SE10 8JA,Tel: 07903 099 721,"Cheerobics® is the unique fitness programme that combines aerobics and cheerleading techniques, with the fun of pompoms! Not designed as a regular ... <a href=https://www.netmums.com/local/l/cheerobics-with-ellie>Read more</a>",,
Free Trial Class,,GDOS,Fordham Park,New Cross,,London,,SE8 4AG,Tel: 07508880139,"Super fun, fast and effective boot camps! Book your free trial!WE HAVE A BOOTCAMP NEAR YOU!*Our goal, is to help you achieve your goals!*Our classes ... <a href=https://www.netmums.com/local/l/free-trial-class-1>Read more</a>",,
Running Mummies,,GDOS,,,,Greenwich ,,SE10 8QY,,"Have you just had a baby, do you want to get fit or stay in shape? Do you want to make new friends or do you want a class that's for both you AND your... <a href=https://www.netmums.com/local/l/running-mummies-3>Read more</a>",,
Pilates Classes At Trinity Laban,,GDOS,Trinity Laban Conservatoire of Music & Dance,Laban Building,Creekside,London,,SE8 3DZ,Tel: 020 8305 9477,Pilates matwork classes based in the world class studios of Trinity Laban.  The Pilates method of body conditioning is a unique system of exercise des... <a href="https://www.netmums.com/local/l/pilates-classes-at-trinity-laban">Read more</a>,,
Unlimted Bootcamp Classes - New Cross,,GDOS,Fordham Park,New Cross,,London,,SE14 6LU,Tel: 07508880139 / 02086976216,BOXING AND WEIGHT LOSS BOOTCAMPS*sessions run Monday -Friday .*choice of 3 time slots (6.30am and 6.30pm).*ladies only.*regular check ups to track pr... <a href="https://www.netmums.com/local/l/new-cross-12-week-fitness-bootcamp">Read more</a>,,
Angelina Jandolo Dance - James Wolfe Primary School Greenwich,,GDOS,Angelina Jandolo Dance,Randall Place Campus,Randall Pl,London,,SE10 9LA,Tel: 07794201531,"Angelina Jandolo Dance School teaches both adults and children in the art of ballet in Greenwich, running regular classes across the week and weekend... <a href=https://www.netmums.com/local/l/angelina-jandolo-dance-greenwich>Read more</a>",,
Cardio Jam,,GDOS,The Green,5 Nunhead Lane,,London,,SE15 3QQ,Tel: 07912184865,"An energetic, upbeat aerobics class that is sure to keep your body moving.  A great workout for all levels of fitness, this class combines cardiovascu... <a href=https://www.netmums.com/local/l/cardio-jam>Read more</a>",,
Chasamba Latin Dance Exercise Class!,,GDOS,"Energie Forest Hill, 26-28 London Road",Forest Hill,,London,,SE23 3HF,,Combining a weekly weigh in (Body Composition Analysis - to track body fat percentage) and nutrition advice with a dance fitness class called ChaSamba... <a href="https://www.netmums.com/local/l/chasamba-latin-dance-exercise-class">Read more</a>,,
Ballroom Burn,,GDOS,Horn Park (Old Colfeians Rugby Club) ,"Eltham Road,",,Lee ,,SE12 8UE,Tel: 07711255932,"Ballroom &amp; Latin American dance class designed to raise your heart rate, tone your muscles and teach you the basics of Ballroom &amp; Latin Americ... <a href=https://www.netmums.com/local/l/ballroom-burn>Read more</a>",,
Twist Studios Yoga - Forest Hill,,GDOS,99a Dartmouth Road,Forest Hill,,London,,SE23 3HT,Tel: 07737785567,"Hot Yoga, Yoga for Cyclists, Hatha and Vinyasa Yoga all on offer at Twist Studios!Hot Yoga - Monday, 8.15pmYoga for Cyclists - Tuesday, 7pmHatha Yoga ... <a href=https://www.netmums.com/local/l/yoga-twist-studios-forest-hill>Read more</a>",,
Twist Studios - Boxercise - Forest Hill,,GDOS,99a Dartmouth Road,Forest Hill,,London,,SE23 3HT,Tel: 07737785567,"Boxing movements meet aerobics in this intense form of cross training! Instructor and owner of Twist Studios, Adam Double, is not only a keen boxer, b... <a href=https://www.netmums.com/local/l/twist-studios-boxercise-forest-hill>Read more</a>",,
Twist Studios - Post Natal Pilates - Forest Hill,,GDOS,99a Dartmouth Road,Forest Hill,,London,,SE23 3HT,Tel: 07737785567,"Pilates can play a key role in helping your body recover from pregnancy and birth, regaining strength in your pelvic floor and abdominal muscles. Thur... <a href=https://www.netmums.com/local/l/twist-studios-post-natal-pilates>Read more</a>",,
Pteb Bootcamps,,GDOS,73 Stanbury Road,,,London,,SE15 2DA,,"Hiya! I'm Evie B. a Personal Trainer who wants to help you Find your Fitness Confidence. Whether that means is finding an hour to work on yourself, c... <a href=https://www.netmums.com/local/l/bootcamps-with-evie-b>Read more</a>",,
Colfes Leisure Centre Swim School,,GDOS,Colfe's Leisure Centre ,Horn Park Lane,,Lee,,SE12 8AW,Tel: 020 8297 9110,Group swimming lessons are available for ages 4 - 14 years. All childrens swimming lessons are grouped by ability. Lessons are available during ter... <a href="https://www.netmums.com/local/l/colfe-s-leisure-centre-swim-school">Read more</a>,,
Nova Aesthetic Clinic,,GDOS,3 College Approach,Greenwich,,London,,SE10 9HY,Tel: 020 8293 1070,=============================================================SEPTEMBER OFFER NETMUMSDISCOVER OUR AMAZING " GET BACK IN SHAPE AFTER PREGNANCY " PROGRA... <a href="https://www.netmums.com/local/l/nova-aesthetic-clinic-1">Read more</a>,,
Peckham Rye Parkrun London,,GDOS,Peckham Rye Park,Colyton Road,Southwark,London,,SE15 4JR,,"Parkrun is a free, weekly, timed 5k run that takes place every Saturday at 9 am. junior parkruns are 2k events specifically for 4 to 14 year olds, hel... <a href=https://www.netmums.com/local/l/peckham-rye-parkrun>Read more</a>",,
The Bridge Leisure Centre,,GDOS,Kangley Bridge Road,Lower Sydenham,,Lewisham,,SE26 5AQ,Tel: 02087787158,"Our swimming lessons will teach your child how to,1 Enter the water safely2 Jump in3 Float on my front4 Float on my back5 Roll over6 Blow bubbles7 Swi... <a href=https://www.netmums.com/local/l/the-bridge-leisure-centre-7>Read more</a>",,
Pregnancy Postnatal Yoga &Amp; Baby + Me Classes In Peckham &Amp; Streatham,,GDOS,Yogarise Peckham,"133 Copeland Road,","The Bussey Building First Floor, Yellow Stairs",London,,SE15 3SN,Tel: 020 3096 3158,"We've got every pre- and post- pregnancy yoga + Pilates class in our spacious, friendly, and welcoming studios in Peckham and Streatham.PREGNANCY YOG... <a href=https://www.netmums.com/local/l/pregnancy-postnatal-yoga-baby-me-classes-in-peckham-streatham>Read more</a>",,
Zumba - Thomas Tallis,,GDOS,Thomas Tallis School,Kidbrooke Park Road,,London,,SE3 9PX,Tel: 07901001221,"Tuesday   7.45pm-8.45pmThursday  7.45pm-8.45pmA fun, friendly and a great Zumba fitness class. The music and the party like atmosphere make these cla... <a href=https://www.netmums.com/local/l/ems-zumba-thomas-tallis-tues-and-thurs>Read more</a>",,
Victorslab Mums And Babies Pilates,,GDOS,The Bussey Building,133 Rye Lane,,Peckham,London,SE15 4ST,Tel: 0845 604 2045,Hello! We are Daniel and Radana and we just (last Monday) opened Victor's Lab in the Bussey Building (SE15 4ST). You can have a first look here www.vi... <a href="https://www.netmums.com/local/l/mums-and-babies-pilates">Read more</a>,,
Dancefit:80'S Cardio High Class Lewisham,,GDOS,Victor's Lab,133 Rye Lane,,London,,SE15 4ST,Tel: 07894273648,Supercharge yourself with a full-on cardio exercise/aerobic workout/dance routine set to an 80's soundtrack. You will dramatically improve your stami... <a href="https://www.netmums.com/local/l/dancefit-80-s-cardio-high-class-5">Read more</a>,,
Luna Yoga For Women By E14Yogacoach Near Canary Wharf E14 3Ps,,GDOS,Dockland Settlements No.2 ,Saunders Ness Road,,London,,E14 3PS,Tel: 07958 240 855,Are your hormones ruling you?This class helps to regulate your hormones whatever life stage you are at.Luna Yoga Mondays at 7.45pmA deep yoga practic... <a href="https://www.netmums.com/local/l/luna-yoga-for-women-by-e14yogacoach-near-canary-wharf-e14-3ps">Read more</a>,,
Mum &Amp; Toddler Yoga (For Active Babies Up To 2 Years Old),,GDOS,Dockland Settlements,4a Saunders Ness Road,,London,,E14 3PS,Tel: 07958 240 855,"This class is suitable for mums of older babies are actively moving. Perfect for babies who are shuffling on their bottoms, crawling, standing up or ... <a href=https://www.netmums.com/local/l/mum-toddler-yoga-for-active-babies-up-to-2-years-old>Read more</a>",,
Pilates East Dulwich,,GDOS,Goosegreen clinic ,59 East Dulwich road ,East Dulwich ,LONDON,Southwark ,SE22 9AP,Tel: 07920062597,"This class focuses on establishing a strong foundation but will encourage you to challenge yourself creating a stronger, leaner and healthier body.  O... <a href=https://www.netmums.com/local/l/pilates-east-dulwich>Read more</a>",,
Mummy &Amp; Baby Postnatal Yoga,,GDOS,Goose Green Clinic,59 East Dulwich Road,35 Spenser Road,East Dulwich,London,SE22 9AP,,"Designed to bring you 'back together' after birth using yoga breathing, toning, strengthening, stretching and relaxation techniques. You needn't have ... <a href=https://www.netmums.com/local/l/mummy-baby-postnatal-yoga>Read more</a>",,
Zumba Classes Every Thursday At 630Pm Starting 8 November,,GDOS,Goose Green Centre,62a East Dulwich Road,,London,,SE22 9AT,,Come join the fun at our Zumba Fitness classes! Dance those blues away and have a dose of exercise without even realising it “ even if you think yo... <a href="https://www.netmums.com/local/l/zumba-classes-every-thursday-at-6-30pm-starting-8-november">Read more</a>,,
Mum And Baby Yoga,,GDOS,Oru Space,20 â€“ 22 Lordship Lane ,,London,,SE22 8HN,,"Postnatal Yoga at Oru Space, for parents and babies from six weeks (10 weeks if c-section) postnatal. Stretch, strengthen, breathe and relax. Yoga fo... <a href=https://www.netmums.com/local/l/mum-and-baby-yoga-1>Read more</a>",,
Burn It Fitness - 1 Week Free Trial To Mums And Babies Classes,,GDOS,Burn It Fitness ,174 Westcombe Hill ,,London,,SE3 7DH,Tel: 02036012365,WANTED: Blackheath Mummies Who Want To Get Fit! 1 week free trial at Born to Burn It Mums and Babies classes at Burn It Fitness    You Are Always Put... <a href="https://www.netmums.com/local/l/burn-it-fitness-1-week-free-trial-to-mums-and-babies-classes">Read more</a>,,
Group Personal Training In Blackheath,,GDOS,Burn It Fitness ,174 Westcombe Hill,,Blackheath,London,SE3 7DH,Tel: 0203 601 2365,Group Personal Training - the perfect solution to finally getting the body you want. No tricks! Save ££'s every week and workout in the comfort of ... <a href="https://www.netmums.com/local/l/new-boutique-studio-in-blackheath-body-transformation-program">Read more</a>,,