Organisation Name,NACS Code,Organisation Type,Address1,Address2,Address3,Address4,Address5,PostCode,Telephone Number,Information supplied by,Value  (Information supplied by),Banding Classification  (Information supplied by)
Swimming Lessons At Waveney Valley Leisure Centre,,GDOS,Bedingfeild Road,,,Bungay,Suffolk,NR35 1PH,Tel: 01986 895014,Waveney Valley Leisure Centre offers a great range of activities to keep you and your family active. This leisure centre in Bungay features a 25m swi... <a href="https://www.netmums.com/local/l/swimming-lessons-at-waveney-valley-leisure-centre">Read more</a>,,
Mum'S Tums And Bums - And Babies Come Too,,GDOS,Halesworth Library,Bridge Street,,Halesworth,Suffolk,IP19 8AD,Tel: 07780707972,A fun and effective class with Mum's in mind led by qualified pre/post-natal instructor Sue Potter. Bring your little one (not compulsory!)  along and... <a href="https://www.netmums.com/local/l/mum-s-tums-and-bums-and-babies-come-too">Read more</a>,,
Beccles Lido Outdoor Swimming Pool Suffolk,,GDOS,Beccles Lido,Puddingmoor,Beccles,Suffolk,Suffolk,NR34 9PL,Tel: 01502 713297,"Beccles swimming pool is a traditional, outdoor heated swimming pool situated by the river Waveney. There is a large 30m x 15m swimming pool with a d... <a href=https://www.netmums.com/local/l/beccles-outdoor-swimming-pool>Read more</a>",,
Pilates - Lowestoft,,GDOS,30 Hall Road,Carlton Colville,Carlton Colville,Lowestoft,Suffolk,NR33 8BT,Tel: 01502 513848,"Why Pilates? Develops core strength and stability. Improves posture and alignment. Relieves stress. Enhances flexibility, balance and that feel good ... <a href=https://www.netmums.com/local/l/mrs-212>Read more</a>",,
Sweaty Mama Great Yarmouth And Lowestoft - Carlton Colville,,GDOS,Carlton Colville Community Centre,Hall Road,,Carlton Colville,Lowestoft,NR33 8BT,Tel: 07401497510,"You will love the class, we have a lot of fun and it is a very effective yet fun way to exercise with your child. No need to find childcare, you can ... <a href=https://www.netmums.com/local/l/sweaty-mama-great-yarmouth-and-lowestoft-carlton-colville>Read more</a>",,
Sweaty Mama Great Yarmouth And Lowestoft - Oulton,,GDOS,Oulton Community Centre,Meadow Road,,Lowestoft,,NR32 3AZ,Tel: 07401497510,Sweaty Mama is an upbeat session focused on gradually building up your fitness and also stimulating your core strength.We undertake a fun cardio and ... <a href="https://www.netmums.com/local/l/sweaty-mama-great-yarmouth-and-lowestoft-oulton">Read more</a>,,
Fritton Lake Parkrun,,GDOS,Fritton Lake Country Park,Beccles Road,,Fritton,,NR31 9HA,,"parkrun is a free, weekly, timed 5k run that takes place every Saturday at 9am. junior parkruns are 2k events specifically for 4 to 14 year olds, held... <a href=https://www.netmums.com/local/l/fritton-lake-parkrun>Read more</a>",,
Waterlane Leisure Centre,,GDOS,Water Lane,,,Lowestoft,Suffolk,NR32 2NH,Tel: 01502 532540,Waterlane Leisure Centre offers a great range of activities and sports to keep you and your family active. This leisure centre in Lowestoft features ... <a href="https://www.netmums.com/local/l/swimming-lessons-at-waterlane-leisure-centre">Read more</a>,,
Pilates,,GDOS,19 Owens Close,,,Long Stratton,,NR15 2TX,Tel: 07930482181,Long Stratton and Burston . Classes run Tues and Thurs mornings and evenings. Block book sessions in advance via www.gymcatch.com and search for Pilat... <a href="https://www.netmums.com/local/l/pilates-113">Read more</a>,,
Mummy Fitclub- Exercise Class,,GDOS,Poringland Community Centre,Overtons Way,Poringland,Norwich,,NR14 7WB,Tel: 07840617618,Functional exercise class for New Mums - Improve your core  - Pelvic floor  - Build/develop strength and endurance   Suitable for New Mum's after thei... <a href="https://www.netmums.com/local/l/mummy-fitclub-exercise-class">Read more</a>,,
Burlesque Chair Dance Fitness Classes In Norfolk,,GDOS,Poringland Community Centre,Overtons Way ,,Poringland ,Norfolk ,NR14 7WB,,"Burlesque Chair Dance is a unique and innovative dance fitness class designed for a full-body workout. Inspired by Burlesque &amp; Showgirls, we teach... <a href=https://www.netmums.com/local/l/burlesque-chair-dance-fitness-classes-in-norfolk>Read more</a>",,
Sweaty Mama Great Yarmouth And Lowestoft -Hopton,,GDOS,Hopton Village Hall,Station Road,,Hopton,,NR31 9BE,Tel: 07401497510,Sweaty Mama is an upbeat session focused on gradually building up your fitness and also stimulating your core strength.We undertake a fun cardio and ... <a href="https://www.netmums.com/local/l/sweaty-mama-great-yarmouth-and-lowestoft-hopton">Read more</a>,,
Water Lilies Swimming School,,GDOS,WLSS OFFICE is based in Scole,We teach at 10 private pools,,Across Norfolk and Suffolk,,IP21 4DX,Tel: 01379740489,"My swim school has been running since 2007 and now in 2019, we have over 1,500 children, babies and adults swimming with us each week. Come and join ... <a href=https://www.netmums.com/local/l/water-lilies-swimming-school-2>Read more</a>",,
Water Lilies Swimming School Water Aerobics,,GDOS,"Water Lilies Office is based at Waveney House, Bungay Road",,Scole,Scole,,IP21 4DX,Tel: 01379740489,Dont like the gym but want to exercise? Come to Water Lilies Swimming Schools fun and friendly fitness sessions at a lovely private pool near y... <a href="https://www.netmums.com/local/l/pilates-aquarobics">Read more</a>,,
Sweaty Mama Great Yarmouth And Lowestoft - Bradwell,,GDOS,Bradwell Scout Hut,208 Beccles Road,,Bradwell,,NR31 8QD,Tel: 07401497510,Sweaty Mama is an upbeat session focused on gradually building up your fitness and also stimulating your core strength.We undertake a fun cardio and ... <a href="https://www.netmums.com/local/l/sweaty-mama-great-yarmouth-and-lowestoft-bradwell">Read more</a>,,
Gorleston Parkrun,,GDOS,Gorleston Cliffs ,,near,Great Yarmouth,,NR31 6DX,,"parkrun is a free, weekly, timed 5k run that takes place every Saturday at 9am. junior parkruns are 2k events specifically for 4 to 14 year olds, held... <a href=https://www.netmums.com/local/l/gorleston-parkrun>Read more</a>",,
Phoenix Pool &Amp; Gym,,GDOS,Widgeon Close,Bradwell,,Great Yarmouth,,NR31 8JU,Tel: 01493 664575,Facilities include an indoor heated 5 lane swimming pool with a depth ranging from 0.9m to 2m. Various sessions including Parent and Toddler sessions ... <a href="https://www.netmums.com/local/l/phoenix-swimming-pool">Read more</a>,,
Pilates All Abilities,,GDOS,Abbey Hall,Hoxne road ,,Eye ,,IP23 7NJ,Tel: 07914535458,"A mat Pilates class for all abilities , A relaxed, friendly class where you can tone and strengthen with guidance and encouragement, I modify the clas... <a href=https://www.netmums.com/local/l/pilates-all-abilities-1>Read more</a>",,
Aqua Babies (Birthlight),,GDOS,Mangreen Farm,Swardeston,,NORWICH,Norfolk,NR14 8DD,Tel: 01603 632610,As well as baby swimming I also teach post natal aqua yoga and baby yoga.Booking EssentialThe classes are held at 11 on Thursdays for babies aged 0 - ... <a href="https://www.netmums.com/local/l/aqua-babies-birthlight">Read more</a>,,
Norfolk Ducklings,,GDOS,Mangreen Farm,Swardeston,,Norwich,Norfolk,NR14 8DD,Tel: 01603 665538,Norfolk Ducklings are baby swimming classes for newborns to preschoolers.  Classes are designed to be fun and relaxed and aid bonding whilst learning ... <a href="https://www.netmums.com/local/l/norfolk-ducklinga">Read more</a>,,
Brundall Parkrun,,GDOS,Postwick Lane,,,Brundall,Norfolk,NR13 5RF,,"parkrun is a free, weekly, timed 5k run that takes place every Saturday at 9am. junior parkruns are 2k events specifically for 4 to 14 year olds, held... <a href=https://www.netmums.com/local/l/brundall-parkrun>Read more</a>",,
Eye Community Centre,,GDOS,25 Magdalen street ,,,Eye,,IP23 7AJ,Tel: 07914535448,"A mat Pilates class for all abilities , A relaxed, friendly class where you can tone and strengthen with guidance and encouragement, I modify the clas... <a href=https://www.netmums.com/local/l/eye-community-centre>Read more</a>",,
Shape-Up Pilates,,GDOS,Glebe Barn,Norwich Road,Tacolneston,Norwich,Norfolk,NR16 1EF,Tel: 01508 488083,Deep Aqua Aerobic and Pilates Classes available... <a href="https://www.netmums.com/local/l/shape-up-pilates">Read more</a>,,
Birthlight Pregnancy Postnatal And Well Woman Yoga,,GDOS,Roots Activties,Stuston Place,Stuston,Diss,Norfolk,IP21 4AD,Tel: 07770 957815,"Friendly yoga classes in Roots Activities, Stuston just outside Diss.  Private studio within Roots which has ample free parking and a cafe (daytime cl... <a href=https://www.netmums.com/local/l/birthlight-pregnancy-postnatal-and-well-woman-yoga>Read more</a>",,
Bring Your Baby Pilates,,GDOS,Palgrave community centre ,Upper Rose lane ,Palgrave ,Diss,,IP22 1AP,Tel: 07914535448,"A lovely friendly class where you can bring your Baby or child along, toys and mats are provided so you can tone and stretch with Baby next to you or ... <a href=https://www.netmums.com/local/l/bring-your-baby-pilates>Read more</a>",,
Diss Otters Swimming Club,,GDOS,Diss Swimming Pool,Victoria Road ,,Diss,Norfolk,IP22 4GJ,Tel: 07738 427735,A warm welcome from Diss Otters Swimming Club.We are a local swimming club at the heart of the community; providing opportunities for swimmers of all ... <a href="https://www.netmums.com/local/l/diss-otters-swimming-club">Read more</a>,,
Baby Swimming Lessons Around Norwich &Amp; Norfolk,,GDOS,87 Yarmouth Road,,,Norwich,,NR7 0HF,Tel: 01603 851880,"Water Babies swimming classes is designed for babies and toddlers. With expert instructors, Water Babies offers a nurturing and safe environment for ... <a href=https://www.netmums.com/local/l/baby-swimming-lessons-around-norwich-norfolk>Read more</a>",,
Aerial Beginners,,GDOS,The Drill House,York Road,,Great Yarmouth,Norfolk,NR30 2LZ,Tel: 01493745458,"Try something you never imagined you could do!In our second block of Aerial Beginners classes, Alana Jones of Dizzy ODare, will introduce you to th... <a href=https://www.netmums.com/local/l/aerial-beginners>Read more</a>",,
Flexibility,,GDOS,The Drill House,York Road,,Great Yarmouth,Norfolk,NR30 2LZ,Tel: 01493745458,"A new session using circus and dance stretching techniques to increase flexibility, help posture and make muscles lean and strong.Tuesdays, 10 Jan ... <a href=https://www.netmums.com/local/l/flexibility>Read more</a>",,
Fatburn - Thorpe St Andrew,,GDOS,Thorpe St Andrew High School,Laundry Lane,,Norwich,,NR7 0XS,Tel: 07785105381,"A fun and energetic class that is suited for all levels. a 6 week block, every week is different:-Week 1 - Best bodyweight exercisesWeek 2 - Get WAIST... <a href=https://www.netmums.com/local/l/body-blast-thorpe-st-andrew>Read more</a>",,
Babyfit Bootcamp,,GDOS,Thorpe High School sports hall,Pound Lane,Thorpe St Andrew,Norwich,Norfolk,NR7 0XS,Tel: 07868750660,Safely and effectively kickstart your fitness and see a real difference in your body shape. BabyFit Bootcamp is specially designed for all women who ... <a href="https://www.netmums.com/local/l/babyfit-bootcamp">Read more</a>,,
Boxercise Classes,,GDOS,Thorpe St Andrew High School,Laundry Lane,,Norwich,,NR7 0XS,Tel: 07785105381,"Learn how to Box (non contact) 8 different steps and punches, a fun way to improve your fitness, wellbeing, core and power.You don't have to sign up ... <a href=https://www.netmums.com/local/l/boxercise-classes-17>Read more</a>",,
Zumba - Eaton Road Norwich,,GDOS,City of Norwich School GYm,Eaton Road,,Norwich,Norfolk,NR4 6PP,Tel: 07717723713,Do you want to lose weight?Tone? or become a fitter healthier you?Have fun in a social and unintimidating atmosphere?Love to Dance?If the answer is y... <a href="https://www.netmums.com/local/l/zumba-399">Read more</a>,,
Sweaty Mama Great Yarmouth And Lowestoft Fitness Classes - Marina,,GDOS,Marina Leisure Centre,Marine Parade,,Great Yarmouth,,NR30 2ER,Tel: 07401497510,"You will love the class, we have a lot of fun and it is a very effective yet fun way to exercise with your child. No need to find childcare, you can ... <a href=https://www.netmums.com/local/l/sweaty-mama-great-yarmouth-and-lowestoft-fitness-classes>Read more</a>",,
Riverside Leisure Centre Norwich,,GDOS,Wherry Road,Riverside,,Norwich,Norfolk,NR1 1WX,Tel: 01603 671390,Swim school classes available for all ages and abilitiesThe Centre also offer classes for preschool children... <a href="https://www.netmums.com/local/l/norwich-riverside-swimming-centre-3">Read more</a>,,
Gravity Active Entertainment Trampoline Park Norwich,,GDOS,Gravity Active Entertainment Norwich,Riverside Entertainment,Wherry Road,Norwich ,,NR1 1WT,Tel: 0330 159 5815,"Feel the rush of oxygen as you experience the force of Gravity! There is no better feeling, whatever your move or style, you can jump, bounce, hop an... <a href=https://www.netmums.com/local/l/gravity-active-entertainment-more-than-just-a-trampoline-park-3>Read more</a>",,
Family Yoga,,GDOS,66-70 Ber Street,,,Norwich,,NR1 3EW,Tel: 01603631900,"Our new Family Yoga classes in Norwich are designed for children of ALL ages. Inspired by YogaBuds 8-year-old Sam and 12-year-old Megan, children of t... <a href=https://www.netmums.com/local/l/family-yoga-21>Read more</a>",,
Colin Browning Personal Training,,GDOS,26 Parsons Mead,Eaton,,Norwich,Norfolk,NR4 6PG,Tel: 07740 584398,"I am a personal trainer with a private studio in Eaton, Norwich. As well as the usual PT qualifications, I have a specialist ante &amp; post natal ex... <a href=https://www.netmums.com/local/l/colin-browning-personal-training>Read more</a>",,
Bootybarre- Dance Pilates &Amp; Yoga,,GDOS,Norwich,,,Norwich,,NR2 2HN,Tel: 07825730970,"Bootybarre is a fun and exciting new workout that combines Yoga, Pilates and Dance to tone and strengthen the whole body using the barre. No experien... <a href=https://www.netmums.com/local/l/bootybarre-the-hottest-barre-workout-is-here>Read more</a>",,
Zenmuma Pregnancy Yoga Classes,,GDOS,Lancaster House Sixth Form Centre,The Norwich School for Girls,Albemarle Road,Norwich,,NR2 2DF,Tel: 01603 631 900,"ZenMuma Pregnancy Yoga classes in Norwich are for all levels of yogic ability, from beginners to those with varying levels of experience. But most im... <a href=https://www.netmums.com/local/l/zenmuma-pregnancy-yoga-classes>Read more</a>",,
Adult Yoga Classes With Zenyoga,,GDOS,Sixth Form Centre,Norwich High School for Girls,Albemarle Road,Norwich,,NR2 2DF,Tel: 01603 631 900,"ZenYoga is inspired by a combination of yoga traditions. Its essentially a Hatha Yoga with a blend of Vinyasa and Bhava, dressed with some Yin.   Z... <a href=https://www.netmums.com/local/l/adult-yoga-classes-with-zenyoga>Read more</a>",,
Puddle Ducks Swimming Lessons For Children Aged 0-4,,GDOS,9 Chalk Hill House,19 Rosary Road,,Norwich,Norfolk,NR1 1SZ,Tel: 01473 941386,The Puddle Ducks swimming programme has been developed over 20 years and each individual lesson plan has been designed to teach children to be happy i... <a href="https://www.netmums.com/local/l/puddle-ducks-swimming-lessons-for-children-aged-0-4">Read more</a>,,
Pregnancy Pilates &Amp; Yoga Class,,GDOS,Complimentary Health Care Clinic,34 Exchange Street,,Norwich,,NR2 1AX,,"I am super excited to offer another pregnancy course with the classes designed using exercises from mainly from Pilates, some Yoga and Physiotherapy a... <a href=https://www.netmums.com/local/l/pregnancy-pilates-yoga-class-1>Read more</a>",,
New Postnatal Pilates Course,,GDOS,Complimentary Health Care Clinic,34 Exchange Street,,Norwich,,NR2 1AX,,Bring your baby along to my NEW Postnatal Pilates course!Congratulations! Your baby has arrived safely; you made it through labour and are now enjoyin... <a href="https://www.netmums.com/local/l/new-postnatal-pilates-course">Read more</a>,,
Legs Bums &Amp; Tums - 16+ (Adult),,GDOS,The Garage,14 Chapelfield North,,Norwich,,NR2 1NY,,"Looking to shape and tone your body? Work up a sweat with this full body aerobic workout which targets the legs, bum and tummy area. This is not a car... <a href=https://www.netmums.com/local/l/legs-bums-tums-16-adult>Read more</a>",,
Mat Pilates - 16+,,GDOS,The Garage,14 Chapelfield North,,Norwich,,NR2 1NY,,"Looking to balance, strengthen, stretch and tone your body? This will help do just that. Suitable for most people, but be aware group classes arent... <a href=https://www.netmums.com/local/l/mat-pilates-16>Read more</a>",,
Dance For Wellbeing - 16+,,GDOS,The Garage,14 Chapelfield North,,Norwich,,NR2 1NY,,Looking to get your week off to a positive start? This dance and movement class is ages 16+ who want to improve their mental health and wellbeing.Ther... <a href="https://www.netmums.com/local/l/dance-for-wellbeing-16">Read more</a>,,
Zumba - 16+,,GDOS,The Garage,14 Chapelfield North,,Norwich,,NR2 1NY,,"If youre going to exercise, why not have fun at the same time? This total body workout mixes moves from Latin dances like samba, mambo and salsa as... <a href=https://www.netmums.com/local/l/zumba-16>Read more</a>",,
Seated Pilates - 16+,,GDOS,The Garage,14 Chapelfield North,,Norwich,,NR2 1NY,,"Great for people with limited mobility or physical disabilities, these challenging sessions are tailored to your individual ability and physicality. T... <a href=https://www.netmums.com/local/l/seated-pilates-16>Read more</a>",,
Self Defence Course - The Garage Norwich Norfolk,,GDOS,14 Chapel Field N,,,Norwich NR2 1NY,,NR2 1NY,Tel: 07765402145,"SSSD are very proud to be delivering this Nationally Recognised Self Defence Leaders Award.12 week Course:-Dates: Sep 19th, 26th - Oct 3rd, 10th, 17t... <a href=https://www.netmums.com/local/l/self-defence-course-the-garage-norwich-norfolk>Read more</a>",,
The Garage Fitness Classes,,GDOS,The Garage ,14 Chapel Field North ,,Norwich ,,NR2 1NY,Tel: 01603 283382,"BALLET BARRE PILATES | CARDIO FUNK | CIRCUITS/HIIT | DANCERCISE LEGS, BUMS &amp; TUMS | MAT PILATES | SCULPT | SEATED PILATES | ZUMBAThe Garage fitne... <a href=https://www.netmums.com/local/l/the-garage-fitness-classes>Read more</a>",,
Bliss Yoga Norwich,,GDOS,Inner Space,Maude Grey Court,,Norwich,Norfolk,NR2 4PA,Tel: 07501 303546,"If you feel the need to have some time for yourself come along to one of my General Yoga Classes.  BREATHE, RELAX, BE......Classes are suitable for al... <a href=https://www.netmums.com/local/l/bliss-yoga-norwich-3>Read more</a>",,
Tread Boldly - Pilates New Class,,GDOS,Inner Space,Maude Grey Court,St Benedicts Street,Norwich,Norfolk,NR2 4PA,Tel: 07525535075,"New Thursday Lunchtime class at Inner Space. Improve your posture, strengthen, tone and increase flexibility and mobility with this relaxed class.  Su... <a href=https://www.netmums.com/local/l/pilates-new-class>Read more</a>",,
Tread Boldly Pilates,,GDOS,Inner Space,Maude Grey Court,St Benedicts Street,Norwich,Norfolk,NR2 4PA,Tel: 07525535075,"Pilates - strengthen, tone and improve posture and flexibility with this friendly class. Suitable for all levels, and great for stress reduction.9:30-... <a href=https://www.netmums.com/local/l/legs-bums-tums-18>Read more</a>",,
Norwich Parkrun,,GDOS,"Eaton Park, ",,,Norwich ,,NR4 7AZ,,"parkrun is a free, weekly, timed 5k run that takes place every Saturday at 9am. junior parkruns are 2k events specifically for 4 to 14 year olds, held... <a href=https://www.netmums.com/local/l/norwich-parkrun>Read more</a>",,
About Metafit,,GDOS,Phoenix Gym,,,Norwich,,NR3 3AF,Tel: 07747752799,"Promising to set your metabolism on fire, MetaFit is a 20 minute High Intensity Interval Training (HIIT) session - bodyweight cardio exercises perform... <a href=https://www.netmums.com/local/l/about-metafit>Read more</a>",,
Strong By Zumba,,GDOS,Open Academy,Salhouse Road,,Norwich,,NR7 9DL,Tel: 07434624523,STRONG by Zumba® is a revolutionary high-intensity workout led by music to motivate you to crush your ultimate fitness goals.In a one-hour class you... <a href="https://www.netmums.com/local/l/strong-by-zumba-6">Read more</a>,,
123 Yoga Tree Fun Parent And Child Yoga,,GDOS,Happy Ohm Yoga Studio,Capitol House,4-6 Heigham Street,Norwich,Norfolk,NR2 4TE,Tel: 07921122709,"Fun, child-led Yoga using games, dancing and singing to stretch and move! Parent and Child 6 week course to build core strength, flexibility and bala... <a href=https://www.netmums.com/local/l/123-yoga-tree-fun-parent-and-child-yoga>Read more</a>",,
Bbarreless,,GDOS,Knowles Dance & Fitness Studio,White House Farm Barns,Paignton,Sprowston,,NR13 6LB,Tel: 07748300091,"In bbarreless, we bring classic barre exercises in the centre for an increased challenge to the core. Combining dance with the principles of Pilates a... <a href=https://www.netmums.com/local/l/bbarreless>Read more</a>",,
Pacific Blue Swim School,,GDOS,Sprowston,,,Norwich,Norfolk,NR7 8NE,Tel: 07711 168708,"We are a small swim school based in Norwich.  We are proud of what we do, teaching and nurturing minds both young and not so young.We work with all ... <a href=https://www.netmums.com/local/l/pacific-blue-swim-school>Read more</a>",,
Abs Combat Pads &Amp; Boxing,,GDOS,Sprowston High School,Cannerby Lane,,Norwich,,NR7 8NE,Tel: 07747752799,"Choreographed moves, layered one at a time to form combinations. Starting with free hands, combat style, moving to pads and gloves with a good mix of ... <a href=https://www.netmums.com/local/l/abs-combat-pads-boxing>Read more</a>",,
Tread Boldly - Personal Training And Nutrition Advice,,GDOS,141 Nelson Street,,,Norwich,,NR2 4DS,Tel: 07525535075,"Come and get fit fast with Tread Boldly Personal Training and Development.  Individual and group sessions available. Lessons taken by Dr Sue Hunter, a... <a href=https://www.netmums.com/local/l/personal-training-and-nutrition-advice-4>Read more</a>",,
Tread Boldly - Pilates Norwich,,GDOS,Belvedere Centre,,,Norwich,Norfolk,NR2 4DS,Tel: 07525535075,"Pilates can improve strength, posture, flexibility and mobility. Come along to one of these gentle yet challenging sessions and see how it can benefit... <a href=https://www.netmums.com/local/l/booking-now-pilates-norwich-3>Read more</a>",,
Little Fish Swim School Norwich,,GDOS,47 Linton Crescent,,,Norwich,,NR7 8NN,Tel: 07432021720,Little Fish is a family run Learn to Swim School set up 10 years ago by Cheryl and Toby Ketland (a mother and son team). Cheryl is a grandmother with ... <a href="https://www.netmums.com/local/l/little-fish-swim-school-norwich">Read more</a>,,
Carlos Method Fitness Personal Training Studio - Hethersett,,GDOS,10 Ullswater Drive,Hethersett,,Norwich,Norfolk,NR9 3QD,Tel: 07843076196,"Looking for a personal trainer near Norwich? Carlos Method Fitness is a friendly personal training studio in Hethersett, specialising in 30 minute wo... <a href=https://www.netmums.com/local/l/carlos-method-fitness-personal-training-studio-hethersett>Read more</a>",,
Pilates For Parents/Carers &Amp; Bring Your Baby,,GDOS,The Feed,Waterloo Park,,Norwich,Norfolk,NR3 3HX,Tel: 07709795891,"Pilates Class focusing on Post Natal Recovery.&amp; Bring your baby with you.As a mum, I understand how hard it is in those first months to be able t... <a href=https://www.netmums.com/local/l/pilates-for-parents-carers-bring-your-baby>Read more</a>",,
Catton Parkrun,,GDOS,"Catton Park, ","Oak Lane, ",,"Norwich, Norfolk,",,NR6 7DB,,"parkrun is a free, weekly, timed 5k run that takes place every Saturday at 9am. junior parkruns are 2k events specifically for 4 to 14 year olds, held... <a href=https://www.netmums.com/local/l/catton-parkrun>Read more</a>",,
Buggy Boot Camp For Mums And Little Ones,,GDOS,Wymondham Martial Arts And Wellbeing Centre,Unit 4 Philip Ford Way,,Wymondham,Norfolk,NR18 9AQ,Tel: 07955685605,Buggy Boot Camp is a class to help new mums get back into shape and re gain  confidence while working out with other mums. Classes are indoors The be... <a href="https://www.netmums.com/local/l/buggy-boot-camp-for-mums-and-little-ones-2">Read more</a>,,