Organisation Name,NACS Code,Organisation Type,Address1,Address2,Address3,Address4,Address5,PostCode,Telephone Number,NHS.UK users rating,Value  (NHS.UK users rating),Banding Classification  (NHS.UK users rating),Accepting NHS patients by referral only,Value  (Accepting NHS patients by referral only),Banding Classification  (Accepting NHS patients by referral only),Accepting new adult NHS patients,Value  (Accepting new adult NHS patients),Banding Classification  (Accepting new adult NHS patients),Accepting new adult patients entitled to free NHS dental care,Value  (Accepting new adult patients entitled to free NHS dental care),Banding Classification  (Accepting new adult patients entitled to free NHS dental care),Accepting children as new NHS patients,Value  (Accepting children as new NHS patients),Banding Classification  (Accepting children as new NHS patients),Urgent NHS dental appointments,Value  (Urgent NHS dental appointments),Banding Classification  (Urgent NHS dental appointments),Induction loop (Induction loop in place),Car parking (Is there car parking at this organisation?)
Orthodontics For You,V007325,DEN,15 Churchfields,,Worcs,Bromsgrove,,B61 8DS,Tel: 01527 575969,No ratings yet Rate it yourself - /Services/dentists/LeaveReview/DefaultView.aspx?id=V007325,0,0,Only by referral from a dental practitioner,true,yes,,false,no,,false,no,,false,no,,false,no,no,yes
Parkside Dental Practice,V014691,DEN,Parkside Bromsgrove Limited,Stourbridge Road,Bromsgrove,Worcs,,B61 0AZ,Tel: 01527 873063,No ratings yet Rate it yourself - /Services/dentists/LeaveReview/DefaultView.aspx?id=V014691,0,0,Only by referral from a dental practitioner,true,yes,,false,no,,false,no,,false,no,,false,no,,
LHDP Smilecare Lansdowne House Dental Practice,V007332,DEN,Lansdowne House,15 Chapel Street,Bromsgrove,Worcestershire,,B60 2BQ,Tel: 01527 872098,7 ratings Rate it yourself - /Services/dentists/LeaveReview/DefaultView.aspx?id=V007332,,,Only by referral from a dental practitioner,true,yes,,false,no,,false,no,,false,no,,false,no,no,yes
College Road Dental Practice,V007326,DEN,2 College Road,Bromsgrove,Worcs,,,B60 2NE,Tel: 01527 872050,42 ratings Rate it yourself - /Services/dentists/LeaveReview/DefaultView.aspx?id=V007326,,,,false,no,No data supplied by the dental practice,Data not available,question,No data supplied by the dental practice,Data not available,question,No data supplied by the dental practice,Data not available,question,,false,no,no,yes
New Road Dental Practice,V007327,DEN,68 New Road,Bromsgrove,Worcs,,,B60 2LA,Tel: 01527 872528,6 ratings Rate it yourself - /Services/dentists/LeaveReview/DefaultView.aspx?id=V007327,,,,false,no,No data supplied by the dental practice,Data not available,question,No data supplied by the dental practice,Data not available,question,No data supplied by the dental practice,Data not available,question,,false,no,no,yes
Damani Dental Practice,V007328,DEN,Damani Dental Practice,5 Trinity Court,Stoke Road,Bromsgrove,Worcestershire,B60 3EQ,Tel: 01527 575884,3 ratings Rate it yourself - /Services/dentists/LeaveReview/DefaultView.aspx?id=V007328,,,,false,no,No data supplied by the dental practice,Data not available,question,No data supplied by the dental practice,Data not available,question,No data supplied by the dental practice,Data not available,question,,false,no,no,no
Catshill Dental Surgery,V000937,DEN,119 Golden Cross Lane,Catshill,Bromsgrove,Worcs,,B61 0LA,Tel: 01527 876003,37 ratings Rate it yourself - /Services/dentists/LeaveReview/DefaultView.aspx?id=V000937,,,,false,no,No data supplied by the dental practice,Data not available,question,No data supplied by the dental practice,Data not available,question,No data supplied by the dental practice,Data not available,question,,true,yes,no,yes
Fairfield Dental Practice,V007330,DEN,334 Stourbridge Road,Catshill,,Bromsgrove,,B61 9LJ,Tel: 01527 577159,9 ratings Rate it yourself - /Services/dentists/LeaveReview/DefaultView.aspx?id=V007330,,,,false,no,No data supplied by the dental practice,Data not available,question,No data supplied by the dental practice,Data not available,question,No data supplied by the dental practice,Data not available,question,,false,no,no,yes
Barnt Green Dental,V007318,DEN,111 Hewell Road,Barnt Green,Birmingham,W Midlands,West Midlands,B45 8NW,Tel: 0121 445 1515,3 ratings Rate it yourself - /Services/dentists/LeaveReview/DefaultView.aspx?id=V007318,,,Only by referral from a dental practitioner,true,yes,,false,no,,false,no,,false,no,,false,no,no,yes
Eachway Dental Practice,V007329,DEN,14 Eachway,,Birmingham,Rubery,,B45 9DQ,Tel: 0121 4532793,3 ratings Rate it yourself - /Services/dentists/LeaveReview/DefaultView.aspx?id=V007329,,,,false,no,No data supplied by the dental practice,Data not available,question,No data supplied by the dental practice,Data not available,question,No data supplied by the dental practice,Data not available,question,,true,yes,no,yes
Mr C Leung,V007338,DEN,119 New Road,Rubery,Rednal,Birmingham,,B45 9JR,Tel: 0121 457 9091,2 ratings Rate it yourself - /Services/dentists/LeaveReview/DefaultView.aspx?id=V007338,,,,false,no,No data supplied by the dental practice,Data not available,question,No data supplied by the dental practice,Data not available,question,No data supplied by the dental practice,Data not available,question,,false,no,no,yes
Callowbrook Dental Practice,V007320,DEN,,67 Callowbrook Lane,Rubery,Birmingham,West Midlands,B45 9HP,Tel: 0121 453 5541,5 ratings Rate it yourself - /Services/dentists/LeaveReview/DefaultView.aspx?id=V007320,,,,false,no,No data supplied by the dental practice,Data not available,question,No data supplied by the dental practice,Data not available,question,No data supplied by the dental practice,Data not available,question,,false,no,yes,yes
Alvechurch Dental,V007340,DEN,1 The Square,Alvechurch,Birmingham,W Midlands,,B48 7LA,Tel: 0121 445 3600,14 ratings Rate it yourself - /Services/dentists/LeaveReview/DefaultView.aspx?id=V007340,,,,false,no,No data supplied by the dental practice,Data not available,question,No data supplied by the dental practice,Data not available,question,No data supplied by the dental practice,Data not available,question,,true,yes,no,yes
Greenwood Dental Practice,V001210,DEN,17 Edgewood Road,Rednal,,Birmingham,,B45 8SB,Tel: 0121 453 7949,1 rating Rate it yourself - /Services/dentists/LeaveReview/DefaultView.aspx?id=V001210,,,No data supplied by the dental practice,Data not available,question,No data supplied by the dental practice,Data not available,question,No data supplied by the dental practice,Data not available,question,No data supplied by the dental practice,Data not available,question,No data supplied by the dental practice,Data not available,question,no,yes
Mr Moodley Webheath Dental,V007341,DEN,11 Tynsall Avenue,Redditch,Worcs,Redditch,Worcestershire,B97 5SF,Tel: 01527 544999,13 ratings Rate it yourself - /Services/dentists/LeaveReview/DefaultView.aspx?id=V007341,,,Only by referral from a dental practitioner,true,yes,,false,no,,false,no,,false,no,,true,yes,yes,yes
Pinnacle Orthodontics Limited,V007321,DEN,Pinnacle Orthodontics Ltd,343 Birchfield Road,Webheath,Redditch,Worcestershire,B97 4NE,Tel: 01527 543200,9 ratings Rate it yourself - /Services/dentists/LeaveReview/DefaultView.aspx?id=V007321,,,Only by referral from a dental practitioner,true,yes,,false,no,,false,no,,false,no,,true,yes,yes,yes
BCHC - Special Care,V008189,DEN,Dental Dept.,Reaside Clinic,"Bristol Road South, Rednal",BIRMINGHAM,West Midlands,B45 9BE,,No ratings yet Rate it yourself - /Services/dentists/LeaveReview/DefaultView.aspx?id=V008189,0,0,No data supplied by the dental practice,Data not available,question,No data supplied by the dental practice,Data not available,question,No data supplied by the dental practice,Data not available,question,No data supplied by the dental practice,Data not available,question,No data supplied by the dental practice,Data not available,question,,
Family Dental Practice,V001188,DEN,22 Arden Road,Rednal,Birmingham,West Midlands,,B45 0JA,Tel: 0121 453 1346,3 ratings Rate it yourself - /Services/dentists/LeaveReview/DefaultView.aspx?id=V001188,,,,false,no,No data supplied by the dental practice,Data not available,question,No data supplied by the dental practice,Data not available,question,No data supplied by the dental practice,Data not available,question,,true,yes,no,yes
Redditch Smile Care,V038885,DEN,53 Bromsgrove Road,Redditch,,,,B97 4RH,,No ratings yet Rate it yourself - /Services/dentists/LeaveReview/DefaultView.aspx?id=V038885,0,0,No data supplied by the dental practice,Data not available,question,No data supplied by the dental practice,Data not available,question,No data supplied by the dental practice,Data not available,question,No data supplied by the dental practice,Data not available,question,No data supplied by the dental practice,Data not available,question,,
Hollymoor Tower Dental Surgery,V007263,DEN,Hollymoor Medical Centre,Manor Park Grove,Northfield,Birmingham,,B31 5ER,Tel: 0121 453 6162,23 ratings Rate it yourself - /Services/dentists/LeaveReview/DefaultView.aspx?id=V007263,,,Only by referral from a dental practitioner,true,yes,,false,no,,false,no,,false,no,,true,yes,yes,yes
Dentists at Redhouse Limited,V007337,DEN,Redhouse,Prospect Hill,,Redditch,Worcestershire,B97 4BG,Tel: 01527 63141,2 ratings Rate it yourself - /Services/dentists/LeaveReview/DefaultView.aspx?id=V007337,,,,false,no,No data supplied by the dental practice,Data not available,question,No data supplied by the dental practice,Data not available,question,No data supplied by the dental practice,Data not available,question,,false,no,yes,yes
Midlands Smile Centre West Heath,V001478,DEN,225 Longbridge Lane,West Heath,,Birmingham,,B31 4RE,Tel: 0121 476 0976,214 ratings Rate it yourself - /Services/dentists/LeaveReview/DefaultView.aspx?id=V001478,,,,false,no,No data supplied by the dental practice,Data not available,question,No data supplied by the dental practice,Data not available,question,No data supplied by the dental practice,Data not available,question,,true,yes,no,yes
CDS Redditch Community Dental,V328800,DEN,Orchard Place,Orchard Street,Redditch,,,B98 7DP,,No ratings yet Rate it yourself - /Services/dentists/LeaveReview/DefaultView.aspx?id=V328800,0,0,No data supplied by the dental practice,Data not available,question,No data supplied by the dental practice,Data not available,question,No data supplied by the dental practice,Data not available,question,No data supplied by the dental practice,Data not available,question,No data supplied by the dental practice,Data not available,question,,
"mydentist, Archer Road, Redditch",V007317,DEN,,107 Archer Road,,Redditch,Worcestershire,B98 8DJ,Tel: 0152764727,29 ratings Rate it yourself - /Services/dentists/LeaveReview/DefaultView.aspx?id=V007317,,,,false,no,No data supplied by the dental practice,Data not available,question,No data supplied by the dental practice,Data not available,question,No data supplied by the dental practice,Data not available,question,,false,no,no,yes
Mr R A S Norman ,V007334,DEN,3-5 Birchfield Road,Redditch,Worcs,,,B97 4LB,Tel: 01527 401235,No ratings yet Rate it yourself - /Services/dentists/LeaveReview/DefaultView.aspx?id=V007334,0,0,Only by referral from a dental practitioner,true,yes,,false,no,,false,no,,false,no,,false,no,no,yes
Gentle Dental Practice,V016302,DEN,Gentle Dental Care Of Droitwich,62 Friar Street,,Droitwich,Worcestershire,WR9 8EF,Tel: 01905 799547,10 ratings Rate it yourself - /Services/dentists/LeaveReview/DefaultView.aspx?id=V016302,,,,false,no,No data supplied by the dental practice,Data not available,question,No data supplied by the dental practice,Data not available,question,No data supplied by the dental practice,Data not available,question,,true,yes,yes,
Mr A M Rajput ,V007331,DEN,272 Evesham Road,Redditch,Worcs,,,B97 5EP,Tel: 01527 550995,No ratings yet Rate it yourself - /Services/dentists/LeaveReview/DefaultView.aspx?id=V007331,0,0,Only by referral from a dental practitioner,true,yes,,false,no,,false,no,,false,no,,false,no,no,yes
House of Dental,V001123,DEN,House of Dental,31 Redhill Road,,Birmingham,West Midlands,B31 3JS,Tel: 0121 476 6218,24 ratings Rate it yourself - /Services/dentists/LeaveReview/DefaultView.aspx?id=V001123,,,Only by referral from a dental practitioner,true,yes,,false,no,,false,no,,false,no,,false,no,yes,yes
Crabbs Cross Dental Practice,V007892,DEN,40 Kenilworth Close,Crabbs Cross,Redditch,Worcestershire,West Midlands,B97 5JX,Tel: 01527 402440,7 ratings Rate it yourself - /Services/dentists/LeaveReview/DefaultView.aspx?id=V007892,,,,false,no,No data supplied by the dental practice,Data not available,question,No data supplied by the dental practice,Data not available,question,No data supplied by the dental practice,Data not available,question,,false,no,no,no
Spa Dental Clinic ,V001073,DEN,47 Blackfriars Avenue,,Worcs,Droitwich,,WR9 8RT,Tel: 01905 773111,18 ratings Rate it yourself - /Services/dentists/LeaveReview/DefaultView.aspx?id=V001073,,,Only by referral from a dental practitioner,true,yes,,false,no,,false,no,,false,no,,true,yes,yes,yes
Worcester Road Dental Practice,V009396,DEN,91 Worcester Road,Droitwich,Worcs,,,WR9 8AQ,Tel: 01905 796331,7 ratings Rate it yourself - /Services/dentists/LeaveReview/DefaultView.aspx?id=V009396,,,,false,no,No data supplied by the dental practice,Data not available,question,No data supplied by the dental practice,Data not available,question,No data supplied by the dental practice,Data not available,question,,false,no,no,yes
Hilltop Dental Spa,V001225,DEN,1007 Bristol Road South,Northfield,Birmingham,West Midlands,,B31 2QT,Tel: 0121 475 2321,14 ratings Rate it yourself - /Services/dentists/LeaveReview/DefaultView.aspx?id=V001225,,,,false,no,No data supplied by the dental practice,Data not available,question,No data supplied by the dental practice,Data not available,question,No data supplied by the dental practice,Data not available,question,,true,yes,no,yes
Clive Harris & Associates,V001212,DEN,990 Bristol Road South,Northfield,,Birmingham,,B31 2PE,Tel: 0121 475 2666,25 ratings Rate it yourself - /Services/dentists/LeaveReview/DefaultView.aspx?id=V001212,,,,false,no,No data supplied by the dental practice,Data not available,question,No data supplied by the dental practice,Data not available,question,No data supplied by the dental practice,Data not available,question,,true,yes,no,yes
BCHC - Special Care,V008178,DEN,Northfield Health Centre,15 St Heliers Road,BIRMINGHAM,West Midlands,,B31 1QT,,No ratings yet Rate it yourself - /Services/dentists/LeaveReview/DefaultView.aspx?id=V008178,0,0,No data supplied by the dental practice,Data not available,question,No data supplied by the dental practice,Data not available,question,No data supplied by the dental practice,Data not available,question,No data supplied by the dental practice,Data not available,question,No data supplied by the dental practice,Data not available,question,,
BCHC - Paediatrics,V008177,DEN,Hawkesley Health Centre,375 Shannon Road,BIRMINGHAM,West Midlands,,B38 9TJ,,No ratings yet Rate it yourself - /Services/dentists/LeaveReview/DefaultView.aspx?id=V008177,0,0,No data supplied by the dental practice,Data not available,question,No data supplied by the dental practice,Data not available,question,No data supplied by the dental practice,Data not available,question,No data supplied by the dental practice,Data not available,question,No data supplied by the dental practice,Data not available,question,,
Ms S Mestry,V025213,DEN,Medical centre,5 Tanhouse Lane,Redditch,Worcs,,B98 9AA,Tel: 01527 63050,1 rating Rate it yourself - /Services/dentists/LeaveReview/DefaultView.aspx?id=V025213,,,,false,no,No data supplied by the dental practice,Data not available,question,No data supplied by the dental practice,Data not available,question,No data supplied by the dental practice,Data not available,question,,true,yes,yes,yes
Hagley Dental Practice ,V008011,DEN,157 Worcester Road,Hagley,Nr Stourbridge,Worcestershire,,DY9 0NW,Tel: 01562 883177,2 ratings Rate it yourself - /Services/dentists/LeaveReview/DefaultView.aspx?id=V008011,,,,false,no,No data supplied by the dental practice,Data not available,question,No data supplied by the dental practice,Data not available,question,No data supplied by the dental practice,Data not available,question,,false,no,yes,yes
Dental Surgery,V001191,DEN,58 Bunbury Road,Northfield,,Birmingham,,B31 2DW,Tel: 0121 475 2223,26 ratings Rate it yourself - /Services/dentists/LeaveReview/DefaultView.aspx?id=V001191,,,,false,no,No data supplied by the dental practice,Data not available,question,No data supplied by the dental practice,Data not available,question,No data supplied by the dental practice,Data not available,question,,true,yes,yes,yes
"mydentist, Redditch Road, Kings Norton",V001221,DEN,,183 Redditch Road,Kings Norton,Birmingham,West Midlands,B38 8RH,Tel: 0121 458 5415,37 ratings Rate it yourself - /Services/dentists/LeaveReview/DefaultView.aspx?id=V001221,,,,false,no,No data supplied by the dental practice,Data not available,question,No data supplied by the dental practice,Data not available,question,No data supplied by the dental practice,Data not available,question,,false,no,no,yes
Bhandal Dental Practice - Bartley Green,V001187,DEN,12 Curdale Road,Bartley Green,,Birmingham,West Midlands,B32 4HB,Tel: 0121 475 3144,14 ratings Rate it yourself - /Services/dentists/LeaveReview/DefaultView.aspx?id=V001187,,,,false,no,No data supplied by the dental practice,Data not available,question,No data supplied by the dental practice,Data not available,question,No data supplied by the dental practice,Data not available,question,,true,yes,no,yes
Fold Dental Surgery,V001203,DEN,38 The Fold,Kings Norton,,Birmingham,,B38 9BL,Tel: 0121 458 2330,6 ratings Rate it yourself - /Services/dentists/LeaveReview/DefaultView.aspx?id=V001203,,,,false,no,No data supplied by the dental practice,Data not available,question,No data supplied by the dental practice,Data not available,question,No data supplied by the dental practice,Data not available,question,,true,yes,no,no
The Greens Dental Surgery,V001199,DEN,30 The Green,Kings Norton,,Birmingham,West Midlands,B38 8SD,Tel: 0121 458 1362,6 ratings Rate it yourself - /Services/dentists/LeaveReview/DefaultView.aspx?id=V001199,,,Only by referral from a dental practitioner,true,yes,,false,no,,false,no,,false,no,,false,no,no,yes
Jiggins Lane Dental Surgery,V001479,DEN,17 Jiggins Lane,Bartley Green,,Birmingham,,B32 3LE,Tel: 0121 476 5360,8 ratings Rate it yourself - /Services/dentists/LeaveReview/DefaultView.aspx?id=V001479,,,,false,no,No data supplied by the dental practice,Data not available,question,No data supplied by the dental practice,Data not available,question,No data supplied by the dental practice,Data not available,question,,false,no,yes,yes
M Simwanza,V007333,DEN,Matchborough Centre,Matchborough Way,Redditch,Worcs,,B98 0EP,Tel: 01527 523492,3 ratings Rate it yourself - /Services/dentists/LeaveReview/DefaultView.aspx?id=V007333,,,,false,no,No data supplied by the dental practice,Data not available,question,No data supplied by the dental practice,Data not available,question,No data supplied by the dental practice,Data not available,question,,true,yes,no,yes
Station Dental Practice,V001194,DEN,61 Pershore Road South,Kings Norton,Birmingham,,,B30 3EL,Tel: 0121 458 2594,15 ratings Rate it yourself - /Services/dentists/LeaveReview/DefaultView.aspx?id=V001194,,,,false,no,No data supplied by the dental practice,Data not available,question,No data supplied by the dental practice,Data not available,question,No data supplied by the dental practice,Data not available,question,,true,yes,no,no
Williams Dental Surgery,V004017,DEN,20 Hagley Street,Halesowen,,W Midlands,,B63 3AU,Tel: 0121 550 5948,26 ratings Rate it yourself - /Services/dentists/LeaveReview/DefaultView.aspx?id=V004017,,,,false,no,No data supplied by the dental practice,Data not available,question,No data supplied by the dental practice,Data not available,question,No data supplied by the dental practice,Data not available,question,,false,no,no,yes
Bhandal Dental Practice,V004098,DEN,114 Alexandra Road,Halesowen,,West Midlands,,B63 4BL,Tel: 0121 550 2961,10 ratings Rate it yourself - /Services/dentists/LeaveReview/DefaultView.aspx?id=V004098,,,,false,no,No data supplied by the dental practice,Data not available,question,No data supplied by the dental practice,Data not available,question,No data supplied by the dental practice,Data not available,question,,true,yes,no,yes
Bhandal Dental Practice - Barnes Hill,V001189,DEN,267 Barnes Hill,Weoley Castle,,Birmingham,West Midlands,B29 5TX,Tel: 0121 427 2414,32 ratings Rate it yourself - /Services/dentists/LeaveReview/DefaultView.aspx?id=V001189,,,,false,no,No data supplied by the dental practice,Data not available,question,No data supplied by the dental practice,Data not available,question,No data supplied by the dental practice,Data not available,question,,true,yes,no,yes
Morgan Dental Practice,V004248,DEN,Rumbow House,Rumbow,,Halesowen,West Midlands,B63 3HU,Tel: 0121 550 1080,1 rating Rate it yourself - /Services/dentists/LeaveReview/DefaultView.aspx?id=V004248,,,Only by referral from a dental practitioner,true,yes,,false,no,,false,no,,false,no,,false,no,no,no
Comberton Road Dental Surgery,V009220,DEN,Comberton Dental Surgery Ltd,29 Comberton Road,Worcs,Kidderminster,Worcestershire,DY10 3DL,Tel: 01562751240,5 ratings Rate it yourself - /Services/dentists/LeaveReview/DefaultView.aspx?id=V009220,,,Only by referral from a dental practitioner,true,yes,,false,no,,false,no,,false,no,,false,no,no,yes
The Bells Lane Dental Practice,V001202,DEN,145 Bells Lane,Druids Heath,Birmingham,West Midlands,,B14 5QJ,Tel: 0121 458 5769,12 ratings Rate it yourself - /Services/dentists/LeaveReview/DefaultView.aspx?id=V001202,,,,false,no,No data supplied by the dental practice,Data not available,question,No data supplied by the dental practice,Data not available,question,No data supplied by the dental practice,Data not available,question,,false,no,no,no
MR SR MEHTA,V006159,DEN,Dormer House Dental Practice (formerly Marble Alley Dental Practice),19B Station Road,,Studley,Warwickshire,B80 7HR,Tel: 01527 853064,9 ratings Rate it yourself - /Services/dentists/LeaveReview/DefaultView.aspx?id=V006159,,,Only by referral from a dental practitioner,true,yes,,false,no,,false,no,,false,no,,false,no,yes,yes
JustOrthodontics,V339333,DEN,JustOrthodontics,18-20 Grange Road,Stourbridge,West Midlands,,DY9 7LE,,No ratings yet Rate it yourself - /Services/dentists/LeaveReview/DefaultView.aspx?id=V339333,0,0,No data supplied by the dental practice,Data not available,question,No data supplied by the dental practice,Data not available,question,No data supplied by the dental practice,Data not available,question,No data supplied by the dental practice,Data not available,question,No data supplied by the dental practice,Data not available,question,,
Oakleigh Dental,V004048,DEN,Oakleigh Dental Practice & Implant Centre,103 Spies Lane,,Halesowen,West Midlands,B62 9SS,Tel: 0121 421 4199,7 ratings Rate it yourself - /Services/dentists/LeaveReview/DefaultView.aspx?id=V004048,,,,false,no,No data supplied by the dental practice,Data not available,question,No data supplied by the dental practice,Data not available,question,No data supplied by the dental practice,Data not available,question,,false,no,yes,yes
Just Orthodontics,V011146,DEN,JustOrthodontics,@ Holcroft Dental,Holcroft Road,Stourbridge,West Midlands,DY9 7LL,Tel: 07763483261,1 rating Rate it yourself - /Services/dentists/LeaveReview/DefaultView.aspx?id=V011146,,,Only by referral from a dental practitioner,true,yes,,false,no,,false,no,,false,no,,false,no,no,yes