Organisation Name,NACS Code,Organisation Type,Address1,Address2,Address3,Address4,Address5,PostCode,Telephone Number,NHS.UK users rating,Value  (NHS.UK users rating),Banding Classification  (NHS.UK users rating),Registered manager in post,Value  (Registered manager in post),Banding Classification  (Registered manager in post),Food hygiene rating,Value  (Food hygiene rating),Banding Classification  (Food hygiene rating),Size of care home,Value  (Size of care home),Banding Classification  (Size of care home),Car parking (Is there car parking at this organisation?),Disabled access (Disabled access)
Stocks Hall Care Home - St Helens,,SCL,6 Elderflower Road,Dentons Green,,St Helens,Merseyside,WA10 6FP,Tel: 01744733385,No ratings yet Rate it yourself - /Services/careproviders/LeaveReview/DefaultView.aspx?id=1-128901297,0,0,Yes registered manager in post,1,Yes,5 Very good,5,,Large 54 beds,Large,,,
Broadoak Manor Care Home,,SCL,Mulcrow Close,Parr,,St Helens,Merseyside,WA9 1HB,Tel: 01744615626,No ratings yet Rate it yourself - /Services/careproviders/LeaveReview/DefaultView.aspx?id=1-3120120335,0,0,Yes registered manager in post,1,Yes,5 Very good,5,,Large 120 beds,Large,,,
Victoria Care Home,,SCL,Victoria Street,Rainford,,St Helens,Merseyside,WA11 8DA,Tel: 01744886225,No ratings yet Rate it yourself - /Services/careproviders/LeaveReview/DefaultView.aspx?id=1-135674219,0,0,Yes registered manager in post,1,Yes,5 Very good,5,,Large 53 beds,Large,,,
Parr Care Home,,SCL,42 Fleet Lane,,,St Helens,Merseyside,WA9 1SX,Tel: 01744616339,No ratings yet Rate it yourself - /Services/careproviders/LeaveReview/DefaultView.aspx?id=1-4218648874,0,0,Yes registered manager in post,1,Yes,5 Very good,5,,Large 60 beds,Large,,,
Grace Court Care Centre,,SCL,Prescot Road,,,St Helens,Merseyside,WA10 3UU,Tel: 01744752108,No ratings yet Rate it yourself - /Services/careproviders/LeaveReview/DefaultView.aspx?id=1-2446549368,0,0,Yes registered manager in post,1,Yes,5 Very good,5,,Medium 30 beds,Medium,,,
Abbeyrose Court,,SCL,Piele Road,Haydock,,St. Helens,,WA11 0JY,Tel: 01942270548,No ratings yet Rate it yourself - /Services/careproviders/LeaveReview/DefaultView.aspx?id=1-9666615755,0,0,Yes registered manager in post,1,Yes,5 Very good,5,,Medium 46 beds,Medium,,,
Eccleston Court Care Home,,SCL,Holme Road,Eccleston,,St. Helens,,WA10 5NW,Tel: 01744453655,No ratings yet Rate it yourself - /Services/careproviders/LeaveReview/DefaultView.aspx?id=1-11433069399,0,0,Yes registered manager in post,1,Yes,Data not supplied,,doesnotapply,Large 54 beds,Large,,,
Garswood House Residential Care Home,,SCL,Garswood House,"Wentworth Road, Ashton In Makerfield",,Wigan,Lancashire,WN4 9TZ,Tel: 02084227365,No ratings yet Rate it yourself - /Services/careproviders/LeaveReview/DefaultView.aspx?id=1-4344463401,0,0,Yes registered manager in post,1,Yes,3 Generally satisfactory,3,,Large 53 beds,Large,,,
Madison Court,,SCL,Madison Close,Parr,,St Helens,Merseyside,WA9 3RW,Tel: 01744455150,No ratings yet Rate it yourself - /Services/careproviders/LeaveReview/DefaultView.aspx?id=1-4643298185,0,0,Yes registered manager in post,1,Yes,5 Very good,5,,Large 66 beds,Large,,,
Ashton View Nursing Home,,SCL,Wigan Road,Aston-in-Makerfield,,Wigan,Greater Manchester,WN4 9BJ,Tel: 01942722988,No ratings yet Rate it yourself - /Services/careproviders/LeaveReview/DefaultView.aspx?id=1-319143079,0,0,Yes registered manager in post,1,Yes,4 Good,4,,Large 58 beds,Large,,,
Berkeley Park,,SCL,Alexandra Court,Howard Street,,Wigan,Lancashire,WN5 8BH,Tel: 01942215555,No ratings yet Rate it yourself - /Services/careproviders/LeaveReview/DefaultView.aspx?id=1-273734572,0,0,Yes registered manager in post,1,Yes,No rating available,No rating available,,Large 54 beds,Large,,,
The Spinney Nursing Home,,SCL,16 College Road,Upholland,,Skelmersdale,Lancashire,WN8 0PY,Tel: 01695632771,No ratings yet Rate it yourself - /Services/careproviders/LeaveReview/DefaultView.aspx?id=1-1004589685,0,0,Yes registered manager in post,1,Yes,4 Good,4,,Medium 35 beds,Medium,,,
Elizabeth Court,,SCL,New Street,Sutton,,St Helens,Merseyside,WA9 3XQ,Tel: 01744821700,No ratings yet Rate it yourself - /Services/careproviders/LeaveReview/DefaultView.aspx?id=1-154973553,0,0,Yes registered manager in post,1,Yes,No rating available,No rating available,,Medium 44 beds,Medium,,,
Cuerden Developments Limited - Berkeley House,,SCL,Berkeley House,Ellesmere Road,,Wigan,Lancashire,WN5 9LA,Tel: 01942737372,No ratings yet Rate it yourself - /Services/careproviders/LeaveReview/DefaultView.aspx?id=1-273734393,0,0,Yes registered manager in post,1,Yes,3 Generally satisfactory,3,,Large 55 beds,Large,,,
St Mary's Continuing Care,,SCL,St Mary's Care Centre,"Penny Lane, Collins Green",,Warrington,Cheshire,WA5 4DS,Tel: 01925294850,No ratings yet Rate it yourself - /Services/careproviders/LeaveReview/DefaultView.aspx?id=1-1442898828,0,0,Yes registered manager in post,1,Yes,5 Very good,5,,Large 63 beds,Large,,,
Shawcross Care Home,,SCL,Bolton Road,Ashton-in-makerfield,,Wigan,,WN4 8TU,Tel: 01942276628,No ratings yet Rate it yourself - /Services/careproviders/LeaveReview/DefaultView.aspx?id=1-18124486398,0,0,Yes registered manager in post,1,Yes,Data not supplied,,doesnotapply,Medium 50 beds,Medium,,,
Aaron Crest Care Home,,SCL,Tanhouse Road,,,Skelmersdale,Lancashire,WN8 6AZ,Tel: 01695558880,No ratings yet Rate it yourself - /Services/careproviders/LeaveReview/DefaultView.aspx?id=1-145585762,0,0,No registered manager in post,2,No,5 Very good,5,,Large 66 beds,Large,,,
Adamstan House Nursing Home,,SCL,187 Mill Lane,,,St Helens,Merseyside,WA9 4HG,Tel: 01744819815,No ratings yet Rate it yourself - /Services/careproviders/LeaveReview/DefaultView.aspx?id=1-123853298,0,0,Yes registered manager in post,1,Yes,5 Very good,5,,Medium 34 beds,Medium,,,
Dean Wood Manor,,SCL,Spring Road,Orrell,,Wigan,Greater Manchester,WN5 0JH,Tel: 01942223982,No ratings yet Rate it yourself - /Services/careproviders/LeaveReview/DefaultView.aspx?id=1-10758838294,0,0,Yes registered manager in post,1,Yes,Data not supplied,,doesnotapply,Medium 50 beds,Medium,,,
Mahogany Care Home,,SCL,Marsden Street,Newtown,,Greater Manchester,,WN5 0TS,Tel: 01942 820800,No ratings yet Rate it yourself - /Services/careproviders/LeaveReview/DefaultView.aspx?id=1-1974760307,0,0,Yes registered manager in post,1,Yes,5 Very good,5,,Large 51 beds,Large,,,
Westwood Lodge,,SCL,Brookview,"Helmsman Way, off Poolstock Lane",,Wigan,Greater Manchester,WN3 5DJ,Tel: 01942829999,No ratings yet Rate it yourself - /Services/careproviders/LeaveReview/DefaultView.aspx?id=1-11263733733,0,0,Yes registered manager in post,1,Yes,Data not supplied,,doesnotapply,Large 76 beds,Large,,,
Birch Green Care Home,,SCL,Ivydale,Birch Green,,Skelmersdale,Lancashire,WN8 6RS,Tel: 01162705678,No ratings yet Rate it yourself - /Services/careproviders/LeaveReview/DefaultView.aspx?id=1-18169550185,0,0,Yes registered manager in post,1,Yes,Data not supplied,,doesnotapply,Large 74 beds,Large,,,
Avondale Mental Healthcare Centre,,SCL,11 Sandstone Drive,,,Prescot,Merseyside,L35 7LS,,No ratings yet Rate it yourself - /Services/careproviders/LeaveReview/DefaultView.aspx?id=1-123433942,0,0,Yes registered manager in post,1,Yes,5 Very good,5,,Large 54 beds,Large,,,
Stocks Hall Nursing Home - Skelmersdale,,SCL,50C Whitemoss Road,,,Skelmersdale,Lancashire,WN8 8BL,Tel: 01695555234,No ratings yet Rate it yourself - /Services/careproviders/LeaveReview/DefaultView.aspx?id=1-128901248,0,0,Yes registered manager in post,1,Yes,5 Very good,5,,Large 60 beds,Large,,,
Alexandra Care Home,,SCL,Wargrave Road,,,Newton-le-willows,,WA12 8RP,Tel: 01925220963,No ratings yet Rate it yourself - /Services/careproviders/LeaveReview/DefaultView.aspx?id=1-18074215565,0,0,Yes registered manager in post,1,Yes,Data not supplied,,doesnotapply,Medium 48 beds,Medium,,,
Ainsdale Court,,SCL,Holt Lane,Rainhill,,Prescot,,L35 8NB,Tel: 015149313451,No ratings yet Rate it yourself - /Services/careproviders/LeaveReview/DefaultView.aspx?id=1-9779896504,0,0,Yes registered manager in post,1,Yes,5 Very good,5,,Medium 46 beds,Medium,,,
The Old Vicarage Nursing and Residential Care Centre,,SCL,Fir Tree Lane,Burtonwood,,Warrington,Cheshire,WA5 4NN,Tel: 01925229944,No ratings yet Rate it yourself - /Services/careproviders/LeaveReview/DefaultView.aspx?id=1-700814442,0,0,Yes registered manager in post,1,Yes,5 Very good,5,,Large 60 beds,Large,,,
Douglas Bank Nursing Home,,SCL,Lees Lane,Appley Bridge,,Wigan,Greater Manchester,WN8 0SZ,Tel: 01257255823,No ratings yet Rate it yourself - /Services/careproviders/LeaveReview/DefaultView.aspx?id=1-118357766,0,0,No registered manager in post,2,No,5 Very good,5,,Medium 40 beds,Medium,,,
Jah-Jireh Charity Homes Wigan,,SCL,141 Springfield Road,Beech Hill,,Wigan,Greater Manchester,WN6 7RH,Tel: 01942243533,No ratings yet Rate it yourself - /Services/careproviders/LeaveReview/DefaultView.aspx?id=1-119681093,0,0,Yes registered manager in post,1,Yes,5 Very good,5,,Medium 47 beds,Medium,,,
Belong Wigan Care Village,,SCL,Millers Lane,Platt Bridge,,Wigan,Greater Manchester,WN2 5DD,Tel: 01942855600,No ratings yet Rate it yourself - /Services/careproviders/LeaveReview/DefaultView.aspx?id=1-128323309,0,0,Yes registered manager in post,1,Yes,5 Very good,5,,Large 67 beds,Large,,,
St George's Nursing Home (Wigan),,SCL,Windsor Street,,,Greater Manchester,,WN1 3NT,Tel: 01942 821399,No ratings yet Rate it yourself - /Services/careproviders/LeaveReview/DefaultView.aspx?id=1-140686805,0,0,Yes registered manager in post,1,Yes,5 Very good,5,,Medium 50 beds,Medium,,,
Appleby Court Care Home,,SCL,173 Roughwood Drive,Northwood,,Kirkby,Merseyside,L33 8YR,Tel: 01515486267,No ratings yet Rate it yourself - /Services/careproviders/LeaveReview/DefaultView.aspx?id=1-156089134,0,0,No registered manager in post,2,No,4 Good,4,,Large 60 beds,Large,,,
Hillside Care Home,,SCL,Hillside Avenue,,,Liverpool,Merseyside,L36 8DU,Tel: 01514430271,No ratings yet Rate it yourself - /Services/careproviders/LeaveReview/DefaultView.aspx?id=1-4184346142,0,0,Yes registered manager in post,1,Yes,5 Very good,5,,Large 119 beds,Large,,,
Fernwood,,SCL,239 Knowsley Lane,,,Liverpool,,L36 8EL,,No ratings yet Rate it yourself - /Services/careproviders/LeaveReview/DefaultView.aspx?id=1-18232133697,0,0,Yes registered manager in post,1,Yes,Data not supplied,,doesnotapply,Medium 28 beds,Medium,,,
The Rowans Care Home,,SCL,339 Bickershaw Lane,Bickershaw,,Wigan,,WN2 5TE,Tel: 01942316740,No ratings yet Rate it yourself - /Services/careproviders/LeaveReview/DefaultView.aspx?id=1-17709796445,0,0,Yes registered manager in post,1,Yes,Data not supplied,,doesnotapply,Large 66 beds,Large,,,
St Oswalds,,SCL,12 Golborne Road,Winwick,,Warrington,Cheshire,WA2 8SZ,Tel: 01925656337,No ratings yet Rate it yourself - /Services/careproviders/LeaveReview/DefaultView.aspx?id=1-12302524129,0,0,Yes registered manager in post,1,Yes,Data not supplied,,doesnotapply,Medium 42 beds,Medium,,,
Rosebridge Court,,SCL,191 Darby Lane,Hindley,,Wigan,Greater Manchester,WN2 3DU,Tel: 01942526240,No ratings yet Rate it yourself - /Services/careproviders/LeaveReview/DefaultView.aspx?id=1-320558665,0,0,Yes registered manager in post,1,Yes,4 Good,4,,Medium 46 beds,Medium,,,
Carrington Court,,SCL,190 Darby Lane,Hindley,,Wigan,Greater Manchester,WN2 3DU,Tel: 01942526220,No ratings yet Rate it yourself - /Services/careproviders/LeaveReview/DefaultView.aspx?id=1-319279092,0,0,Yes registered manager in post,1,Yes,5 Very good,5,,Medium 48 beds,Medium,,,
Haighfield Care Home,,SCL,241 Wigan Road,Standish,,Wigan,Greater Manchester,WN1 2RF,Tel: 01942821165,No ratings yet Rate it yourself - /Services/careproviders/LeaveReview/DefaultView.aspx?id=1-133346144,0,0,Yes registered manager in post,1,Yes,No rating available,No rating available,,Medium 45 beds,Medium,,,
Callands Care Home,,SCL,Callands Road,Callands,,Warrington,Cheshire,WA5 9TS,Tel: 01925244233,No ratings yet Rate it yourself - /Services/careproviders/LeaveReview/DefaultView.aspx?id=1-319278933,0,0,Yes registered manager in post,1,Yes,5 Very good,5,,Large 120 beds,Large,,,
Whittle Hall House Care Residence,,SCL,Littledale Road,Great Sankey,,Warrington,Cheshire,WA5 3DX,Tel: 01612330155,No ratings yet Rate it yourself - /Services/careproviders/LeaveReview/DefaultView.aspx?id=1-4184362778,0,0,No registered manager in post,2,No,No rating available,No rating available,,Large 74 beds,Large,,,
Orchard Nursing,,SCL,St. Mary's Road,Huyton,,Liverpool,Merseyside,L36 5UY,Tel: 01514492899,No ratings yet Rate it yourself - /Services/careproviders/LeaveReview/DefaultView.aspx?id=1-116359067,0,0,Yes registered manager in post,1,Yes,4 Good,4,,Large 57 beds,Large,,,
Elizabeth Road Care Home,,SCL,45 Elizabeth Road,Huyton,,Knowsley,Merseyside,L36 0TG,Tel: 01514430732,No ratings yet Rate it yourself - /Services/careproviders/LeaveReview/DefaultView.aspx?id=1-129266427,0,0,Yes registered manager in post,1,Yes,Exempt,Exempt,,Small 5 beds,Small,,,
Green Park Care Home,,SCL,Southwold Crescent,Great Sankey,,Warrington,Cheshire,WA5 3JS,Tel: 01423859859,No ratings yet Rate it yourself - /Services/careproviders/LeaveReview/DefaultView.aspx?id=1-2844757712,0,0,Yes registered manager in post,1,Yes,5 Very good,5,,Large 103 beds,Large,,,
Aaron Grange Care Home,,SCL,Blacklow Brow,Huyton with Roby,,Liverpool,Merseyside,L36 5XG,Tel: 01514891127,No ratings yet Rate it yourself - /Services/careproviders/LeaveReview/DefaultView.aspx?id=1-145585779,0,0,Yes registered manager in post,1,Yes,5 Very good,5,,Large 68 beds,Large,,,
The Acorns,,SCL,Parkside,Hindley,,Wigan,Greater Manchester,WN2 3LJ,Tel: 01942256183,No ratings yet Rate it yourself - /Services/careproviders/LeaveReview/DefaultView.aspx?id=1-9213527969,0,0,Yes registered manager in post,1,Yes,5 Very good,5,,Medium 39 beds,Medium,,,
High Peak Residential and Nursing Home,,SCL,Main Lane,Culcheth,,Warrington,,WA3 4AZ,Tel: 01925764081,No ratings yet Rate it yourself - /Services/careproviders/LeaveReview/DefaultView.aspx?id=1-9193327091,0,0,Yes registered manager in post,1,Yes,5 Very good,5,,Medium 33 beds,Medium,,,
Finch Manor Nursing Home,,SCL,Finch Lea Drive,,,Liverpool,,L14 9QN,Tel: 01512590617,No ratings yet Rate it yourself - /Services/careproviders/LeaveReview/DefaultView.aspx?id=1-4921179091,0,0,No registered manager in post,2,No,5 Very good,5,,Large 89 beds,Large,,,
Alt Park Nursing Home,,SCL,Parkstile Lane,Gillmoss,,Liverpool,Merseyside,L11 0BG,Tel: 01515465244,No ratings yet Rate it yourself - /Services/careproviders/LeaveReview/DefaultView.aspx?id=1-118357748,0,0,No registered manager in post,2,No,4 Good,4,,Medium 35 beds,Medium,,,
Roby House Care Centre,,SCL,Tarbock Road,Huyton,,Liverpool,Merseyside,L36 5XW,Tel: 01514824440,No ratings yet Rate it yourself - /Services/careproviders/LeaveReview/DefaultView.aspx?id=1-11263733556,0,0,No registered manager in post,2,No,Data not supplied,,doesnotapply,Large 55 beds,Large,,,
St Bartholomews Court Nursing Home,,SCL,Woodfield Road,Huyton,,Liverpool,Merseyside,L36 4PJ,Tel: 01514805505,No ratings yet Rate it yourself - /Services/careproviders/LeaveReview/DefaultView.aspx?id=1-114484853,0,0,Yes registered manager in post,1,Yes,5 Very good,5,,Large 51 beds,Large,,,
Richmond House,,SCL,Mitchell Street,,,Leigh,Lancashire,WN7 4UH,Tel: 01942682772,No ratings yet Rate it yourself - /Services/careproviders/LeaveReview/DefaultView.aspx?id=1-320558505,0,0,Yes registered manager in post,1,Yes,5 Very good,5,,Medium 49 beds,Medium,,,
Westvale House,,SCL,Old Hall Road,Great Sankey,,Warrington,Cheshire,WA5 9PA,Tel: 01925571266,No ratings yet Rate it yourself - /Services/careproviders/LeaveReview/DefaultView.aspx?id=1-125863047,0,0,Yes registered manager in post,1,Yes,5 Very good,5,,Large 61 beds,Large,,,
Paisley Court,,SCL,38 Gemini Drive,Dovecot,,Liverpool,Merseyside,L14 9LT,Tel: 01512300857,No ratings yet Rate it yourself - /Services/careproviders/LeaveReview/DefaultView.aspx?id=1-141956772,0,0,Yes registered manager in post,1,Yes,5 Very good,5,,Large 60 beds,Large,,,
Moss View,,SCL,77 Page Moss Lane,Huyton,,Liverpool,Merseyside,L14 0JJ,Tel: 01514821212,No ratings yet Rate it yourself - /Services/careproviders/LeaveReview/DefaultView.aspx?id=1-320496571,0,0,No registered manager in post,2,No,5 Very good,5,,Large 78 beds,Large,,,
St Patricks Care Home,,SCL,Crow Wood Lane,,,Widnes,Cheshire,WA8 3PN,Tel: 01514953593,No ratings yet Rate it yourself - /Services/careproviders/LeaveReview/DefaultView.aspx?id=1-7880337947,0,0,Yes registered manager in post,1,Yes,4 Good,4,,Medium 40 beds,Medium,,,
Stonedale Lodge Care Home,,SCL,200 Stonedale Crescent,,,Liverpool,Merseyside,L11 9DJ,Tel: 01515492020,No ratings yet Rate it yourself - /Services/careproviders/LeaveReview/DefaultView.aspx?id=1-4413482844,0,0,No registered manager in post,2,No,5 Very good,5,,Large 180 beds,Large,,,
Christopher Grange Rhona House,,SCL,Youens Way,East Prescot Road,,Liverpool,Merseyside,L14 2EW,Tel: 01512202525,No ratings yet Rate it yourself - /Services/careproviders/LeaveReview/DefaultView.aspx?id=1-15233442676,0,0,No registered manager in post,2,No,Data not supplied,,doesnotapply,Medium 28 beds,Medium,,,
Millbrow Care Home,,SCL,Mill Brow,,,Widnes,Cheshire,WA8 6QT,Tel: 0151 420 4859,No ratings yet Rate it yourself - /Services/careproviders/LeaveReview/DefaultView.aspx?id=1-4651620434,0,0,Yes registered manager in post,1,Yes,5 Very good,5,,Medium 44 beds,Medium,,,
Lakeview,,SCL,121 Ena Crescent,,,Leigh,,WN7 5ET,Tel: 01942294141,No ratings yet Rate it yourself - /Services/careproviders/LeaveReview/DefaultView.aspx?id=1-5405079721,0,0,Yes registered manager in post,1,Yes,4 Good,4,,Medium 30 beds,Medium,,,
Lakeside Nursing & Residential Home,,SCL,Chorley Road,Worthington,,Standish,Lancashire,WN1 2XN,Tel: 01257422931,No ratings yet Rate it yourself - /Services/careproviders/LeaveReview/DefaultView.aspx?id=1-163214652,0,0,Yes registered manager in post,1,Yes,4 Good,4,,Medium 50 beds,Medium,,,
Roseside,,SCL,Vancouver Road,,,Liverpool,,L27 7DA,Tel: 01709565700,No ratings yet Rate it yourself - /Services/careproviders/LeaveReview/DefaultView.aspx?id=1-14964901909,0,0,Yes registered manager in post,1,Yes,Data not supplied,,doesnotapply,Medium 32 beds,Medium,,,
Glenwood Care Home,,SCL,Liverpool Road,,,Widnes,Cheshire,WA8 7HX,Tel: 01514205945,No ratings yet Rate it yourself - /Services/careproviders/LeaveReview/DefaultView.aspx?id=1-129266471,0,0,Yes registered manager in post,1,Yes,4 Good,4,,Medium 12 beds,Medium,,,
Westleigh Lodge,,SCL,Nel Pan Lane,Leigh,,Wigan,Greater Manchester,WN7 5JT,Tel: 01942262521,No ratings yet Rate it yourself - /Services/careproviders/LeaveReview/DefaultView.aspx?id=1-320756380,0,0,Yes registered manager in post,1,Yes,5 Very good,5,,Medium 48 beds,Medium,,,
Willow Lodge,,SCL,15-16,Moss View,,Ormskirk,,L39 4QA,Tel: 01695579319,No ratings yet Rate it yourself - /Services/careproviders/LeaveReview/DefaultView.aspx?id=1-4798693103,0,0,No registered manager in post,2,No,No rating available,No rating available,,Medium 22 beds,Medium,,,
Thingwall Hall Nursing Home,,SCL,Thingwall Hall,Broadgreen,,Liverpool,Merseyside,L14 7NY,Tel: 01512284439,No ratings yet Rate it yourself - /Services/careproviders/LeaveReview/DefaultView.aspx?id=1-121860148,0,0,Yes registered manager in post,1,Yes,No rating available,No rating available,,Medium 39 beds,Medium,,,
Abbey Wood Park Care Home,,SCL,Aintree Hospital,Longmoor Lane,,Liverpool,,L9 7LQ,Tel: 01513921000,No ratings yet Rate it yourself - /Services/careproviders/LeaveReview/DefaultView.aspx?id=1-9334701621,0,0,Yes registered manager in post,1,Yes,No rating available,No rating available,,Medium 39 beds,Medium,,,
Castle Grange,,SCL,9 Haymans Green,West Derby,,Liverpool,Merseyside,L12 7JG,Tel: 0151 226 4524,No ratings yet Rate it yourself - /Services/careproviders/LeaveReview/DefaultView.aspx?id=1-838446230,0,0,Yes registered manager in post,1,Yes,5 Very good,5,,Medium 40 beds,Medium,,,
Springfield Court Nursing Home,,SCL,33 Springfield Road,Aughton,,Ormskirk,Lancashire,L39 6ST,Tel: 01695424344,No ratings yet Rate it yourself - /Services/careproviders/LeaveReview/DefaultView.aspx?id=1-120022079,0,0,Yes registered manager in post,1,Yes,5 Very good,5,,Large 60 beds,Large,,,
Padgate House,,SCL,Vulcan Close,Padgate,,Warrington,Cheshire,WA2 0HL,Tel: 01925821639,No ratings yet Rate it yourself - /Services/careproviders/LeaveReview/DefaultView.aspx?id=1-127701694,0,0,Yes registered manager in post,1,Yes,5 Very good,5,,Medium 36 beds,Medium,,,
Burscough Manor,,SCL,75 Liverpool Road South,Burscough,,Ormskirk,,L40 7SU,Tel: 01695760760,No ratings yet Rate it yourself - /Services/careproviders/LeaveReview/DefaultView.aspx?id=1-15034268473,0,0,Yes registered manager in post,1,Yes,Data not supplied,,doesnotapply,Large 80 beds,Large,,,
James Page,,SCL,Parkhaven Trust,Deyes Lane,,Maghull,Merseyside,L31 6DJ,Tel: 01515318702,No ratings yet Rate it yourself - /Services/careproviders/LeaveReview/DefaultView.aspx?id=1-122024039,0,0,Yes registered manager in post,1,Yes,5 Very good,5,,Medium 36 beds,Medium,,,
Brook View,,SCL,Aintree University Hospital,Longmoor Lane,,Liverpool,,L9 7JU,Tel: 01513195000,No ratings yet Rate it yourself - /Services/careproviders/LeaveReview/DefaultView.aspx?id=1-7309911510,0,0,Yes registered manager in post,1,Yes,5 Very good,5,,Medium 32 beds,Medium,,,
Stocks Hall Nursing Home - Burscough,,SCL,251 Liverpool Road South,,,Burscough,Lancashire,L40 7RE,Tel: 01704895667,No ratings yet Rate it yourself - /Services/careproviders/LeaveReview/DefaultView.aspx?id=1-128901281,0,0,Yes registered manager in post,1,Yes,5 Very good,5,,Large 52 beds,Large,,,
Ferndale Court Nursing Home,,SCL,St Michaels Road,,,Widnes,Cheshire,WA8 8TF,Tel: 01512579111,No ratings yet Rate it yourself - /Services/careproviders/LeaveReview/DefaultView.aspx?id=1-320350428,0,0,Yes registered manager in post,1,Yes,5 Very good,5,,Large 58 beds,Large,,,
Ferndale Mews,,SCL,St Michaels Road,,,Widnes,Cheshire,WA8 8TF,Tel: 01514951367,No ratings yet Rate it yourself - /Services/careproviders/LeaveReview/DefaultView.aspx?id=1-320350471,0,0,No registered manager in post,2,No,No rating available,No rating available,,Medium 34 beds,Medium,,,
Oak Vale Gardens,,SCL,1C The Green,,,Liverpool,Merseyside,L13 4BX,Tel: 01512202708,No ratings yet Rate it yourself - /Services/careproviders/LeaveReview/DefaultView.aspx?id=1-991265975,0,0,Yes registered manager in post,1,Yes,No rating available,No rating available,,Medium 18 beds,Medium,,,
Cromwell Court,,SCL,76 Church Street,,,Warrington,Cheshire,WA1 2TH,,No ratings yet Rate it yourself - /Services/careproviders/LeaveReview/DefaultView.aspx?id=1-8428377980,0,0,Yes registered manager in post,1,Yes,No rating available,No rating available,,Large 67 beds,Large,,,
Broadway Nursing,,SCL,22-32 Flemington Avenue,Clubmoor,,Liverpool,Merseyside,L4 8UD,Tel: 01512702073,No ratings yet Rate it yourself - /Services/careproviders/LeaveReview/DefaultView.aspx?id=1-116376104,0,0,Yes registered manager in post,1,Yes,5 Very good,5,,Large 65 beds,Large,,,
Bankfield Apartments Care Centre,,SCL,The Annex,Bankfield Road,,Liverpool,,L13 0BQ,Tel: 01513636118,No ratings yet Rate it yourself - /Services/careproviders/LeaveReview/DefaultView.aspx?id=1-6744143693,0,0,Yes registered manager in post,1,Yes,5 Very good,5,,Small 6 beds,Small,,,
Derby House,,SCL,50 Bankfield Road,,,Liverpool,,L13 0BQ,,No ratings yet Rate it yourself - /Services/careproviders/LeaveReview/DefaultView.aspx?id=1-12081861462,0,0,Yes registered manager in post,1,Yes,Data not supplied,,doesnotapply,Medium 36 beds,Medium,,,
Florence Mill Care Home,,SCL,Egerton Street,,,Warrington,Cheshire,WA1 2DF,Tel: 01925573772,No ratings yet Rate it yourself - /Services/careproviders/LeaveReview/DefaultView.aspx?id=1-12472473355,0,0,Yes registered manager in post,1,Yes,Data not supplied,,doesnotapply,Large 150 beds,Large,,,