Organisation Name,NACS Code,Organisation Type,Address1,Address2,Address3,Address4,Address5,PostCode,Telephone Number,Information supplied by,Value  (Information supplied by),Banding Classification  (Information supplied by)
Mum 2 Mum Breastfeeding Support Southend,,GDOS,Hamstel Childrens Centre,Hamstel Infant School,Hamstel Road,Southend on Sea,Essex,SS2 4PQ,Tel: 01702 220 810,Come along to our breastfeeding support group. Open to pregnant mums looking for advice on breastfeeding their baby and mums of breastfed babies and c... <a href="https://www.netmums.com/local/l/mum-2-mum-breastfeeding-support-southend">Read more</a>,,
Cake Club - Parenting Support And Solidarity In Southend,,GDOS,"The Haven Community Hub (Cake Club Office & Monday, Friday & Saturday venue)",138-140 Hamlet Court Road,,Westcliff-on-Sea,Essex,SS0 7LW,,"Cake Club is a small charity offering parenting support and playgroups in the Southend area, incorporating pregnancy, postnatal, infant feeding and s... <a href=https://www.netmums.com/local/l/cake-club-parenting-support-and-solidarity-in-southend>Read more</a>",,
Breast Feeding Support Group,,GDOS,Family Action Southend Blenheim Children's Centre,,,Leigh On Sea,Essex,SS9 4HX,Tel: 01702 220810,Wednesday 12:45-13:30 drop in session before Baby Health Clinic... <a href="https://www.netmums.com/local/l/breast-feeding-support-group-26">Read more</a>,,
Mum2Mum Breastfeeding Group,,GDOS,"Oaktree Children's Centre in Grove Road,",,,Rayleigh,Essex,SS6 8UA,Tel: 01268 775910,"This group now runs at Oaktree Children's Centre in Grove Road, Mondays from 09:30-11:30, alongside baby clinic.  Why not drop in for a chat, we provi... <a href=https://www.netmums.com/local/l/mum2mum-breastfeeding-group>Read more</a>",,
I Love Greens - Family Health &Amp; Nutrition,,GDOS,Downham Road,Ramsden Heath,,Billericay,Essex,CM11 1PU,Tel: 07765251301,"Hey! I'm Nicola, registered nutritionist and expert in prenatal, pregnancy and children's nutrition. I support families from conception all the way t... <a href=https://www.netmums.com/local/l/happy-tums-weaning-workshops>Read more</a>",,
Basildon &Amp; Thurrock Bras Breastfeeding Support Group,,GDOS,Basildon & Thurrock BRAS,,,Basildon,,SS15 4JS,,Covering Basildon &amp; Thurrock and surrounding areas. Online and face to face support available.  Trained breast/chestfeeding support from ABM brea... <a href="https://www.netmums.com/local/l/basildon-thurrock-bras">Read more</a>,,
Hypnotherapy Hypnobirthing And Postnatal Wellbeing,,GDOS,30 Mashbury Road,Great Waltham,,Chelmsford,essex,CM3 1EN,Tel: 07947275673,Hypnobirthing is a method of childbirth that uses hypnosis to help women achieve a more relaxed and comfortable birth experience. It is based on the ... <a href="https://www.netmums.com/local/l/hypnobirthing-and-postnatal-wellbeing">Read more</a>,,
Lll Kent Meetings In Faversham,,GDOS,1 Century Road,,,Faversham,Kent,ME13 8DP,Tel: 01795 228342,LLL exists to help mothers to breastfeed their babies. LLLGB is a registered charity affiliated to La Leche League International - the world's largest... <a href="https://www.netmums.com/local/l/lll-kent-meetings-in-faversham">Read more</a>,,
Nct Havering Breastfeeding Support Group,,GDOS,The Queens Theatre,Billet Ln,,Hornchurch,Essex,RM11 1QT,Tel: 0300 330 0771,Are you pregnant and interested in breastfeeding? Are you already breastfeeding and would like to meet other mums? Come along to our Breastfeeding Sup... <a href="https://www.netmums.com/local/l/nct-havering-breastfeeding-support-group">Read more</a>,,
Doula-Led Hypnobirthing Pregnancy &Amp; Antenatal Classes In Maidstone,,GDOS,"Southcote Proactive Healthcare, 3 Sittingbourne Road",,,maidstone,kent,ME14 5ES,Tel: 07817512865,Booking and further info at www.kwmothernurture.co.ukDo you fear childbirth? Have you had a traumatic previous birth? Do you want to have a POSITIVE b... <a href="https://www.netmums.com/local/l/kw-mother-nurture-hypnobirthing-antenatal-education">Read more</a>,,
Breastfeeding Drop-In Session,,GDOS,Maidstone Birth Centre,Hermitage Lane,near Maidstone Hospital,Maidstone,Kent,ME16 9QQ,Tel: 07796467222,Breastfeeding information and help Fridays 09.30-11.30 except public holidays... <a href="https://www.netmums.com/local/l/breastfeeding-drop-in-session">Read more</a>,,
Breastfeeding Group With Counsellor And Peer Support Maidstone,,GDOS,West Borough Childrenâ€™s Centre,"Greenway, Queen's Road",,Maidstone,Kent,ME16 8TL,Tel: 03000 421540,Are you a mum to be and wondering about whether you should breastfeed? Or are you a breastfeeding mum needing some support? Our breast-feeding group p... <a href="https://www.netmums.com/local/l/breastfeeding-group-with-counsellor-and-peer-support">Read more</a>,,
Breastfeeding Support Group,,GDOS,Greenway,,,Maidstone,Kent,ME16 8TL,Tel: 03000 421540,A drop in group with Peer Supporters and professionals for Breastfeeding Mums.... <a href="https://www.netmums.com/local/l/breastfeeding-support-group-147">Read more</a>,,
Breastfeeding Support At Home,,GDOS,Happy Families Health Visiting,Abbots Field,,Maidstone ,,ME16 8QQ,Tel: 07927391480,"Home visits at a booked time to support any breastfeeding issues including positioning and attachment, unsettled baby, poor weight gain. Perfect for t... <a href=https://www.netmums.com/local/l/health-visitor-breastfeeding-support-at-home>Read more</a>",,
Hey Baby Local Antenatal Classes And Postnatal Support,,GDOS,"Margate, Canterbury & Dover Group Classes ",Unit 10 & 11 City Business Park ,Canterbury ,Canterbury ,Kent ,CT1 1DX,Tel: 07880368104,"Full antenatal courses for expectant parents, covering all aspects of preparing and managing your labour &amp; birth, hormones, environment, getting ... <a href=https://www.netmums.com/local/l/hey-baby-local-antenatal-classes-and-postnatal-support>Read more</a>",,
