Organisation Name,NACS Code,Organisation Type,Address1,Address2,Address3,Address4,Address5,PostCode,Telephone Number,Information supplied by,Value  (Information supplied by),Banding Classification  (Information supplied by)
Nct Bumps And Babies - Breastfeeding Drop-In,,GDOS,Valley Park community centre,,,Eastleigh,Hampshire,SO53 4ST,Tel: 07452 983313,We provide free specialist breastfeeding support delivered by NCT trained breastfeeding counsellors. No appointment necessary.Every Friday  10-11.30 a... <a href="https://www.netmums.com/local/l/breastfeeding-drop-in-eastleigh-1">Read more</a>,,
Tongue Tie Practitioner And Breastfeeding Support Basingstoke,,GDOS,Basingstoke,Hampshire,,Basingstoke,,RG24 8RR,Tel: 07475600068,"I am a midwife and Tongue Tie practitioner, passionate about supporting women and families in feeding and caring for their baby. I will visit you in y... <a href=https://www.netmums.com/local/l/tongue-tie-practitioner-and-breastfeeding-support-basingstoke>Read more</a>",,
Infant Feeding Group,,GDOS,Little Play Lounge,"The Old Rectory, Rectory Road",Padworth Common,Reading,Berkshire,RG7 4JD,Tel: 07502 269789,Get breast and bottle feeding support or just come along to chat about your feeding journey with other parents.   The drop-in session is free to atten... <a href="https://www.netmums.com/local/l/infant-feeding-group">Read more</a>,,
Free New Parents Group: Little Bus Downton Wiltshire,,GDOS,Downton Memorial Hall (in new bit upstairs!),The Borough,,"Downton, Salisbury ",Wiltshire,SP5 3NB,,A free postnatal group for new parents and carers called "Little Buds" faciliated by NCT and Fedant trained Alice Aston. Every Tues (during term time... <a href="https://www.netmums.com/local/l/free-new-parents-group-little-bus-downton-wiltshire">Read more</a>,,
Bfn  Free Breastfeeding Support Drop-In Group - Shirley,,GDOS,The Ashby Centre,Stratton Road,,Southampton,Hampshire,SO15 5QZ,Tel: 07927532487,"We are here to support you! Pregnant, combination feeding, expressing or exclusively breastfeeding “ everyones welcome.A free drop in that runs ... <a href=https://www.netmums.com/local/l/bfn-free-breastfeeding-support-drop-in-group-shirley>Read more</a>",,
Lll Southampton,,GDOS,St James Road Methodist Church,St James Road,,Southampton,Hampshire,SO15 5HE,Tel: 01489 854694,"LLL provides breastfeeding information and support to all mums.  We hold a breastfeeding drop-in session every Monday in term-time, including a more s... <a href=https://www.netmums.com/local/l/lll-south-hants>Read more</a>",,
Bfn Breastfeeding Drop-In Group - Townhill Park,,GDOS,Cutbush Children's Centre,Cutbush Lane,Townhill Park,Southampton,,SO18 2GF,Tel: 07927532487,"We are here to support you! Pregnant, combination feeding, expressing or exclusively breastfeeding “ everyones welcome.A free drop in that runs ... <a href=https://www.netmums.com/local/l/bfn-breastfeeding-drop-in-group>Read more</a>",,
Bfn Breastfeeding Support Group - Northam,,GDOS,Northam Community Centre,Kent Street,,Southampton,Hampshire,SO14 5SP,Tel: 07927532487,"We are here to support you! Pregnant, combination feeding, expressing or exclusively breastfeeding “ everyones welcome.A free drop in that runs ... <a href=https://www.netmums.com/local/l/bfn-breastfeeding-support-group-northam>Read more</a>",,
Breastfeeding Support And Baby Weight Appointments In Hampshire,,GDOS,Basingstoke ,,,Basingstoke ,,RG27 9HF,Tel: 07475600068,As a midwife and breastfeeding specialist and tongue tie practitioner  Im passionate about helping new parents thrive with their baby. This can be ... <a href="https://www.netmums.com/local/l/breastfeeding-support-and-baby-weight-appointments-in-hampshire">Read more</a>,,
Happy Daze Baby And Toddler Playgroup Alton,,GDOS,Alton Maltings Centre,Maltings Close,,Alton,,GU34 1DT,,A relaxed and friendly baby and toddler playgroup. Breastfeeding peer supporters are available at the group to talk through all aspects of your breast... <a href="https://www.netmums.com/local/l/a-friendly-baby-and-toddler-playgroup">Read more</a>,,
Alton Bumps Babies &Amp; Breastfeeding Group Alton,,GDOS,Alton Maltings Centre,Maltings Close,,Alton,,GU34 1DT,,"A friendly play group for under ones, run by NCT Breastfeeding Peer Supporters with a Breastfeeding Counsellor on hand. Free hot and cold drinks and b... <a href=https://www.netmums.com/local/l/alton-bumps-babies-breastfeeding-group>Read more</a>",,
Free New Parents Group: Little Buds Fordingbridge,,GDOS,The Branch ,1 High Street,,Fordingbridge ,Hampshire,SP6 1AS,,A free post natal group for new parents and carers called œLittle Buds. Facilitated by NCT and Fedant trained Alice Aston. Every Friday (term ti... <a href="https://www.netmums.com/local/l/free-new-parents-group-little-buds-fordingbridge-sp6-1as">Read more</a>,,
Bursledon Breastfeeding Babes,,GDOS,St Paulâ€™s Church,Oak Road,Bursledon,Southampton,Hampshire,SO31 8DT,Tel: 07889 059 833,We run an informal drop-in session alongside the Health Visitor's clinic for all breastfeeding mums and their babies. You do not have to be having a p... <a href="https://www.netmums.com/local/l/bursledon-breastfeeding-babes">Read more</a>,,
Kube Medical Infant Clinic,,GDOS,Kube Medical,Nexus Business Centre,Darby Close,Swindon,Wiltshire,SN2 2PN,Tel: 01793205345,"On the first and third Tuesday of each month, we run a free drop in session for parents and babies to come and consult with our paediatric-trained pr... <a href=https://www.netmums.com/local/l/kube-medical-infant-clinic>Read more</a>",,
Breastfeeding Centre Caversham,,GDOS,Amersham Road Community Centre,Amersham Road,,Caversham,Berkshire,RG4 5BP,Tel: 0118 901 5610,Mon 09:30 - 11:30 ... <a href="https://www.netmums.com/local/l/breastfeeding-centre">Read more</a>,,
