Organisation Name,NACS Code,Organisation Type,Address1,Address2,Address3,Address4,Address5,PostCode,Telephone Number,Information supplied by,Value  (Information supplied by),Banding Classification  (Information supplied by)
Ash Grove Cherubs,,GDOS,Ash Grove Children's Centre,Ash Grove,,Macclesfield,Cheshire,SK11 7TD,Tel: 03001234579,Don't wait for a problem! A good support network is invaluable for establishing successful breastfeeding right from the start. Friendly mother-to-moth... <a href="https://www.netmums.com/local/l/ash-grove-cherubs">Read more</a>,,
Bosom Buddies Wilmslow,,GDOS,Oakenclough Children's Centre,Colshaw Drive,,Wilmslow,Cheshire,SK9 2PZ,Tel: Oakenclough Children's Centre 01625 374810,Whether you are an experienced breastfeeding mum who would just like to meet with others for mutual support and exchanging ideas on how to make life e... <a href="https://www.netmums.com/local/l/bosom-buddies-28">Read more</a>,,
Wilmslow Cherubs,,GDOS,Oakenclough Children's Centre,Colshaw Drive,,Wilmslow,,SK9 2PZ,Tel: 03001234579,Every Wednesday 10.00am - 11.30am ... <a href="https://www.netmums.com/local/l/oakenclough-children-s-centre">Read more</a>,,
La Leche League Congleton,,GDOS,New Life Church,West Road,,Congleton,Cheshire,CW12 3EE,Tel: 07969839561,Information and Support for Mums and Mums to be!Children of All ages welcomeTopical discussions as well as one to one support in a casual setting over... <a href="https://www.netmums.com/local/l/la-leche-league-congleton">Read more</a>,,
Manchester Lactation Consultants,,GDOS,Ollerbarrow House,209-211 Ashley Road,Hale,Stockport,Cheshire,WA15 9SQ,Tel: 07907308287 / 07840929119,"Manchester Lactation Consultants provide a private Frenulotomy Service (tongue-tie division), alongside accurate evidence based infant feeding support... <a href=https://www.netmums.com/local/l/manchester-lactation-consultants>Read more</a>",,
Hyde Family Hub Breastfeeding Support Group,,GDOS,Hyde Family Hub,Old Road,,Hyde,,SK14 4SQ,Tel: 07802 883947,New parents from across Tameside and Oldham are welcome to join peer supporters from our Infant Feeding Team for free and friendly breastfeeding supp... <a href="https://www.netmums.com/local/l/hyde-family-hub-breastfeeding-support-group">Read more</a>,,
Stretford Children'S Centre Breastfeeding Support Group,,GDOS,Stretford Children's Centre,Poplar Road Family Centre,Poplar Road,Stretford,Manchester,M32 9AN,Tel: 0161 912 5020,Peer support group aiming to support mothers in breast feeding their babies for as long as they want to. There is up to date information and advice on... <a href="https://www.netmums.com/local/l/breastfeeding-group-28">Read more</a>,,
Central Manchester Foundation Trust Infant Feeding Team Drop In,,GDOS,Ardwick Childrens Centre Medlock Primary School,Wadeson Road,,Ardwick,,M13 9UJ,Tel: 0161 871 2619,Manchester Children's Community Services are committed to helping mothers breastfeed and get the support they really need. We have recently set up the... <a href="https://www.netmums.com/local/l/ardwick-childrens-centre">Read more</a>,,
St Peters Family Hub Breastfeeding Support Group,,GDOS,St Peterâ€™s Family Hub,Trafalgar Square,,Ashton Under Lyne,,OL7 0LL,Tel: 07802 883947,"Mondays, 9.30 am “ 11.30 am (term time only)... <a href=https://www.netmums.com/local/l/st-peters-family-hub-breastfeeding-support-group-1>Read more</a>",,
Greenside Family Hub Breastfeeding Support,,GDOS,Greenside Family Hub,Greenside Lane,,Droylsden,,M43 7RA,Tel: 07802 883947,"Wednesdays, 9.30 am “ 11.30 am... <a href=https://www.netmums.com/local/l/greenside-family-hub-breastfeeding-support>Read more</a>",,
Stalybridge Clinic Breastfeeding Support Group,,GDOS,Stalybridge Clinic,Waterloo Road,,Stalybridge,,SK15 2AU,Tel: 07802 883947,New parents from across Tameside and Oldham are welcome to join peer supporters from our Infant Feeding Team every Monday for free and friendly face-... <a href="https://www.netmums.com/local/l/stalybridge-clinic-breastfeeding-support-group">Read more</a>,,
Breastfeeding Support Ikea Group In Conjunction With Home-Start,,GDOS,Ikea restaurant,Wellington Road,,Ashton Under Lyne,,OL6 7TE,Tel: 07802 883947,"Tuesdays, 10.30 am “ 12.30... <a href=https://www.netmums.com/local/l/breastfeeding-support-ikea-group-in-conjunction-with-home-start>Read more</a>",,
Central Manchester Foundation Trust Infant Feeding Team Drop In,,GDOS,Harpurhey Childrenâ€™s Centre,North City Family and Fitness Centre,Upper Conran Street,Manchester,,M9 4DA,Tel: 0161 205 0830,Manchester Children's Community Services are committed to helping mothers breastfeed and get the support they really need. We have recently set up the... <a href="https://www.netmums.com/local/l/infant-feeding-drop-in-session-wednesdays-1pm-till-2pm">Read more</a>,,
Higher Broughton Children'S Centre Baby Feeding Advice,,GDOS,Higher Broughton Children's Centre,50 Rigby Street,,Higher Broughton,Salford,M7 4BQ,Tel: 0161 778 0080,"Come and discuss  your breastfeeding experiences, we are here to to help guide you through the experience of breastfeeding your baby. We answer all yo... <a href=https://www.netmums.com/local/l/breatfeeding-support>Read more</a>",,
Free Breastfeeding Support - Breastfeeding Network Stoke On Trent,,GDOS,194 high street ,,,stoke on trent,,ST6 5PH,,We offer non-judgemental information and parental support to local (breastfeeding) families. We have 2 face to face groups:Friday mornings @ Westfiel... <a href="https://www.netmums.com/local/l/breastfeeding-network-stoke-on-trent">Read more</a>,,
Sedgley Children'S Centre Breastfeeding Group,,GDOS,Sedgley Park Primary School,Bishops Road,,Prestwich,,M25 0HT,Tel: 0161 253 7474,"This group is relaxed, friendly and a place to meet and chat to other breastfeeding mums. Peer Supporters will be available to give information and su... <a href=https://www.netmums.com/local/l/breastfeeding-support-25>Read more</a>",,
Monks Cherubs (Cheshire Really Useful Breastfeeding Support),,GDOS,Monks Coppenhall Children's Centre,Remer Street,,Crewe,Cheshire,CW1 4LY,Tel: 03001234579,"Monks CHE.R.U.B.S (formerly known as Baby Cafe) is open every Wednesday, 10.00am - 11.30pm. It welcomes women and their families who are breastfeeding... <a href=https://www.netmums.com/local/l/monks-che-r-u-b-s-cheshire-really-useful-breastfeeding-support>Read more</a>",,
Monks Cherubs (Breastfeeding Support),,GDOS,Monks Coppenhall Childrens Centre,Remer Street,,crewe,,CW1 4LY,,"Breastfeeding support group on to provide peer support, information, advice and loads and loads of encouragement for breastfeeding mums and their fami... <a href=https://www.netmums.com/local/l/monks-cherubs-breastfeeding-support>Read more</a>",,
Bumps Boobs &Amp; Brews Free Pregnancy And Breastfeeding Support Group,,GDOS,Astley Christian Fellowship,530 Manchester Road,,Astley,Wigan,M29 7BP,Tel: 01942236111,We absolutely love a group get together here at Breastfeeding Together¦we have face to face and online groups every week!Led by our Experienced Preg... <a href="https://www.netmums.com/local/l/bumps-boobs-brews-free-pregnancy-and-breastfeeding-support-group-1">Read more</a>,,
Kearsley Children'S Centre Well Baby Clinic &Amp; Breast Feeding Info,,GDOS,Kearsley Children's Centre,Springfield Road ( Birch Road),,Kearsley,Bolton,BL4 8LZ,Tel: 01204 334955,"Call into the centre to have your child weighed or chat with your health visiting team, who offer advice and support on all child related issues such ... <a href=https://www.netmums.com/local/l/well-baby-clinic-8>Read more</a>",,
Bumps Boobs &Amp; Brews Free Pregnancy And Breastfeeding Support Group,,GDOS,Farnworth Family Hub,King Street,,Bolton,Manchester,BL4 7AP,Tel: 01942236111,We absolutely love a group get together here at Breastfeeding Together¦we have face to face and online groups every week!Led by our Experienced Preg... <a href="https://www.netmums.com/local/l/bumps-boobs-brews-free-pregnancy-and-breastfeeding-support-group-2">Read more</a>,,
Free Weekly Walking Group For Pregnant And Breastfeeding Mums,,GDOS,Pennington Flash Country Park,St Helens Road,Leigh,Wigan,Greater Manchester,WN7 3PA,Tel: 01942236111,"Our weekly walking group is open to mums who are pregnant or breastfeeding their babies. The group is free, no need to book, with plenty of parking a... <a href=https://www.netmums.com/local/l/free-weekly-walking-group-for-pregnant-and-breastfeeding-mums>Read more</a>",,
Heywood Aquanatal,,GDOS,Heywood Sports Village,West Starkey Street,,Heywood,,OL10 4TW,,"Come and join in with our weekly aqua aerobics classes aimed at pregnant people, run by a qualified midwife and infant feeding specialist. Great for:... <a href=https://www.netmums.com/local/l/heywood-aquanatal>Read more</a>",,
Nantwich Cherubs Breastfeeding Support Group,,GDOS,Nantwich and Rural Children's Centre,Dog Lane,,Nantwich,Cheshire,CW5 5GX,Tel: 03001234579,"A breastfeeding support  drop-in centre set out with coffee tables, comfy sofas and play areas for accompanying toddlers.  All pregnant or breastfeedi... <a href=https://www.netmums.com/local/l/nantwich-baby-cafe>Read more</a>",,
Harvey Children'S Centre Breastfeeding Support Group,,GDOS,Harvey Children's Centre,Shaw Street,,Bolton,Lancashire,BL3 6HU,Tel: 01204 337390,Come along to meet other breastfeeding mum's for a drink and a chat. Specialist Health Visitor for breastfeeding and Bolton Breast Buddies peer suppor... <a href="https://www.netmums.com/local/l/breastfeeding-support-group-65">Read more</a>,,
Bumps Boobs &Amp; Brews Free Pregnancy And Breastfeeding Support Group,,GDOS,Alexandra Family Hub,Blackledge Street,,Bolton,Manchester,BL3 4BL,Tel: 01942236111,We absolutely love a group get together here at Breastfeeding Together¦we have face to face and online groups every week!Led by our Experienced Preg... <a href="https://www.netmums.com/local/l/bumps-boobs-brews-free-pregnancy-and-breastfeeding-support-group-3">Read more</a>,,
Bumps Boobs &Amp; Brews Free Pregnancy And Breastfeeding Support Group,,GDOS,Oldhams Family Hub,Forfar Street,,Bolton,Manchester,BL1 6RN,Tel: 01942236111,We absolutely love a group get together here at Breastfeeding Together¦we have face to face and online groups every week!Led by our Experienced Preg... <a href="https://www.netmums.com/local/l/bumps-boobs-brews-free-pregnancy-and-breastfeeding-support-group-4">Read more</a>,,
Hypnobirthing &Amp; Breastfeeding Support In Leeds &Amp; Huddersfield,,GDOS,31 New Road,,,Holmfirth,,HD9 3XX,Tel: 07946582422,"5* rated, nurturing, personal support during pregnancy to help you prepare for birth, breastfeeding and baby. In-person in Leeds, Huddersfield and wi... <a href=https://www.netmums.com/local/l/hypnobirthing-breastfeeding-support-in-leeds-huddersfield>Read more</a>",,
Westfield Start Well Centre Breastfeeding Group,,GDOS,The Grange,Kelvin Grove,,Wigan,,WN3 6SP,Tel: 01942 776007,Come along to this informal group and meet expectant and new mums and find out more about breastfeeding... <a href="https://www.netmums.com/local/l/breastfeeding-group-41">Read more</a>,,
Central Link Lactation Consultant Breastfeeding Drop In,,GDOS,Central Link Children's Centre,"Westfield Street, Off Peter Street",,St Helens,Merseyside,WA10 1QF,Tel: 01744 673444,Free Breastfeeding Support Drop In group run by an International Board Certified Lactation Consultant (IBCLC).  EVERY Thursday 11.30-12.30.Whether you... <a href="https://www.netmums.com/local/l/central-link-lactation-consultant-breastfeeding-drop-in">Read more</a>,,
Nct Matlock Early Days Drop-In Baby Group (Free),,GDOS,Starkholmes Village Hall,105 Starkholmes Road,,Matlock,,DE4 3DE,,A friendly supportive group for parents to talk about some of the challenges facing them as new parents. Each week we will explore a different topic.... <a href="https://www.netmums.com/local/l/nct-matlock-early-days-drop-in-baby-group-free">Read more</a>,,
Melody Makers Baby - Themed Sessions For Parents &Amp; Their Babies,,GDOS,Jubilee Centre,Market Street,Paddock,Huddersfield,,HD1 4SH,Tel: 01484551551,"Themed sessions for parents &amp; their babies Come and join us for a focussed session about enjoying your baby, making friends and learning new thing... <a href=https://www.netmums.com/local/l/melody-makers-baby-themed-sessions-for-parents-their-babies>Read more</a>",,
Twins &Amp; More - Stay &Amp; Play Group For Families With Twins &Amp; More,,GDOS,Jubilee Centre,Market Street,Paddock,Huddersfield,,HD1 4SH,Tel: 01484 551551,"Stay &amp; play group for families with twins, triplets &amp; more.A place for parents to meet and provide mutual support with those that understand t... <a href=https://www.netmums.com/local/l/twins-more-stay-play-group-for-families-with-twins-more>Read more</a>",,
La Leche League Barnsley Breastfeeding Support,,GDOS,Contact us for venue,,,Barnsley,,S35 7AL,Tel: 07821 482 321,LLL Barnsley is a friendly group offering mother-to-mother breastfeeding support in Barnsley and the surrounding area.Groups are held twice a month: ... <a href="https://www.netmums.com/local/l/la-leche-league-barnsley-breastfeeding-support">Read more</a>,,
Bf Solutions/ Milk Matters: Breast &Amp; Bottle Feeding Support,,GDOS,116 Fitzwilliam St,,,Huddersfield,West Yorkshire,HD1 5PH,Tel: 0845 26 99 57 4 / 07411 276302,"We are qualified, insured, independent International Board Certified Lactation Consultants (IBCLC) specialising in difficult to resolve problems feedi... <a href=https://www.netmums.com/local/l/antenatal-postnatal-independent-breastfeeding-2>Read more</a>",,
Bumps Boobs &Amp; Brews Free Pregnancy And Breastfeeding Support Group,,GDOS,Pipsqueaks Play Cafe,Abbey Lakes Hall,Orrell,Orrell,Wigan,WN5 8QZ,Tel: 01942236111,We absolutely love a group get together here at Breastfeeding Together¦we have face to face and online groups every week!Led by our Experienced Preg... <a href="https://www.netmums.com/local/l/bumps-boobs-brews-free-pregnancy-and-breastfeeding-support-group">Read more</a>,,
