Organisation Name,NACS Code,Organisation Type,Address1,Address2,Address3,Address4,Address5,PostCode,Telephone Number,Information supplied by,Value  (Information supplied by),Banding Classification  (Information supplied by)
Breastfeeding Friendly Cafe - Brixton,,GDOS,21 Effra Parade,,,London,,SW2 1PX,Tel: 020 3633 4733,"We were founded in 2016 by Pinter Martin, a local independent publishers who specialise in books on pregnancy, birth and parenting. The aim of effrasp... <a href=https://www.netmums.com/local/l/breastfeeding-friendly-cafe-brixton>Read more</a>",,
Baby Hive - Breastfeeding Support At Home,,GDOS,172 Hydethorpe Road,Balham,,London,,SW12 0JD,Tel: 07947416690,The Baby Hive team are IBCLC accredited Lactation Consultants with significant experience helping mothers with complex breastfeeding issues within th... <a href="https://www.netmums.com/local/l/baby-hive-breastfeeding-support-at-home-5">Read more</a>,,
Lactation Consultant Ibclc Breastfeeding Specialist Support,,GDOS,Baby-Thrive.com,St Julians Farm Rd,,London,,SE27 0JJ,Tel: 07548 860 231â€¬,Sally RickardHelping families in South East &amp; Central London to achieve their breastfeeding goals with bespoke face-to-face support. Home visits ... <a href="https://www.netmums.com/local/l/lactation-consultant-ibclc-breastfeeding-specialist-support">Read more</a>,,
Nct Clapham Breastfeeding Cafe &Amp; Support,,GDOS,The Grove,39 Oldridge Road,,Clapham,,SW12 8PN,,Are you breastfeeding a baby or planning to breastfeed?Would you like support or information on breastfeeding?Would you like to meet other breastfeedi... <a href="https://www.netmums.com/local/l/nct-clapham-breastfeeding-support">Read more</a>,,
Balham Breastfeeding Cafe,,GDOS,Harrisons Restaurant ,15-18 Bedford Hill,,Balham,,SW12 9EX,,Mondays 10 -12 ... <a href="https://www.netmums.com/local/l/balham-breastfeeding-cafe">Read more</a>,,
Milk Spot,,GDOS,Coin Street Neighbourhood Centre,108 Stamford Street   ,,South Bank,London,SE1 9NH,Tel: 020 7021 1634,This weekly session allows mums to breastfeed their babies in a safe and comfortable environment.Every Wednesday 10.00am - 12 noonFree. Just drop-in... <a href="https://www.netmums.com/local/l/milk-spot">Read more</a>,,
Quaggy Breastfeeding Group,,GDOS,Quaggy Children's Centre,Morden Mount School ,Lewisham Road ,Lewisham,,SE13 7QZ,Tel: 07753 610217,All pregnant and breastfeeding mothers welcome. Come along and have a drink and a snack whilst chatting to other mums.Every Friday from 12.30- 2.30... <a href="https://www.netmums.com/local/l/quaggy-breastfeeding-group">Read more</a>,,
Breastfeeding Support And Tongue Tie Assessment,,GDOS,Antenatal Clinic,Wapping Health Centre,22 Wapping Lane,London,,E1W 2RL,Tel: 07961609626,For mothers with babies of all ages and stages to help overcome difficulties with breast and bottle feeding.  We provide a warm welcome and a chance t... <a href="https://www.netmums.com/local/l/breastfeeding-support-and-tongue-tie-assessment">Read more</a>,,
Breastfeeding Drop In Group Mitchem,,GDOS,Acacia Intergenerational Centre,230 Grove Road,,Mitcham Eastfields,,CR4 1SD,Tel: 020 8274 5121,Tuesday 13:00-15:00Pregnany and interested in breastfeeding?Already breastfeeding and want to meet other mums?Need answers to breastfeeding questions?... <a href="https://www.netmums.com/local/l/breastfeeding-drop-in-group-2">Read more</a>,,
Wandsworth Nct Breastfeeding And New Baby Drop-In,,GDOS,St Michael's Church Cafe,Granville Road,Southfields,London,,SW18 5SQ,Tel: 07729 016654,Would you like support with feeding your baby or the chance to talk through anything about life with a new baby? Josie or Lucie will be there to offer... <a href="https://www.netmums.com/local/l/wandsworth-nct-breastfeeding-and-new-baby-drop-in">Read more</a>,,
Croydon University Hospital Breastfeeding Clinic,,GDOS,Parent Education Room - Antenatal Clinic,Croydon University Hospital,London Road,Croydon ,,CR7 7YE,Tel: 020 8401 3000 bleep 576,This group is run by the infant feeding advisor and breastfeeding counsellor at Croydon University Hospital.  This group is for mums with babies up to... <a href="https://www.netmums.com/local/l/croydon-university-hospital-breastfeeding-clinic">Read more</a>,,
Difficulty Breastfeeding? Support Group &Amp; Meet Other Mums,,GDOS,45 Central Street,Clerkenwell,,London,London,EC1V 8AB,Tel: 07917356570,"More often than not there is huge pressure on women to breastfeed; coming from health care professionals, sometimes relatives, partners or self-impose... <a href=https://www.netmums.com/local/l/difficulty-breastfeeding-support-group-meet-other-mums>Read more</a>",,
Osteopathic Treatment For Children Pregnant &Amp; Postnatal Mums,,GDOS,141 Cleveland Street,,,London,,W1T 6QG,,OCC clinics ensure families who cannot afford private fees are able to receive the support they need. We provide specialist paediatric osteopathy to ... <a href="https://www.netmums.com/local/l/osteopathic-treatment-for-children-pregnant-postnatal-mums">Read more</a>,,
Islington Breastfeeding Support - Moreland Children'S Centre,,GDOS,Moreland Children's Centre,2 Gard Street,,Islington,London,EC1V 8BX,Tel: 020 3316 8439,COVID-19 UPDATE - WE ARE STILL RUNNING A SERVICE BUT OF COURSE LOTS OF THINGS HAVE CHANGED. FULL DETAILS AT https://www.facebook.com/notes/breastfeed... <a href="https://www.netmums.com/local/l/breastfeeding-support-13">Read more</a>,,
Doula And Lactation Support,,GDOS,1 Theseus walk ,,,London,,N1 8DS,Tel: 07527770090,"Wherever you are on your journey to becoming a parent, I am here to support you from conception to birth and beyond. I aim to offer individualised ca... <a href=https://www.netmums.com/local/l/doula-and-lactation-support>Read more</a>",,
Lactation Consultant Ibclc South West London,,GDOS,Wimbledon,,,London,,SW19 3RZ,Tel: 07765743693,"Caring specialist breastfeeding support, to help you achieve your breastfeeding goalsIndividualised evidence-based judgement-free support. Parents and... <a href=https://www.netmums.com/local/l/lactation-consultant-ibclc-south-west-london>Read more</a>",,
La Leche League Notting Hill Monthly Meeting,,GDOS,112 Palace Gardens Terrace,,,London,,W8 4RT,Tel: 07475146580,We welcome you to join us for our monthly series meeting in Notting Hill. We will spend the first portion of the meeting answering your breastfeeding ... <a href="https://www.netmums.com/local/l/monthly-meeting-la-leche-league-notting-hill">Read more</a>,,
Islington Breastfeeding And Weaning Peer Support Service,,GDOS,Bingfield Primary Care Centre,8 Bingfield Street,,Islington,London,N1 0AL,Tel: 020 3316 8439,COVID-19 UPDATE - WE ARE STILL RUNNING A SERVICE BUT OF COURSE LOTS OF THINGS HAVE CHANGED. FULL DETAILS AT https://www.facebook.com/notes/breastfeed... <a href="https://www.netmums.com/local/l/islington-breastfeeding-and-weaning-peer-support-programme">Read more</a>,,
Islington Breastfeeding Support - Bingfield Primary Care Centre,,GDOS,Bingfield Primary Care Centre,8 Bingfield Street,,Islington,London,N1 0AL,Tel: 020 3316 8439,COVID-19 UPDATE - WE ARE STILL RUNNING A SERVICE BUT OF COURSE LOTS OF THINGS HAVE CHANGED. FULL DETAILS AT https://www.facebook.com/notes/breastfeed... <a href="https://www.netmums.com/local/l/islington-breastfeeding-suport-bemerton-children-s-centre">Read more</a>,,
Islington Breastfeeding Welcome Venues - Breastfeed When Out And About,,GDOS,Bingfield Primary Care Centre,8 Bingfield Street,,Islington,London,N1 0AL,Tel: 020 3316 8439,"Babies need feeding frequently, so you will sometimes have to breastfeed while out of the house. Some mums can feel a bit unsure as to whether others ... <a href=https://www.netmums.com/local/l/breastfeeding-welcome>Read more</a>",,
Lovelikestace - Experienced Mentor,,GDOS,130 Church Street ,,,Croydon ,,CR0 1RF,Tel: 07856877793,"Do you need someone who knows more than yourself to share advice, offer guidance and be a sounding board for your thoughts you stand to benefit from ... <a href=https://www.netmums.com/local/l/lovelikestace-experienced-mentor>Read more</a>",,
Islington Breastfeeding Support - New River Green Children'S Centre,,GDOS,New River Green Children's Centre,23 Ramsey Walk,,Islington,London,N1 2SX,Tel: 020 3316 8439,COVID-19 UPDATE - WE ARE STILL RUNNING A SERVICE BUT OF COURSE LOTS OF THINGS HAVE CHANGED. FULL DETAILS AT https://www.facebook.com/notes/breastfeed... <a href="https://www.netmums.com/local/l/new-river-green-children-s-centre">Read more</a>,,
Islington Breastfeeding Support - Paradise Park Children'S Centre,,GDOS,Paradise Park Children's Centre,164 Mackenzie Road,,Islington,London,N7 8SE,Tel: 020 3316 8439,COVID-19 UPDATE - WE ARE STILL RUNNING A SERVICE BUT OF COURSE LOTS OF THINGS HAVE CHANGED. FULL DETAILS AT https://www.facebook.com/notes/breastfeed... <a href="https://www.netmums.com/local/l/islington-breastfeeding-support-paradise-park">Read more</a>,,
Breastfeeding Drop In Group Carshalton,,GDOS,Muschamp Children's Centre,Muschamp Road,,Carshalton,,SM5 2SE,Tel: 020 8773 4980,Tuesday 10:00 - 12:00Pregnany and interested in breastfeeding?Already breastfeeding and want to meet other mums?Need answers to breastfeeding question... <a href="https://www.netmums.com/local/l/breastfeeding-drop-in-group-8">Read more</a>,,
Islington Breastfeeding Support - Hungerford Children'S Centre,,GDOS,Hungerford Children's Centre,10 Goodinge Road,,Islington,London,N7 9LH,Tel: 020 3316 8439,Meet other mums and receive help with breastfeeding and introducing solids from qualified Breastfeeding Supporter Thomasina. Babies and children of a... <a href="https://www.netmums.com/local/l/islington-breastfeeding-support-hungerford-children-s-centre">Read more</a>,,
Breastfeeding Cafe - Westminster,,GDOS,Queen's Park Children's Centre,The Family Centre,88 Bravington Road,London,,W9 3AL,Tel: 020 7641 5838/4635,"Call in to breastfeed in a relaxed and welcoming atmosphere, get support if you need it from our midwife, or just to meet other mums. Wednesday 9.30am... <a href=https://www.netmums.com/local/l/breastfeeding-cafe-14>Read more</a>",,
Islington Breastfeeding Support - Conewood Street Children'S Centre,,GDOS,Conewood Street Children's Centre,14 Conewood Street,,Islington,London,N5 1DL,Tel: 020 3316 8439,COVID-19 UPDATE - WE ARE STILL RUNNING A SERVICE BUT OF COURSE LOTS OF THINGS HAVE CHANGED. FULL DETAILS AT https://www.facebook.com/notes/breastfeed... <a href="https://www.netmums.com/local/l/islington-breastfeeding-support-conewood-street-children-s-centre">Read more</a>,,
Breastfeeding Group Stratford,,GDOS,Rebecca Cheetham Children Centre,Rebecca Cheetham Nursery,Marcus Street,Stratford,London,E15 3JT,Tel: 020 8534 3136 option 4,"If you would like to find out more about breastfeeding, are struggling with breastfeeding or would like to share your success stories, then come along... <a href=https://www.netmums.com/local/l/breastfeeding-group-26>Read more</a>",,
Islington Breastfeeding Support - Ambler Children'S Centre,,GDOS,Ambler Children's Centre,Romilly Road,,Islington,London,N4 2DR,Tel: 020 3316 8439,COVID-19 UPDATE - WE ARE STILL RUNNING A SERVICE BUT OF COURSE LOTS OF THINGS HAVE CHANGED. FULL DETAILS AT https://www.facebook.com/notes/breastfeed... <a href="https://www.netmums.com/local/l/highbury-grange-health-centre">Read more</a>,,
Breastfeeding Support Group (Brookhill),,GDOS,Brookhill Children's Centre,130 Brookhill Road ,Woolwich ,London,,SE18 6UZ,Tel: 020 8319 5320,"Join our breastfeeding group for advice, support and friendship. Every Thursday at Brookhill Children's Centre, 9.30-11.30am.... <a href=https://www.netmums.com/local/l/breastfeeding-support-group-brookhill>Read more</a>",,
Islington Breastfeeding Support - Archway Premature Babies Group,,GDOS,Archway Children's Centre,Vorley Road,,Islington,London,N19 5HE,Tel: 020 3316 8439,COVID-19 UPDATE - WE ARE STILL RUNNING A SERVICE BUT OF COURSE LOTS OF THINGS HAVE CHANGED. FULL DETAILS AT https://www.facebook.com/notes/breastfeed... <a href="https://www.netmums.com/local/l/breastfeeding-group-7">Read more</a>,,
Breastfeeding Support Group (Slade),,GDOS,Slade Children's Centre,Erindale Road ,Plumstead  ,London,,SE18 2QQ,Tel: 020 8854 7900,"Join our breastfeeding group for advice, support and friendship. Every Tuesday at Slade Children's Centre, 10-11.30am.... <a href=https://www.netmums.com/local/l/breastfeeding-support-group-148>Read more</a>",,
Free Baby Feeding Support In Haringey With The Breastfeeding Network,,GDOS,"Triangle Children, Young People & Community Centre",91-93 Saint Ann's Road,,London,,N15 6NU,,"- Triangle Children, Young People &amp; Community Centre - Our friendly peer support team can help with breastfeeding, expressing, bottle feeding, wea... <a href=https://www.netmums.com/local/l/free-baby-feeding-support-in-haringey-with-the-breastfeeding-network-4>Read more</a>",,
Free Baby Feeding Support In Haringey With The Breastfeeding Network,,GDOS,Highgate International Church,272 Archway Road,,London,,N6 5AU,,"- Highgate International - Our friendly peer support team can help with breastfeeding, expressing, bottle feeding, weaning from the breast and introdu... <a href=https://www.netmums.com/local/l/free-baby-feeding-support-in-haringey-with-the-breastfeeding-network-1>Read more</a>",,
Free Baby Feeding Support In Haringey With The Breastfeeding Network,,GDOS,Woodlands Park Nursery School & Children Centre,74-76 Woodlands Park Road,,London,,N15 3SD,,"- Woodlands Park Children Centre -Our friendly peer support team can help with breastfeeding, expressing, bottle feeding, weaning from the breast and ... <a href=https://www.netmums.com/local/l/free-baby-feeding-support-in-haringey-with-the-breastfeeding-network-3>Read more</a>",,
Free Baby Feeding Support In Haringey With The Breastfeeding Network,,GDOS,Hornsey Central Neighbourhood Health Centre,151 Park Road,,London,,N8 8JD,,"- Hornsey Central Neighbourhood Health Centre -Our friendly peer support team can help with breastfeeding, expressing, bottle feeding, weaning from th... <a href=https://www.netmums.com/local/l/free-baby-feeding-support-in-haringey-with-the-breastfeeding-network-5>Read more</a>",,
Birth And Postnatal Doula North London,,GDOS,Nightingale Lane,,,London,,N8 7RA,Tel: 07961482886,"Hello all!Im a mum of two wonderful children, a yoga teacher and birth and postnatal Doula based in Crouch End, North London.I teach Pregnancy and ... <a href=https://www.netmums.com/local/l/birth-and-postnatal-doula-north-london>Read more</a>",,
Free Baby Feeding Support In Haringey With The Breastfeeding Network,,GDOS,Welbourne Children's Centre,Stainby Road,,London,,N15 4EA,,"- Welbourne Children Centre -Our friendly peer support team can help with breastfeeding, expressing, bottle feeding, weaning from the breast and intro... <a href=https://www.netmums.com/local/l/free-baby-feeding-support-in-haringey-with-the-breastfeeding-network-6>Read more</a>",,
Breastfeeding Cafe (Woodbury Road),,GDOS,Church Hill Childrenâ€™s Centre ,Woodbury Road ,,Walthamstow,,E17 9SB,Tel: 020 8520 4919,Please check with the centre that the group is still running. Tuesday 11.30am to 1pm... <a href="https://www.netmums.com/local/l/breastfeeding-cafe-woodbury-road">Read more</a>,,
Byron Breastfeeding Buddies Coulsdon,,GDOS,Byron Children's Centre,St Davids,,Coulsdon,Croydon,CR5 2XE,,Byron Breastfeeding Buddies is a support group run by local mums who are training to give information and support on all aspects of breastfeeding.Come... <a href="https://www.netmums.com/local/l/byron-breastfeeding-buddies-coulsdon">Read more</a>,,
Free Breastfeeding Support By Henry,,GDOS,313 Billet road,,,london,,E17 5PX,Tel: 02084965222,Free breastfeeding support in cafes and children and family centres across waltham forestsee timetable for full list of sessions ... <a href="https://www.netmums.com/local/l/free-breastfeeding-support-by-henry">Read more</a>,,
Free Baby Feeding Support In Haringey With The Breastfeeding Network,,GDOS,Park Lane Children's Centre,139 Park Lane,,London,,N17 0HB,,"- Park Lane Children's Centre - Our friendly peer support team can help with breastfeeding, expressing, bottle feeding, weaning from the breast and in... <a href=https://www.netmums.com/local/l/free-baby-feeding-support-in-haringey-with-the-breastfeeding-network-2>Read more</a>",,
Coppetts Wood - Breastfeeding Support,,GDOS,"Coppetts Wood Children's Centre, Coppetts Road,",,,Barnet,,N10 1JS,Tel: 020 8883 2985,All breastfeeding mums are welcome to come along. We can provide 1:1 support and advice on any breastfeeding issues or difficulties. Breastfeeding Sup... <a href="https://www.netmums.com/local/l/coppetts-wood-breastfeeding-support-group">Read more</a>,,
Ante-Natal And Post-Natal: Breastfeeding Support In North London,,GDOS,Mounfield Road,,,london,,N3 3NE,Tel: 07976600891,"Offering help and advice, including home visits for anything concerning breastfeeding and lactating. From an IBCLC qualified lactation consultant. Thr... <a href=https://www.netmums.com/local/l/breastfeeding-support-in-north-london>Read more</a>",,
Breastfeeding Drop-Ins From The Nct (Twickenham),,GDOS,,,,Twickenham & surrounding areas,,TW2 5QA,Tel: 0844 20 909 20,"Breastfeeding is a new skill to learn and we all need help and support in learning new things. If you are finding it painful, or if you have any quest... <a href=https://www.netmums.com/local/l/free-nct-breastfeeding-drop-ins>Read more</a>",,
Breastfeeding Support,,GDOS,St Augustine's Road,,Kent ,Belvedere,Kent,DA17 5HP,Tel: 020 3045 4710,We have a breastfeeding support provided by a number of staff and activities.  You are very welcome to breast feed your baby in the Centre and if you ... <a href="https://www.netmums.com/local/l/breastfeeding-clinic-3">Read more</a>,,
Breastfeeding Cafe,,GDOS,Church Lane Children's Centre,Fryent Primary School,Church Lane,Kingsbury,,NW9 8JD,Tel: 020 8937 3890,Do you want to meet other mums who are breastfeeding? Would you like some individual support? Come along for a friendly groupWe are open every Thursda... <a href="https://www.netmums.com/local/l/breastfeeding-cafe-16">Read more</a>,,
1:1 Parenting Peer Support,,GDOS,Mutual Space or Your Home or My Home or Online,Whichever is Most Comfortable for You,,UK,,N11 3FL,,"Yemaya offers 1:1 sessions of peer-support for parents and parents-to-be. Whether youre in need of respite, reassurance, reinvigoration or you woul... <a href=https://www.netmums.com/local/l/1-1-parenting-peer-support>Read more</a>",,
Hypnobirthing Birth Doula Breastfeeding &Amp; Postnatal Support,,GDOS,2 Arlow Road,Winchmore Hill,,Enfield,London,N21 3JU,Tel: 07944156238,"Group and Private Hypnobirthing courses in person in Enfield, North London or online via zoom. Claire is a birth and postnatal doula and a local mothe... <a href=https://www.netmums.com/local/l/hypnobirthing-birth-doula-breastfeeding-postnatal-support>Read more</a>",,
Doula - Postnatal Based In Harrow,,GDOS,Nelson Road,,,Harrow,,HA1 3ET,Tel: 07521 280133,"A postnatal doula can offer you support through the early weeks and months with your new baby. An invaluable person to help you with your recovery, c... <a href=https://www.netmums.com/local/l/doula-postnatal-based-in-harrow>Read more</a>",,
Breastfeeding Support,,GDOS,St Margaret Nursery School,Margaret Road,,New Barnet,London,EN4 9NT,Tel: 020 8449 5466 option 5,"Trained staff are available to give support and advice for women who are thinking of/are breastfeeding. Wednesday. Held at BEYA, St Margaret's Nursery... <a href=https://www.netmums.com/local/l/hampden-way-breastfeeding-support>Read more</a>",,
Breastfeeding Support - Private Ibclc,,GDOS,In your home,,,Harrow,,HA1 1NZ,Tel: 07719312795,Specialist Breastfeeding Support in the comfort of your own home from Kathryn Stagg IBCLC. Antwnatal education hand weaning onto solids workshops also... <a href="https://www.netmums.com/local/l/breastfeeding-support-private-ibclc">Read more</a>,,
Breastfeeding Support - Private,,GDOS,In your home,,,Harrow,,HA1 1NZ,Tel: 07719312795,Private Breastfeeding Support available in your own home from International Board Certified Lactation Consultant Kathryn Stagg. Kathryn has over 10 ye... <a href="https://www.netmums.com/local/l/private-breastfeeding-support-2">Read more</a>,,
Barnet Breastfeeding Support Service,,GDOS,Barnet Breastfeeding Support Service,,,Barnet,,EN5 2DY,Tel: 07 815 717 055,Our Breastfeeding Support Service provides parents with support and information on baby feeding. Our friendly and welcoming breastfeeding support grou... <a href="https://www.netmums.com/local/l/barnet-breastfeeding-support-service-hope-corner-community-centre">Read more</a>,,
Bellytots Pregnancy &Amp; Baby Classes (0M+) In Ruislip,,GDOS,Ruislip Manor Methodist Church,Torrington Road,,Ruislip,,HA4 0AS,Tel: 07946660927,From our Pregnancy Pilates/Yoga blend to:- Newborn Mum Club- Baby Massage &amp; Baby Yoga- Baby Reflexology and beyond! We'd love to welcome you to o... <a href="https://www.netmums.com/local/l/bellytots-pregnancy-postnatal-classes-online-and-in-person">Read more</a>,,
Nct Havering Breastfeeding Support Group,,GDOS,The Queens Theatre,Billet Ln,,Hornchurch,Essex,RM11 1QT,Tel: 0300 330 0771,Are you pregnant and interested in breastfeeding? Are you already breastfeeding and would like to meet other mums? Come along to our Breastfeeding Sup... <a href="https://www.netmums.com/local/l/nct-havering-breastfeeding-support-group">Read more</a>,,
The Lactation Corner - Specialist Ibclc Breastfeeding Support Group,,GDOS,The Stables,Eastcote House Gardens,High street ,Eastcote,,HA5 2FE,Tel: 07719312795,Specialist Breastfeeding Support in a group setting from IBCLCs Miriam Feen and Kathryn Stagg. Please check the Facebook page for times and dates. Or ... <a href="https://www.netmums.com/local/l/the-lactation-corner-specialist-ibclc-breastfeeding-support-group-1">Read more</a>,,
Breastfeeding Support Group Ibclc - The Lactation Corner,,GDOS,The Stables,Eastcote House Gardens,High street ,Eastcote,,HA5 2FE,Tel: 07719312795,Specialist Breastfeeding Support Group with IBCLCs Miriam Feen and Kathryn Stagg. Please check the Facebook page for times and dates. Or text or email... <a href="https://www.netmums.com/local/l/the-lactation-corner-specialist-ibclc-breastfeeding-support-group">Read more</a>,,
Breastfeeding Support,,GDOS,St Mary's C of E High School,Lieutenant Ellis Way,,Cheshunt,Herts,EN7 5FB,Tel: 01992 633761,"Run by experienced Health Visitors in a relaxed and calm enviroment an opportunity to share experiences, gain peer support and specialist advice. Come... <a href=https://www.netmums.com/local/l/breastfeeding-support-51>Read more</a>",,
If Your Baby Is Under 13 Months Then Baby Sensory Is For You!,,GDOS,Wow Centre within Next Gen Fitness ,Mount Grace Road ,,Potters Bar ,Hertfordshire ,EN6 1RB,Tel: 07837935820,"Were a learning and development programme specifically designed from birth to 13 monthsFrom puppet shows and musical instruments, to baby signing,... <a href=https://www.netmums.com/local/l/if-your-baby-is-under-13-months-then-baby-sensory-is-for-you>Read more</a>",,
Milk - Feeding Support Group (With Bfc),,GDOS,St Pauls Church,St Pauls Road West,,Dorking,Surrey,RH4 2HT,,MiLK Run by volunteers and attended by a fully trained breastfeeding counsellor and IBCLC. Attended by other mums who have breastfed who can offer mor... <a href="https://www.netmums.com/local/l/milk-feeding-support-group-with-bfc">Read more</a>,,
Bumps Boobs &Amp; Babies Group With Breastfeeding Support,,GDOS,Harefield Children's Centre,Harefield Infant School,High Street,Harefield,Middx,UB9 6BT,Tel: 01895 671982,"Come along to our lovely Bumps, Boobs &amp; Babies group, for expectant parents and parents with babies from birth to crawling.It provides a wonderful... <a href=https://www.netmums.com/local/l/bumps-boobs-babies-group-with-breastfeeding-support>Read more</a>",,