Organisation Name,NACS Code,Organisation Type,Address1,Address2,Address3,Address4,Address5,PostCode,Telephone Number,Information supplied by,Value  (Information supplied by),Banding Classification  (Information supplied by)
Warm And Welcoming Breastfeeding Support Group In New Milton Hants,,GDOS,New Milton Memorial Centre,Whitefield Road,,New Milton,Hampshire,BH25 6DE,,"Please come and join us in a warm, welcoming friendly support group for all that are breastfeeding, expressing, combi-feeding or expecting. Non-judgem... <a href=https://www.netmums.com/local/l/warm-and-welcoming-breastfeeding-support-group-in-new-milton-hants>Read more</a>",,
Breastfeeding Support And Social Group - Somerford,,GDOS,Somerford Family Hub,,,,,BH23 3AS,Tel: 07772151260,Currently breastfeeding your baby?Pregnant and thinking of breastfeeding?Feel you could offer support to mums?Have questions about breastfeeding?Like ... <a href="https://www.netmums.com/local/l/breastfeeding-support-and-social-group-somerford">Read more</a>,,
Breastfeeding Network Unbiased Support/Information On Infant Feeding,,GDOS,Various,,,Dorset,,BH23 3AS,,"The breastfeeding Network are the commissioned service for support in the BCP area. We are WHO code compliant, and offer free unbiased information an... <a href=https://www.netmums.com/local/l/breastfeeding-network-unbiased-support-information-on-infant-feedin>Read more</a>",,
Breastfeeding Network - Feeding Support &Amp; Social Group Somerford,,GDOS,Draper Road,Somerford Family Hub,Next to Somerford Primary School,Christchurch,Dorset,BH23 3AS,,The Breastfeeding Network Dorset infant feeding support and social group at Somerford Family Hub (previously Somerford Children's Centre). Tuesday's ... <a href="https://www.netmums.com/local/l/the-breastfeeding-network-feeding-support-social-group-somerford">Read more</a>,,
Bursledon Breastfeeding Babes,,GDOS,St Paulâ€™s Church,Oak Road,Bursledon,Southampton,Hampshire,SO31 8DT,Tel: 07889 059 833,We run an informal drop-in session alongside the Health Visitor's clinic for all breastfeeding mums and their babies. You do not have to be having a p... <a href="https://www.netmums.com/local/l/bursledon-breastfeeding-babes">Read more</a>,,
Bfn Breastfeeding Support Group - Northam,,GDOS,Northam Community Centre,Kent Street,,Southampton,Hampshire,SO14 5SP,Tel: 07927532487,"We are here to support you! Pregnant, combination feeding, expressing or exclusively breastfeeding “ everyones welcome.A free drop in that runs ... <a href=https://www.netmums.com/local/l/bfn-breastfeeding-support-group-northam>Read more</a>",,
Lll Southampton,,GDOS,St James Road Methodist Church,St James Road,,Southampton,Hampshire,SO15 5HE,Tel: 01489 854694,"LLL provides breastfeeding information and support to all mums.  We hold a breastfeeding drop-in session every Monday in term-time, including a more s... <a href=https://www.netmums.com/local/l/lll-south-hants>Read more</a>",,
Bfn  Free Breastfeeding Support Drop-In Group - Shirley,,GDOS,The Ashby Centre,Stratton Road,,Southampton,Hampshire,SO15 5QZ,Tel: 07927532487,"We are here to support you! Pregnant, combination feeding, expressing or exclusively breastfeeding “ everyones welcome.A free drop in that runs ... <a href=https://www.netmums.com/local/l/bfn-free-breastfeeding-support-drop-in-group-shirley>Read more</a>",,
Bfn Breastfeeding Drop-In Group - Townhill Park,,GDOS,Cutbush Children's Centre,Cutbush Lane,Townhill Park,Southampton,,SO18 2GF,Tel: 07927532487,"We are here to support you! Pregnant, combination feeding, expressing or exclusively breastfeeding “ everyones welcome.A free drop in that runs ... <a href=https://www.netmums.com/local/l/bfn-breastfeeding-drop-in-group>Read more</a>",,
Free Breastfeeding Support On Zoom,,GDOS,The Breastfeeding Network ,,,Portsmouth ,,PO5 4LP,,"Free Breastfeeding Support on ZoomEvery Wednesday 09:30am-10:30am (term time) Our volunteers will be hosting a Zoom group for you. In this space, you ... <a href=https://www.netmums.com/local/l/free-breastfeeding-support-on-zoom>Read more</a>",,
Doula Sophy - Antenatal Courses Birth + Postnatal Support Services,,GDOS,Heyshott Rd,,,Southsea,Hampshire,PO4 8BZ,Tel: 07801222714,"Doula Sophy is a non-medical, trained professional that provides birthing people with evidence based information, emotional and practical support thr... <a href=https://www.netmums.com/local/l/doula-sophy-antenatal-courses-birth-postnatal-support-services>Read more</a>",,
Breastfeeding Support Group Portsmouth,,GDOS,Eastney Methodist Church,Highland Road,Eastney ,Portsmouth,Hants,PO4 9NJ,Tel: 023 9273 3161,Attended by local health visiting teamfor update and practical advice and support Tue 12.30 “ 2.00 ... <a href="https://www.netmums.com/local/l/breastfeeding-support-group-28">Read more</a>,,
Free Antenatal Breastfeeding Support With The Breastfeeding Network,,GDOS,Breastfeeding Network South Coast,,,Portsmouth,,PO3 6AD,,Free Breastfeeding Information Sessions (Antenatal online Zoom session)10am “ 11:30am. 2nd Tuesday of the month. Email bfnsouthcoast@breastfeedingne... <a href="https://www.netmums.com/local/l/free-antenatal-breastfeeding-support-with-the-breastfeeding-network">Read more</a>,,
Free Antenatal Breastfeeding Information Session On Zoom,,GDOS,The Breastfeeding Network ,,,Portsmouth,,PO3 6AD,,Free Antenatal Breastfeeding Information Session on Zoom.Are you planning a pregnancy or pregnant? Have you thought about how you will feed your baby?... <a href="https://www.netmums.com/local/l/free-antenatal-breastfeeding-information-session-on-zoom">Read more</a>,,
Free Breastfeeding Support At Northern Parade Family Hub,,GDOS,Northern Parade Family Hub,Doyle Avenue,,Portsmouth,,PO2 9NE,,"Free Breastfeeding Support with The Breastfeeding Network at Northern Parade Family Hub, Doyle Avenue, PO2 9NETuesdays 10:00-11:30 am TERM TIME ONLY ... <a href=https://www.netmums.com/local/l/free-breastfeeding-support-at-northern-parade-family-hub>Read more</a>",,
Breastfeeding Matters,,GDOS,,,,Portsmouth,Hants,PO4 8LY,Tel: 02392294290  or  07851 069146,Visits can be arranged before the baby is born to discuss plans to BF and realistic expectations for the early postnatal days; and/or after your arriv... <a href="https://www.netmums.com/local/l/breastfeeding-matters">Read more</a>,,
Nct Bumps And Babies - Breastfeeding Drop-In,,GDOS,Valley Park community centre,,,Eastleigh,Hampshire,SO53 4ST,Tel: 07452 983313,We provide free specialist breastfeeding support delivered by NCT trained breastfeeding counsellors. No appointment necessary.Every Friday  10-11.30 a... <a href="https://www.netmums.com/local/l/breastfeeding-drop-in-eastleigh-1">Read more</a>,,
Breastfeeding Support And Social Group - Kinson And West Howe,,GDOS,North Bournemouth Children's Centre,129 Moore Avenue,West Howe,Bournemouth,,BH11 8AU,Tel: 07772151260,Currently breastfeeding your baby?	Pregnant and thinking of breastfeeding?	Feel you could offer support to mums?	Have questions about breastfeeding?	L... <a href="https://www.netmums.com/local/l/breastfeeding-support-kinson-group">Read more</a>,,
Free New Parents Group: Little Buds Fordingbridge,,GDOS,The Branch ,1 High Street,,Fordingbridge ,Hampshire,SP6 1AS,,A free post natal group for new parents and carers called œLittle Buds. Facilitated by NCT and Fedant trained Alice Aston. Every Friday (term ti... <a href="https://www.netmums.com/local/l/free-new-parents-group-little-buds-fordingbridge-sp6-1as">Read more</a>,,
Breastfeeding Support And Social Group - Old Town Poole,,GDOS,Old Town Childrens Centre,c/o Old Town First School,Green Road,Poole,,BH15 1QB,Tel: 07772 151 260,Currently breastfeeding your baby?	Pregnant and thinking of breastfeeding?	Feel you could offer support to mums?	Have questions about breastfeeding?	L... <a href="https://www.netmums.com/local/l/old-town-bosom-buddies">Read more</a>,,
Breastfeeding Support And Social Group - Wimborne,,GDOS,Leigh Park Children's Centre,Gordon Road,,Wimborne,,BH21 2AP,Tel: 07772151260,Currently breastfeeding your baby?Pregnant and thinking of breastfeeding?Feel you could offer support to mums?Have questions about breastfeeding?Like ... <a href="https://www.netmums.com/local/l/breastfeeding-support-and-social-group-wimborne">Read more</a>,,
Free New Parents Group: Little Bus Downton Wiltshire,,GDOS,Downton Memorial Hall (in new bit upstairs!),The Borough,,"Downton, Salisbury ",Wiltshire,SP5 3NB,,A free postnatal group for new parents and carers called "Little Buds" faciliated by NCT and Fedant trained Alice Aston. Every Tues (during term time... <a href="https://www.netmums.com/local/l/free-new-parents-group-little-bus-downton-wiltshire">Read more</a>,,
The Breastfeeding Network At The Spring Havant,,GDOS,The Spring,56 East Street,,Havant,Hampshire,PO9 1BS,Tel: 02392 472700,"We are located just out of Havant town centre and near to the a27, The Spring has close by parking, a museum, cafe, toilets, and baby changing facilit... <a href=https://www.netmums.com/local/l/the-breastfeeding-network-at-the-spring-havant>Read more</a>",,
