Organisation Name,NACS Code,Organisation Type,Address1,Address2,Address3,Address4,Address5,PostCode,Telephone Number,Information supplied by,Value  (Information supplied by),Banding Classification  (Information supplied by)
Infant Feeding Peer Support Groups - Support For Feeding Your Baby,,GDOS,Callington Family Hub,Saltash Road,,Callington,Cornwall,PL17 7EF,,Breastfeeding group support from trained volunteers. These are groups run by local parents in Local Family Hubs and managed by the Health Visiting Inf... <a href="https://www.netmums.com/local/l/infant-feeding-peer-support-groups-support-for-feeding-your-baby-11">Read more</a>,,
Infant Feeding Peer Support Groups - Support For Feeding Your Baby,,GDOS,Saltash Family Hub,Plougastel Drive,,Saltash,Cornwall,PL12 6DX,,Breastfeeding group support from trained volunteers. These are groups run by local parents in Local Family Hubs and managed by the Health Visiting Inf... <a href="https://www.netmums.com/local/l/infant-feeding-peer-support-groups-support-for-feeding-your-baby-12">Read more</a>,,
Infant Feeding Peer Support Groups - Support For Feeding Your Baby,,GDOS,Liskeard Family Hub,Varley Lane,,Liskeard,Cornwall,PL14 4AP,,Breastfeeding group support from trained volunteers. These are groups run by local parents in Local Family Hubs and managed by the Health Visiting Inf... <a href="https://www.netmums.com/local/l/infant-feeding-peer-support-groups-support-for-feeding-your-baby-8">Read more</a>,,
Infant Feeding Peer Support Groups - Support For Feeding Your Baby,,GDOS,Bodmin family Hub,83 Fore Street,,Bodmin,Cornwall,PL31 2JB,,Breastfeeding support from trained volunteers. These are groups run by local parents in Local Family Hubs and managed by the Health Visiting Infant Fe... <a href="https://www.netmums.com/local/l/infant-feeding-peer-support-groups-support-for-feeding-your-baby-6">Read more</a>,,
Mamas Milk St Blazey,,GDOS,Fourways youth centre,Station road,,St blazey,Cornwall,PL24 2ND,,"Mamas Milk is a breastfeeding support group held at St Blazey children's centre, also known as Fourways youth centre. The group runs on a Monday 1.30-... <a href=https://www.netmums.com/local/l/mamas-milk-st-blazey>Read more</a>",,
Mindful Infant Feeding Support - Antenatal Classes &Amp; 1:1 Support,,GDOS,29 Ashwood Park,,,Kingsbridge,Devon,TQ7 4RF,,Offering the following services to Kingsbridge and the surrounding areas: - Mindful Breastfeeding Antenatal Course covering all aspects of feeding yo... <a href="https://www.netmums.com/local/l/mindful-infant-feeding-support-antenatal-classes-1-1-support">Read more</a>,,
Infant Feeding Peer Support Groups - Support For Feeding Your Baby,,GDOS,Bude Family Hub,Broad Close Hill,,Bude,Cornwall,EX23 8EA,,Breastfeeding group support from trained volunteers. These are groups run by local parents in Local Family Hubs and managed by the Health Visiting Inf... <a href="https://www.netmums.com/local/l/infant-feeding-peer-support-groups-support-for-feeding-your-baby-7">Read more</a>,,
Infant Feeding Peer Support Groups - Support For Feeding Your Baby,,GDOS,St Austell Family Hub,Woodland Road,,St Austell,Cornwall,PL25 4RA,,Breastfeeding group support from trained volunteers. These are groups run by local parents in Local Family Hubs and managed by the Health Visiting In... <a href="https://www.netmums.com/local/l/infant-feeding-peer-support-groups-support-for-feeding-your-baby-4">Read more</a>,,
