Organisation Name,NACS Code,Organisation Type,Address1,Address2,Address3,Address4,Address5,PostCode,Telephone Number,Information supplied by,Value  (Information supplied by),Banding Classification  (Information supplied by)
Breastfeeding Support Group - Drop In,,GDOS,March & District Children's Centre,Cavalry Drive,,March,Cambs,PE15 9EQ,Tel: 01354 656581,Breastfeeding Support GroupA weekly group for anyone wanting information or support around breastfeeding.- Pregnant and New Mums welcome.- Meet other ... <a href="https://www.netmums.com/local/l/breastfeeding-support-group-drop-in">Read more</a>,,
Breastfeeding Support Whittlesey,,GDOS,Whittlesey Children's Centre,New Road,,Whittlesey,Cambridgeshire,PE7 1SZ,Tel: 01354 750185,"If you are breastfeeding, or thinking about breastfeeding and need support and advice you can contact a trained member of staff at the Children's Cent... <a href=https://www.netmums.com/local/l/breastfeeding-support-whittlesey>Read more</a>",,
The Baby Cafe At Emneth Children'S Centre,,GDOS,Emneth Children's Centre,Hollycroft Road,Emneth,Cambridgeshire,,PE14 8AY,Tel: 01945 582401,"A Baby CafÃ© drop-in centre set out with coffee tables, comfy sofas and play areas for accompanying toddlers.  All pregnant or breastfeeding mums are ... <a href=https://www.netmums.com/local/l/the-baby-cafe-at-emneth-children-s-centre>Read more</a>",,
Babycafe Local Wisbech South,,GDOS,Wisbech South Children's Centre,Elizabeth Terrace,,Wisbech,Cambridgeshire,PE13 2AQ,Tel: 01945 481150,We are really pleased to offer breastfeeding support for mums in Wisbech.  Come and join us to chat to other breastfeeding mums or for one to one supp... <a href="https://www.netmums.com/local/l/babycafe-local-wisbech-south">Read more</a>,,
Ely Milks,,GDOS,"Ely Cathedral Centre,","Palace Green,",,Ely,Cambs,CB7 4EW,Tel: 07712 439637,Ely MILKS provides information and support for mums who are breastfeeding. We believe choosing to breastfeed your baby is one of the most positive dec... <a href="https://www.netmums.com/local/l/mother-nurture">Read more</a>,,
La Leche League West Norfolk (Breastfeeding Support Group),,GDOS,Marshland Hall,,,Marshland St James,Norfolk,PE14 8JB,Tel: 07960175941,"La Leche Leagues mission is to help mothers to breastfeed through mother-to-mother support, encouragement, information and education, and to promot... <a href=https://www.netmums.com/local/l/la-leche-league-west-norfolk-breastfeeding-support-group>Read more</a>",,
East Baby Cafe,,GDOS,East Children's Centre ,Durham Road,,Peterborough,Cambridgeshire,PE1 5JU,Tel: 01733 894028,"A Baby CafÃ© drop-in centre set out with coffee tables, comfy sofas and play areas for accompanying toddlers.  All pregnant or breastfeeding mums are ... <a href=https://www.netmums.com/local/l/baby-cafe-24>Read more</a>",,
Baaby Massage Classes With My Yoga Corner,,GDOS,133 Heron Road ,Northstowe ,,Cambridge ,Cambridgeshire ,CB24 1AS,Tel: 07765211807,"My Baby Massage classes allow you to care for your baby's needs in a friendly environment.We learn different strokes to aid growth, soothing and bond... <a href=https://www.netmums.com/local/l/my-yoga-corner-baby-massage>Read more</a>",,
Breastfeeding Support Market Deeping,,GDOS,Market Deeping Children's Centre ,Market Deeping Community Primary School,Willoughby Avenue,Market Deeping,,PE6 8JE,Tel: 01778 57901 / 01778 382574,Thursday 13.00 - 14.30pm... <a href="https://www.netmums.com/local/l/breastfeeding-support-39">Read more</a>,,
La Leche League  - Breastfeeding Drop In,,GDOS,The Fields Children's Centre,Galfrid Road,,Cambridge,,CB5 8ND,Tel: 01223 518333/01223 712444,Breastfeeding support is available to those having problems or indeed those enjoying the breastfeeding experience. This drop-in is always attended by ... <a href="https://www.netmums.com/local/l/breastfeeding-drop-in-3">Read more</a>,,
Cambridge Breastfeeding Alliance Online Support And In-Person Group,,GDOS,Ross St Community Centre,,,Cambridge,Cambridgeshire,CB1 3UZ,,"We offer online video breastfeeding support Monday, Wednesday and Saturday 9-12pm and also in-person appointments on Fridays 12.30-2.30pm at Ross St C... <a href=https://www.netmums.com/local/l/breastfeeding-drop-in-cambridge-breastfeeding-alliance>Read more</a>",,
Breastfeeding Support Bourne,,GDOS,Bourne Children's Centre,"Queens Road,",,Bourne,,PE10 9DX,Tel: 01778 395895,Friday from 13:00 - 14:30... <a href="https://www.netmums.com/local/l/breastfeeding-support-42">Read more</a>,,
Specialist Breastfeeding Support And Division Of Tongue Ties,,GDOS,High St,,,Clapham,Warwickshire,MK41 6EG,Tel: 07547897876,This website is for you to access private breastfeeding support and for the Division of Tongue Ties by an experienced International Board Certified La... <a href="https://www.netmums.com/local/l/specialist-breastfeeding-support-and-division-of-tongue-ties">Read more</a>,,
