Organisation Name,NACS Code,Organisation Type,Address1,Address2,Address3,Address4,Address5,PostCode,Telephone Number,Information supplied by,Value  (Information supplied by),Banding Classification  (Information supplied by)
Breastfeeding Drop-In Babies,,GDOS,Triangles Community Centre,,,Liss,Hampshire,GU33 7DX,Tel: 07851304386,"Free information, encouragement &amp; support for all breastfeeding mothers. Support provided by qualified (DipHE) NCT breastfeeding counsellors. Big ... <a href=https://www.netmums.com/local/l/breastfeeding-drop-in-b-a-b-i-e-s>Read more</a>",,
Happy Daze Baby And Toddler Playgroup Alton,,GDOS,Alton Maltings Centre,Maltings Close,,Alton,,GU34 1DT,,A relaxed and friendly baby and toddler playgroup. Breastfeeding peer supporters are available at the group to talk through all aspects of your breast... <a href="https://www.netmums.com/local/l/a-friendly-baby-and-toddler-playgroup">Read more</a>,,
Alton Bumps Babies &Amp; Breastfeeding Group Alton,,GDOS,Alton Maltings Centre,Maltings Close,,Alton,,GU34 1DT,,"A friendly play group for under ones, run by NCT Breastfeeding Peer Supporters with a Breastfeeding Counsellor on hand. Free hot and cold drinks and b... <a href=https://www.netmums.com/local/l/alton-bumps-babies-breastfeeding-group>Read more</a>",,
The Breastfeeding Network At The Spring Havant,,GDOS,The Spring,56 East Street,,Havant,Hampshire,PO9 1BS,Tel: 02392 472700,"We are located just out of Havant town centre and near to the a27, The Spring has close by parking, a museum, cafe, toilets, and baby changing facilit... <a href=https://www.netmums.com/local/l/the-breastfeeding-network-at-the-spring-havant>Read more</a>",,
Free Breastfeeding Support At Northern Parade Family Hub,,GDOS,Northern Parade Family Hub,Doyle Avenue,,Portsmouth,,PO2 9NE,,"Free Breastfeeding Support with The Breastfeeding Network at Northern Parade Family Hub, Doyle Avenue, PO2 9NETuesdays 10:00-11:30 am TERM TIME ONLY ... <a href=https://www.netmums.com/local/l/free-breastfeeding-support-at-northern-parade-family-hub>Read more</a>",,
Breastfeeding Support And Baby Weight Appointments In Hampshire,,GDOS,Basingstoke ,,,Basingstoke ,,RG27 9HF,Tel: 07475600068,As a midwife and breastfeeding specialist and tongue tie practitioner  Im passionate about helping new parents thrive with their baby. This can be ... <a href="https://www.netmums.com/local/l/breastfeeding-support-and-baby-weight-appointments-in-hampshire">Read more</a>,,
Baby Hive - Breastfeeding Support At Home,,GDOS,fleet road,,,Fleet,,GU51 3BN,Tel: 07702788630,The Baby Hive team are IBCLC accredited Lactation Consultants with significant experience helping mothers with complex breastfeeding issues within th... <a href="https://www.netmums.com/local/l/baby-hive-breastfeeding-support-at-home-7">Read more</a>,,
Tongue Tie Practitioner And Breastfeeding Support Basingstoke,,GDOS,Basingstoke,Hampshire,,Basingstoke,,RG24 8RR,Tel: 07475600068,"I am a midwife and Tongue Tie practitioner, passionate about supporting women and families in feeding and caring for their baby. I will visit you in y... <a href=https://www.netmums.com/local/l/tongue-tie-practitioner-and-breastfeeding-support-basingstoke>Read more</a>",,
Free Antenatal Breastfeeding Support With The Breastfeeding Network,,GDOS,Breastfeeding Network South Coast,,,Portsmouth,,PO3 6AD,,Free Breastfeeding Information Sessions (Antenatal online Zoom session)10am “ 11:30am. 2nd Tuesday of the month. Email bfnsouthcoast@breastfeedingne... <a href="https://www.netmums.com/local/l/free-antenatal-breastfeeding-support-with-the-breastfeeding-network">Read more</a>,,
Free Antenatal Breastfeeding Information Session On Zoom,,GDOS,The Breastfeeding Network ,,,Portsmouth,,PO3 6AD,,Free Antenatal Breastfeeding Information Session on Zoom.Are you planning a pregnancy or pregnant? Have you thought about how you will feed your baby?... <a href="https://www.netmums.com/local/l/free-antenatal-breastfeeding-information-session-on-zoom">Read more</a>,,
Breastfeeding Matters,,GDOS,,,,Portsmouth,Hants,PO4 8LY,Tel: 02392294290  or  07851 069146,Visits can be arranged before the baby is born to discuss plans to BF and realistic expectations for the early postnatal days; and/or after your arriv... <a href="https://www.netmums.com/local/l/breastfeeding-matters">Read more</a>,,
Free Breastfeeding Support On Zoom,,GDOS,The Breastfeeding Network ,,,Portsmouth ,,PO5 4LP,,"Free Breastfeeding Support on ZoomEvery Wednesday 09:30am-10:30am (term time) Our volunteers will be hosting a Zoom group for you. In this space, you ... <a href=https://www.netmums.com/local/l/free-breastfeeding-support-on-zoom>Read more</a>",,
Doula Sophy - Antenatal Courses Birth + Postnatal Support Services,,GDOS,Heyshott Rd,,,Southsea,Hampshire,PO4 8BZ,Tel: 07801222714,"Doula Sophy is a non-medical, trained professional that provides birthing people with evidence based information, emotional and practical support thr... <a href=https://www.netmums.com/local/l/doula-sophy-antenatal-courses-birth-postnatal-support-services>Read more</a>",,
Breastfeeding Support Group Portsmouth,,GDOS,Eastney Methodist Church,Highland Road,Eastney ,Portsmouth,Hants,PO4 9NJ,Tel: 023 9273 3161,Attended by local health visiting teamfor update and practical advice and support Tue 12.30 “ 2.00 ... <a href="https://www.netmums.com/local/l/breastfeeding-support-group-28">Read more</a>,,
Bfn Breastfeeding Drop-In Group - Townhill Park,,GDOS,Cutbush Children's Centre,Cutbush Lane,Townhill Park,Southampton,,SO18 2GF,Tel: 07927532487,"We are here to support you! Pregnant, combination feeding, expressing or exclusively breastfeeding “ everyones welcome.A free drop in that runs ... <a href=https://www.netmums.com/local/l/bfn-breastfeeding-drop-in-group>Read more</a>",,
Bursledon Breastfeeding Babes,,GDOS,St Paulâ€™s Church,Oak Road,Bursledon,Southampton,Hampshire,SO31 8DT,Tel: 07889 059 833,We run an informal drop-in session alongside the Health Visitor's clinic for all breastfeeding mums and their babies. You do not have to be having a p... <a href="https://www.netmums.com/local/l/bursledon-breastfeeding-babes">Read more</a>,,
Nct Bumps And Babies - Breastfeeding Drop-In,,GDOS,Valley Park community centre,,,Eastleigh,Hampshire,SO53 4ST,Tel: 07452 983313,We provide free specialist breastfeeding support delivered by NCT trained breastfeeding counsellors. No appointment necessary.Every Friday  10-11.30 a... <a href="https://www.netmums.com/local/l/breastfeeding-drop-in-eastleigh-1">Read more</a>,,
Bfn Breastfeeding Support Group - Northam,,GDOS,Northam Community Centre,Kent Street,,Southampton,Hampshire,SO14 5SP,Tel: 07927532487,"We are here to support you! Pregnant, combination feeding, expressing or exclusively breastfeeding “ everyones welcome.A free drop in that runs ... <a href=https://www.netmums.com/local/l/bfn-breastfeeding-support-group-northam>Read more</a>",,
Antenatal &Amp; Postnatal Support West Sussex,,GDOS,Selsey,,,,,PO20 0DE,Tel: 07714311286,"Glow Births CIC offer free and subsidised antenatal classes, breastfeeding support, doula and postnatal services in West Sussex.Sessions are taught b... <a href=https://www.netmums.com/local/l/antenatal-postnatal-support-west-sussex>Read more</a>",,
Camberley Breastfeeding Hub,,GDOS,High Cross Church,Knoll Road,,Camberley,,GU15 3SY,,"Camberley Breastfeeding Hub is a safe space for families wishing to breast/chest feed, those who already do and for families who combi-feed by choice... <a href=https://www.netmums.com/local/l/camberley-breastfeeding-hub>Read more</a>",,
The Maternio - Hypnobirthing And Mindful Breastfeeding,,GDOS,6 Horseshoe Close,,,Camberley,Surrey,GU15 4DJ,Tel: 07708104203,"The Maternio “ Run by Jodie Gladish, a Hypnobirthing Teacher, Mindful Breastfeeding Practitioner, and a Photographer. I am very passionate about bir... <a href=https://www.netmums.com/local/l/the-maternio-hypnobirthing-and-mindful-breastfeeding>Read more</a>",,
Lll Southampton,,GDOS,St James Road Methodist Church,St James Road,,Southampton,Hampshire,SO15 5HE,Tel: 01489 854694,"LLL provides breastfeeding information and support to all mums.  We hold a breastfeeding drop-in session every Monday in term-time, including a more s... <a href=https://www.netmums.com/local/l/lll-south-hants>Read more</a>",,
Bfn  Free Breastfeeding Support Drop-In Group - Shirley,,GDOS,The Ashby Centre,Stratton Road,,Southampton,Hampshire,SO15 5QZ,Tel: 07927532487,"We are here to support you! Pregnant, combination feeding, expressing or exclusively breastfeeding “ everyones welcome.A free drop in that runs ... <a href=https://www.netmums.com/local/l/bfn-free-breastfeeding-support-drop-in-group-shirley>Read more</a>",,
Antenatal &Amp; Postnatal Education And Support Courses,,GDOS,Our Baby Club Studio,St Sebastians Close,,Wokingham,Berkshire,RG40 3XA,Tel: 07841195295,Welcome to Award Winning Modern Antenatal and Postnatal Courses!We believe that in order to be fully informed and prepared for anything in life it... <a href="https://www.netmums.com/local/l/antenatal-postnatal-education-and-support-courses">Read more</a>,,
Infant Feeding Group,,GDOS,Little Play Lounge,"The Old Rectory, Rectory Road",Padworth Common,Reading,Berkshire,RG7 4JD,Tel: 07502 269789,Get breast and bottle feeding support or just come along to chat about your feeding journey with other parents.   The drop-in session is free to atten... <a href="https://www.netmums.com/local/l/infant-feeding-group">Read more</a>,,
Lll Woking Breastfeeding Support On The First Friday Of Each Month,,GDOS,Horsell Village Hall,117 High Street,Horsell,Woking,Surrey,GU21 4SS,,"Breastfeeding support with trained La Leche League GB (LLL) breastfeeding counsellors, free to attend, free parking. Breastfeeding counsellors alongsi... <a href=https://www.netmums.com/local/l/breastfeeding-support-free-to-attend-free-to-park>Read more</a>",,
Bracknell Breastfeeding Support,,GDOS,Bracknell Forest Children's Centres,,,Bracknell based,Berkshire,RG12 7JZ,,Bracknell Forest Children's Centres offer breastfeeding support appointments to families living in Bracknell Forest.  Appointments are available Monda... <a href="https://www.netmums.com/local/l/bracknell-bfn">Read more</a>,,
Milk Breastfeeding Support Group,,GDOS,Durrington Infant & Junior School,81 Salvington Road,Durrington,Worthing,West Sussex,BN13 2JD,Tel: 01903 276888,"A friendly and helpful drop in support group for breastfeeding  mums. If you are a breastfeeding mum or would like to find out more, pop into a sessio... <a href=https://www.netmums.com/local/l/milk-breastfeeding-support-group-1>Read more</a>",,
