Organisation Name,NACS Code,Organisation Type,Address1,Address2,Address3,Address4,Address5,PostCode,Telephone Number,Information supplied by,Value  (Information supplied by),Banding Classification  (Information supplied by)
Breastfeeding Support Group Ipswich,,GDOS,Hawthornes Childrens Centre,Hawthorne Drive,,Ipswich,Suffolk,IP2 0QY,Tel: 01473 260882,"We are a breastfeeding support group, run by BFN trained volunteers who are all Mums that have breastfed their children and want to give back somethin... <a href=https://www.netmums.com/local/l/breastfriends-2>Read more</a>",,
Bumps And Boobs,,GDOS,Ravenswood childrens centre,103 Hening avenue,Suffolk,Ipswich,Suffolk,IP3 9QJ,Tel: 01473 714521,A breastfeeding peer support group on every Tuesday (except 2nd tuesdays of each month) to support breastfeeding mums before and during their breastfe... <a href="https://www.netmums.com/local/l/bumps-and-boobs">Read more</a>,,
Breastfeeding Support- La Leche League Meetings In Ipswich,,GDOS,The Dales Open Space,Baronsdale Close,,Ipswich,Suffolk,IP1 4JX,,Are you breastfeeding or considering it? Would you like more information/help? Would you like to meet other breastfeeding mums? Friendly group offerin... <a href="https://www.netmums.com/local/l/breastfeeding-support-la-leche-league-meetings-in-ipswich">Read more</a>,,
Hypnotherapy Hypnobirthing And Postnatal Wellbeing,,GDOS,30 Mashbury Road,Great Waltham,,Chelmsford,essex,CM3 1EN,Tel: 07947275673,Hypnobirthing is a method of childbirth that uses hypnosis to help women achieve a more relaxed and comfortable birth experience. It is based on the ... <a href="https://www.netmums.com/local/l/hypnobirthing-and-postnatal-wellbeing">Read more</a>,,
Mum2Mum Breastfeeding Group,,GDOS,"Oaktree Children's Centre in Grove Road,",,,Rayleigh,Essex,SS6 8UA,Tel: 01268 775910,"This group now runs at Oaktree Children's Centre in Grove Road, Mondays from 09:30-11:30, alongside baby clinic.  Why not drop in for a chat, we provi... <a href=https://www.netmums.com/local/l/mum2mum-breastfeeding-group>Read more</a>",,
Mum 2 Mum Breastfeeding Support Southend,,GDOS,Hamstel Childrens Centre,Hamstel Infant School,Hamstel Road,Southend on Sea,Essex,SS2 4PQ,Tel: 01702 220 810,Come along to our breastfeeding support group. Open to pregnant mums looking for advice on breastfeeding their baby and mums of breastfed babies and c... <a href="https://www.netmums.com/local/l/mum-2-mum-breastfeeding-support-southend">Read more</a>,,
Breast Feeding Support Group,,GDOS,Family Action Southend Blenheim Children's Centre,,,Leigh On Sea,Essex,SS9 4HX,Tel: 01702 220810,Wednesday 12:45-13:30 drop in session before Baby Health Clinic... <a href="https://www.netmums.com/local/l/breast-feeding-support-group-26">Read more</a>,,
I Love Greens - Family Health &Amp; Nutrition,,GDOS,Downham Road,Ramsden Heath,,Billericay,Essex,CM11 1PU,Tel: 07765251301,"Hey! I'm Nicola, registered nutritionist and expert in prenatal, pregnancy and children's nutrition. I support families from conception all the way t... <a href=https://www.netmums.com/local/l/happy-tums-weaning-workshops>Read more</a>",,
Cake Club - Parenting Support And Solidarity In Southend,,GDOS,"The Haven Community Hub (Cake Club Office & Monday, Friday & Saturday venue)",138-140 Hamlet Court Road,,Westcliff-on-Sea,Essex,SS0 7LW,,"Cake Club is a small charity offering parenting support and playgroups in the Southend area, incorporating pregnancy, postnatal, infant feeding and s... <a href=https://www.netmums.com/local/l/cake-club-parenting-support-and-solidarity-in-southend>Read more</a>",,
Basildon &Amp; Thurrock Bras Breastfeeding Support Group,,GDOS,Basildon & Thurrock BRAS,,,Basildon,,SS15 4JS,,Covering Basildon &amp; Thurrock and surrounding areas. Online and face to face support available.  Trained breast/chestfeeding support from ABM brea... <a href="https://www.netmums.com/local/l/basildon-thurrock-bras">Read more</a>,,
