Organisation Name,NACS Code,Organisation Type,Address1,Address2,Address3,Address4,Address5,PostCode,Telephone Number,Information supplied by,Value  (Information supplied by),Banding Classification  (Information supplied by)
Quarrendon Children'S Centre - Breastfeeding Drop-In,,GDOS,147 Meadowcroft,,,Aylesbury,Bucks,HP19 9HH,Tel: 01296 415304 or 01296 336789,A drop-in venue where you can breastfeed your baby in an informal setting and get help and support from skilled advisers or other mums ..... and a cup... <a href="https://www.netmums.com/local/l/breastfeeding-drop-in-10">Read more</a>,,
Free Breastfeeding Support Drop-In,,GDOS,Witney Methodist Church,40 High Street,,Witney,,OX28 6HG,Tel: 07824470002,We offer free breastfeeding help with specific issues for babies up to 8 weeks of age in a relaxed environment with ample tea and biscuits. There is n... <a href="https://www.netmums.com/local/l/free-breastfeeding-support-drop-in">Read more</a>,,
La Leche Breastfeeding Support Group,,GDOS,,,,Flitwick ,,MK45 1AH,Tel: 01525 713 478,"La Leche Leagues aims are to help mothers to breastfeed through mother-to-mother support, encouragement, information and education and to promote ... <a href=https://www.netmums.com/local/l/la-leche-breastfeeding-support-group>Read more</a>",,
Baby Brasserie (Flitwick),,GDOS,Flitwick Children's Centre,Malham Close,,Flitwick,Beds,MK45 1PU,Tel: 01525 714008,Cafe style group for all breastfeeding mums.  Mums-to- be wanting information on preparing for breastfeeding and mums expressssing milk welcome. Suppo... <a href="https://www.netmums.com/local/l/baby-brasserie-1">Read more</a>,,
Breastfeeding Hypnotherapy,,GDOS,27 Lindlings,,,Hemel Hempstead,Hertsfordshire,HP1 2HB,Tel: 07757429445,Feeling relaxed is incredibly difficult when you have a newborn and this can contribute to difficulties in breastfeeding. Therefore hypnotherapy alon... <a href="https://www.netmums.com/local/l/breastfeeding-hypnotherapy">Read more</a>,,
Mae Bee Baby - Breast Feeding Help Support And Advice,,GDOS,153 Box End Road,,,Bromham,Beds,MK43 8LU,Tel: 07980447390,"Here at Mae Bee Baby we aim to help all Mums enjoy and feel comfrotable and confident with Breast feeding thier babies. We offer independent, practica... <a href=https://www.netmums.com/local/l/mae-bee-baby-breast-feeding-help-support-and-advice-when-you-need-it-most>Read more</a>",,
Specialist Breastfeeding Support And Division Of Tongue Ties,,GDOS,High St,,,Clapham,Warwickshire,MK41 6EG,Tel: 07547897876,This website is for you to access private breastfeeding support and for the Division of Tongue Ties by an experienced International Board Certified La... <a href="https://www.netmums.com/local/l/specialist-breastfeeding-support-and-division-of-tongue-ties">Read more</a>,,
Bumps Boobs &Amp; Babies Group With Breastfeeding Support,,GDOS,Harefield Children's Centre,Harefield Infant School,High Street,Harefield,Middx,UB9 6BT,Tel: 01895 671982,"Come along to our lovely Bumps, Boobs &amp; Babies group, for expectant parents and parents with babies from birth to crawling.It provides a wonderful... <a href=https://www.netmums.com/local/l/bumps-boobs-babies-group-with-breastfeeding-support>Read more</a>",,
