Organisation Name,NACS Code,Organisation Type,Address1,Address2,Address3,Address4,Address5,PostCode,Telephone Number,Information supplied by,Value  (Information supplied by),Banding Classification  (Information supplied by)
Ely Milks,,GDOS,"Ely Cathedral Centre,","Palace Green,",,Ely,Cambs,CB7 4EW,Tel: 07712 439637,Ely MILKS provides information and support for mums who are breastfeeding. We believe choosing to breastfeed your baby is one of the most positive dec... <a href="https://www.netmums.com/local/l/mother-nurture">Read more</a>,,
La Leche League  - Breastfeeding Drop In,,GDOS,The Fields Children's Centre,Galfrid Road,,Cambridge,,CB5 8ND,Tel: 01223 518333/01223 712444,Breastfeeding support is available to those having problems or indeed those enjoying the breastfeeding experience. This drop-in is always attended by ... <a href="https://www.netmums.com/local/l/breastfeeding-drop-in-3">Read more</a>,,
Cambridge Breastfeeding Alliance Online Support And In-Person Group,,GDOS,Ross St Community Centre,,,Cambridge,Cambridgeshire,CB1 3UZ,,"We offer online video breastfeeding support Monday, Wednesday and Saturday 9-12pm and also in-person appointments on Fridays 12.30-2.30pm at Ross St C... <a href=https://www.netmums.com/local/l/breastfeeding-drop-in-cambridge-breastfeeding-alliance>Read more</a>",,
Baaby Massage Classes With My Yoga Corner,,GDOS,133 Heron Road ,Northstowe ,,Cambridge ,Cambridgeshire ,CB24 1AS,Tel: 07765211807,"My Baby Massage classes allow you to care for your baby's needs in a friendly environment.We learn different strokes to aid growth, soothing and bond... <a href=https://www.netmums.com/local/l/my-yoga-corner-baby-massage>Read more</a>",,
Breastfeeding Supporttongue-Tie Assessment &Amp; Division,,GDOS,The Self Centre,Kempson Way,,Bury St Edmunds,Suffolk,IP32 7AR,Tel: 07729 629190,"Support with a range of breastfeeding problems including weight gain concerns, sore/damaged nipples, concerns about milk supply, premature and babies ... <a href=https://www.netmums.com/local/l/breastfeeding-support-tongue-tie-assessment-division>Read more</a>",,
Breastfeeding Support Group - Drop In,,GDOS,March & District Children's Centre,Cavalry Drive,,March,Cambs,PE15 9EQ,Tel: 01354 656581,Breastfeeding Support GroupA weekly group for anyone wanting information or support around breastfeeding.- Pregnant and New Mums welcome.- Meet other ... <a href="https://www.netmums.com/local/l/breastfeeding-support-group-drop-in">Read more</a>,,
The Baby Cafe At Emneth Children'S Centre,,GDOS,Emneth Children's Centre,Hollycroft Road,Emneth,Cambridgeshire,,PE14 8AY,Tel: 01945 582401,"A Baby CafÃ© drop-in centre set out with coffee tables, comfy sofas and play areas for accompanying toddlers.  All pregnant or breastfeeding mums are ... <a href=https://www.netmums.com/local/l/the-baby-cafe-at-emneth-children-s-centre>Read more</a>",,
Breastfeeding Support Whittlesey,,GDOS,Whittlesey Children's Centre,New Road,,Whittlesey,Cambridgeshire,PE7 1SZ,Tel: 01354 750185,"If you are breastfeeding, or thinking about breastfeeding and need support and advice you can contact a trained member of staff at the Children's Cent... <a href=https://www.netmums.com/local/l/breastfeeding-support-whittlesey>Read more</a>",,
