Organisation Name,NACS Code,Organisation Type,Address1,Address2,Address3,Address4,Address5,PostCode,Telephone Number,Information supplied by,Value  (Information supplied by),Banding Classification  (Information supplied by)
Butterflies Baby Cafe,,GDOS,Beccles Childrens Centre,Castle Hill,,Beccles,,NR34 7BQ,Tel: 01493 852209,"An informal relaxed 'cafe' style drop-in, providing support to pregnant and breastfeeding mothers and their families.Influenced by popular 'cafe cultu... <a href=https://www.netmums.com/local/l/butterflies-baby-cafe>Read more</a>",,
South Lowestoft Baby Cafe,,GDOS,Kirkley Children's Centre,Kirkley Street,,Lowestoft,Suffolk,NR33 0LU,Tel: 01502 532740,"A Baby CafÃ© drop-in centre set out with coffee tables, comfy sofas and play areas for accompanying toddlers.  All pregnant or breastfeeding mums are ... <a href=https://www.netmums.com/local/l/south-lowestoft-baby-cafe>Read more</a>",,
Breastfeeding Support- La Leche League Meetings In Ipswich,,GDOS,The Dales Open Space,Baronsdale Close,,Ipswich,Suffolk,IP1 4JX,,Are you breastfeeding or considering it? Would you like more information/help? Would you like to meet other breastfeeding mums? Friendly group offerin... <a href="https://www.netmums.com/local/l/breastfeeding-support-la-leche-league-meetings-in-ipswich">Read more</a>,,
Diss Baby Cafe,,GDOS,Methodist Church,Victoria Road,Norfolk,Diss,,IP22 4EX,Tel: 01379 651786,Drop-in to meet other breast feeding mums and mums to be and get supportMondays 1pm - 2.30pm in the Colin Riches Room.... <a href="https://www.netmums.com/local/l/diss-baby-cafe">Read more</a>,,
Bumps And Boobs,,GDOS,Ravenswood childrens centre,103 Hening avenue,Suffolk,Ipswich,Suffolk,IP3 9QJ,Tel: 01473 714521,A breastfeeding peer support group on every Tuesday (except 2nd tuesdays of each month) to support breastfeeding mums before and during their breastfe... <a href="https://www.netmums.com/local/l/bumps-and-boobs">Read more</a>,,
Breastfeeding Support Group Ipswich,,GDOS,Hawthornes Childrens Centre,Hawthorne Drive,,Ipswich,Suffolk,IP2 0QY,Tel: 01473 260882,"We are a breastfeeding support group, run by BFN trained volunteers who are all Mums that have breastfed their children and want to give back somethin... <a href=https://www.netmums.com/local/l/breastfriends-2>Read more</a>",,
Sian Aldis -  Breastfeeding Practitioner,,GDOS,Framingham Earl ,,,Norwich,,NR14 7PD,Tel: 07766466307,"One to one breastfeeding support service for all stages of lactation, offering evidence based information and support in Norfolk and Suffolk.I offer ... <a href=https://www.netmums.com/local/l/sian-aldis-breastfeeding-practitioner>Read more</a>",,
Baby Cafe,,GDOS,Seagulls Children's Centre,Shrublands,Magdalen Way,Gorleston,Norfolk,NR31 7BP,Tel: 01493 660090,Breastfeeding is good for mums as well as their babies. This is a chance to come and meet other breastfeeding mums and get expert advice from a breast... <a href="https://www.netmums.com/local/l/breastfeeding-cafe-32">Read more</a>,,
Baby Nutrition Group,,GDOS,Seagulls Children's Centre,Shrublands,Magdalen Way,Gorleston,Norfolk,NR31 7BP,Tel: 01493 660090,A practical session designed to helpyou and your baby get off to the beststart. Designed for mums from 26weeks pregnant.We will give you information o... <a href="https://www.netmums.com/local/l/breastfeeding-workshop-7">Read more</a>,,
Breastfeeding Cafe,,GDOS,Seagulls Children's Centre,Magdalen Way,,Gorleston,Norfolk,NR31 7BP,Tel: 01493 660090,"A Baby CafÃ© drop-in centre set out with coffee tables, comfy sofas and play areas for accompanying toddlers.  All pregnant or breastfeeding mums are ... <a href=https://www.netmums.com/local/l/the-priory-centre-baby-cafe>Read more</a>",,
Breastfeeding Support By An Experienced Practising Midwife Wymondham,,GDOS,8 Bridewell Street,,,Wymondham,Norfolk,NR18 0AR,Tel: 07579 825552,"Breastfeeding and postnatal support in your own home anywhere in Norfolk and Suffolk.Are you struggling with breastfeeding, sore nipples or is breastf... <a href=https://www.netmums.com/local/l/breastfeeding-support-by-an-experienced-practising-midwife-wymondham-1>Read more</a>",,
Attleborough Breastfeeding Cafe,,GDOS,Attleborough Enterprise Centre,Church Street,,Attleborough,Norfolk,NR17 2AH,Tel: 01953 456 825,"Established in 2006 we offer breastfeeding support to the surrounding area, you can gain support and advice from the local health visitors, midwives, ... <a href=https://www.netmums.com/local/l/attleborough-breastfeeding-cafe-1>Read more</a>",,
