Organisation Name,NACS Code,Organisation Type,Address1,Address2,Address3,Address4,Address5,PostCode,Telephone Number,Information supplied by,Value  (Information supplied by),Banding Classification  (Information supplied by)
Breastfeeding Hypnotherapy,,GDOS,27 Lindlings,,,Hemel Hempstead,Hertsfordshire,HP1 2HB,Tel: 07757429445,Feeling relaxed is incredibly difficult when you have a newborn and this can contribute to difficulties in breastfeeding. Therefore hypnotherapy alon... <a href="https://www.netmums.com/local/l/breastfeeding-hypnotherapy">Read more</a>,,
Bumps Boobs &Amp; Babies Group With Breastfeeding Support,,GDOS,Harefield Children's Centre,Harefield Infant School,High Street,Harefield,Middx,UB9 6BT,Tel: 01895 671982,"Come along to our lovely Bumps, Boobs &amp; Babies group, for expectant parents and parents with babies from birth to crawling.It provides a wonderful... <a href=https://www.netmums.com/local/l/bumps-boobs-babies-group-with-breastfeeding-support>Read more</a>",,
The Lactation Corner - Specialist Ibclc Breastfeeding Support Group,,GDOS,The Stables,Eastcote House Gardens,High street ,Eastcote,,HA5 2FE,Tel: 07719312795,Specialist Breastfeeding Support in a group setting from IBCLCs Miriam Feen and Kathryn Stagg. Please check the Facebook page for times and dates. Or ... <a href="https://www.netmums.com/local/l/the-lactation-corner-specialist-ibclc-breastfeeding-support-group-1">Read more</a>,,
Breastfeeding Support Group Ibclc - The Lactation Corner,,GDOS,The Stables,Eastcote House Gardens,High street ,Eastcote,,HA5 2FE,Tel: 07719312795,Specialist Breastfeeding Support Group with IBCLCs Miriam Feen and Kathryn Stagg. Please check the Facebook page for times and dates. Or text or email... <a href="https://www.netmums.com/local/l/the-lactation-corner-specialist-ibclc-breastfeeding-support-group">Read more</a>,,
Bellytots Pregnancy &Amp; Baby Classes (0M+) In Ruislip,,GDOS,Ruislip Manor Methodist Church,Torrington Road,,Ruislip,,HA4 0AS,Tel: 07946660927,From our Pregnancy Pilates/Yoga blend to:- Newborn Mum Club- Baby Massage &amp; Baby Yoga- Baby Reflexology and beyond! We'd love to welcome you to o... <a href="https://www.netmums.com/local/l/bellytots-pregnancy-postnatal-classes-online-and-in-person">Read more</a>,,
Experienced Lactation Consultants Ibclc,,GDOS,Perfect Balance Clinic at Verulam Clinic ,118 Victoria Street,,St Albans,Herts,AL1 3TG,Tel: 08000724012,Lactation consultancyUltrasound for blocked ducts/mastitisK-Laser for bleeding nipples to optimise healing timepositioning and attachment assistancec... <a href="https://www.netmums.com/local/l/lactation-consultants-1">Read more</a>,,
Breastfeeding Support - Private,,GDOS,In your home,,,Harrow,,HA1 1NZ,Tel: 07719312795,Private Breastfeeding Support available in your own home from International Board Certified Lactation Consultant Kathryn Stagg. Kathryn has over 10 ye... <a href="https://www.netmums.com/local/l/private-breastfeeding-support-2">Read more</a>,,
Breastfeeding Support - Private Ibclc,,GDOS,In your home,,,Harrow,,HA1 1NZ,Tel: 07719312795,Specialist Breastfeeding Support in the comfort of your own home from Kathryn Stagg IBCLC. Antwnatal education hand weaning onto solids workshops also... <a href="https://www.netmums.com/local/l/breastfeeding-support-private-ibclc">Read more</a>,,
Doula - Postnatal Based In Harrow,,GDOS,Nelson Road,,,Harrow,,HA1 3ET,Tel: 07521 280133,"A postnatal doula can offer you support through the early weeks and months with your new baby. An invaluable person to help you with your recovery, c... <a href=https://www.netmums.com/local/l/doula-postnatal-based-in-harrow>Read more</a>",,
Quarrendon Children'S Centre - Breastfeeding Drop-In,,GDOS,147 Meadowcroft,,,Aylesbury,Bucks,HP19 9HH,Tel: 01296 415304 or 01296 336789,A drop-in venue where you can breastfeed your baby in an informal setting and get help and support from skilled advisers or other mums ..... and a cup... <a href="https://www.netmums.com/local/l/breastfeeding-drop-in-10">Read more</a>,,
Take 5 Cafe,,GDOS,Beech Hill Primary School,"Dunstable Road,",,Luton,Bedfordshire,LU4 8BW,Tel: 01582 393 440,"Take 5 CafÃ© “Every Tuesday Morning @ Stopsley Children's Centre 9.30-11.30 amPre-birth -6 months, practical parenting group, come for a coffee and ... <a href=https://www.netmums.com/local/l/newb-s-feeding-support-cafe>Read more</a>",,
Breastfeeding Cafe,,GDOS,Church Lane Children's Centre,Fryent Primary School,Church Lane,Kingsbury,,NW9 8JD,Tel: 020 8937 3890,Do you want to meet other mums who are breastfeeding? Would you like some individual support? Come along for a friendly groupWe are open every Thursda... <a href="https://www.netmums.com/local/l/breastfeeding-cafe-16">Read more</a>,,
Cranial Osteopathy,,GDOS,Mosquito Way (David Lloyds),,,Hatfield/St Albans,Herts,AL10 9AX,Tel: 0800 0724 012,"Despite its name, cranial osteopathy isnt restricted to the head; it can be used on many parts of the body. It is the gentlest osteopathy treatmen... <a href=https://www.netmums.com/local/l/a-perfect-balance-clinic>Read more</a>",,
Barnet Breastfeeding Support Service,,GDOS,Barnet Breastfeeding Support Service,,,Barnet,,EN5 2DY,Tel: 07 815 717 055,Our Breastfeeding Support Service provides parents with support and information on baby feeding. Our friendly and welcoming breastfeeding support grou... <a href="https://www.netmums.com/local/l/barnet-breastfeeding-support-service-hope-corner-community-centre">Read more</a>,,
If Your Baby Is Under 13 Months Then Baby Sensory Is For You!,,GDOS,Wow Centre within Next Gen Fitness ,Mount Grace Road ,,Potters Bar ,Hertfordshire ,EN6 1RB,Tel: 07837935820,"Were a learning and development programme specifically designed from birth to 13 monthsFrom puppet shows and musical instruments, to baby signing,... <a href=https://www.netmums.com/local/l/if-your-baby-is-under-13-months-then-baby-sensory-is-for-you>Read more</a>",,
Ante-Natal And Post-Natal: Breastfeeding Support In North London,,GDOS,Mounfield Road,,,london,,N3 3NE,Tel: 07976600891,"Offering help and advice, including home visits for anything concerning breastfeeding and lactating. From an IBCLC qualified lactation consultant. Thr... <a href=https://www.netmums.com/local/l/breastfeeding-support-in-north-london>Read more</a>",,
Breastfeeding Support,,GDOS,St Margaret Nursery School,Margaret Road,,New Barnet,London,EN4 9NT,Tel: 020 8449 5466 option 5,"Trained staff are available to give support and advice for women who are thinking of/are breastfeeding. Wednesday. Held at BEYA, St Margaret's Nursery... <a href=https://www.netmums.com/local/l/hampden-way-breastfeeding-support>Read more</a>",,
Breastfeeding Drop-Ins From The Nct (Twickenham),,GDOS,,,,Twickenham & surrounding areas,,TW2 5QA,Tel: 0844 20 909 20,"Breastfeeding is a new skill to learn and we all need help and support in learning new things. If you are finding it painful, or if you have any quest... <a href=https://www.netmums.com/local/l/free-nct-breastfeeding-drop-ins>Read more</a>",,
Bracknell Breastfeeding Support,,GDOS,Bracknell Forest Children's Centres,,,Bracknell based,Berkshire,RG12 7JZ,,Bracknell Forest Children's Centres offer breastfeeding support appointments to families living in Bracknell Forest.  Appointments are available Monda... <a href="https://www.netmums.com/local/l/bracknell-bfn">Read more</a>,,
Breastfeeding Cafe - Westminster,,GDOS,Queen's Park Children's Centre,The Family Centre,88 Bravington Road,London,,W9 3AL,Tel: 020 7641 5838/4635,"Call in to breastfeed in a relaxed and welcoming atmosphere, get support if you need it from our midwife, or just to meet other mums. Wednesday 9.30am... <a href=https://www.netmums.com/local/l/breastfeeding-cafe-14>Read more</a>",,
Coppetts Wood - Breastfeeding Support,,GDOS,"Coppetts Wood Children's Centre, Coppetts Road,",,,Barnet,,N10 1JS,Tel: 020 8883 2985,All breastfeeding mums are welcome to come along. We can provide 1:1 support and advice on any breastfeeding issues or difficulties. Breastfeeding Sup... <a href="https://www.netmums.com/local/l/coppetts-wood-breastfeeding-support-group">Read more</a>,,
1:1 Parenting Peer Support,,GDOS,Mutual Space or Your Home or My Home or Online,Whichever is Most Comfortable for You,,UK,,N11 3FL,,"Yemaya offers 1:1 sessions of peer-support for parents and parents-to-be. Whether youre in need of respite, reassurance, reinvigoration or you woul... <a href=https://www.netmums.com/local/l/1-1-parenting-peer-support>Read more</a>",,
Breastfeeding Centre Caversham,,GDOS,Amersham Road Community Centre,Amersham Road,,Caversham,Berkshire,RG4 5BP,Tel: 0118 901 5610,Mon 09:30 - 11:30 ... <a href="https://www.netmums.com/local/l/breastfeeding-centre">Read more</a>,,
Free Baby Feeding Support In Haringey With The Breastfeeding Network,,GDOS,Highgate International Church,272 Archway Road,,London,,N6 5AU,,"- Highgate International - Our friendly peer support team can help with breastfeeding, expressing, bottle feeding, weaning from the breast and introdu... <a href=https://www.netmums.com/local/l/free-baby-feeding-support-in-haringey-with-the-breastfeeding-network-1>Read more</a>",,
La Leche League Notting Hill Monthly Meeting,,GDOS,112 Palace Gardens Terrace,,,London,,W8 4RT,Tel: 07475146580,We welcome you to join us for our monthly series meeting in Notting Hill. We will spend the first portion of the meeting answering your breastfeeding ... <a href="https://www.netmums.com/local/l/monthly-meeting-la-leche-league-notting-hill">Read more</a>,,
Free Baby Feeding Support In Haringey With The Breastfeeding Network,,GDOS,Hornsey Central Neighbourhood Health Centre,151 Park Road,,London,,N8 8JD,,"- Hornsey Central Neighbourhood Health Centre -Our friendly peer support team can help with breastfeeding, expressing, bottle feeding, weaning from th... <a href=https://www.netmums.com/local/l/free-baby-feeding-support-in-haringey-with-the-breastfeeding-network-5>Read more</a>",,
Birth And Postnatal Doula North London,,GDOS,Nightingale Lane,,,London,,N8 7RA,Tel: 07961482886,"Hello all!Im a mum of two wonderful children, a yoga teacher and birth and postnatal Doula based in Crouch End, North London.I teach Pregnancy and ... <a href=https://www.netmums.com/local/l/birth-and-postnatal-doula-north-london>Read more</a>",,
Islington Breastfeeding Support - Archway Premature Babies Group,,GDOS,Archway Children's Centre,Vorley Road,,Islington,London,N19 5HE,Tel: 020 3316 8439,COVID-19 UPDATE - WE ARE STILL RUNNING A SERVICE BUT OF COURSE LOTS OF THINGS HAVE CHANGED. FULL DETAILS AT https://www.facebook.com/notes/breastfeed... <a href="https://www.netmums.com/local/l/breastfeeding-group-7">Read more</a>,,
Hypnobirthing Birth Doula Breastfeeding &Amp; Postnatal Support,,GDOS,2 Arlow Road,Winchmore Hill,,Enfield,London,N21 3JU,Tel: 07944156238,"Group and Private Hypnobirthing courses in person in Enfield, North London or online via zoom. Claire is a birth and postnatal doula and a local mothe... <a href=https://www.netmums.com/local/l/hypnobirthing-birth-doula-breastfeeding-postnatal-support>Read more</a>",,
Antenatal &Amp; Postnatal Education And Support Courses,,GDOS,Our Baby Club Studio,St Sebastians Close,,Wokingham,Berkshire,RG40 3XA,Tel: 07841195295,Welcome to Award Winning Modern Antenatal and Postnatal Courses!We believe that in order to be fully informed and prepared for anything in life it... <a href="https://www.netmums.com/local/l/antenatal-postnatal-education-and-support-courses">Read more</a>,,
Islington Breastfeeding Support - Hungerford Children'S Centre,,GDOS,Hungerford Children's Centre,10 Goodinge Road,,Islington,London,N7 9LH,Tel: 020 3316 8439,Meet other mums and receive help with breastfeeding and introducing solids from qualified Breastfeeding Supporter Thomasina. Babies and children of a... <a href="https://www.netmums.com/local/l/islington-breastfeeding-support-hungerford-children-s-centre">Read more</a>,,
Baby Brasserie (Flitwick),,GDOS,Flitwick Children's Centre,Malham Close,,Flitwick,Beds,MK45 1PU,Tel: 01525 714008,Cafe style group for all breastfeeding mums.  Mums-to- be wanting information on preparing for breastfeeding and mums expressssing milk welcome. Suppo... <a href="https://www.netmums.com/local/l/baby-brasserie-1">Read more</a>,,
Osteopathic Treatment For Children Pregnant &Amp; Postnatal Mums,,GDOS,141 Cleveland Street,,,London,,W1T 6QG,,OCC clinics ensure families who cannot afford private fees are able to receive the support they need. We provide specialist paediatric osteopathy to ... <a href="https://www.netmums.com/local/l/osteopathic-treatment-for-children-pregnant-postnatal-mums">Read more</a>,,
Free Baby Feeding Support In Haringey With The Breastfeeding Network,,GDOS,Woodlands Park Nursery School & Children Centre,74-76 Woodlands Park Road,,London,,N15 3SD,,"- Woodlands Park Children Centre -Our friendly peer support team can help with breastfeeding, expressing, bottle feeding, weaning from the breast and ... <a href=https://www.netmums.com/local/l/free-baby-feeding-support-in-haringey-with-the-breastfeeding-network-3>Read more</a>",,
La Leche Breastfeeding Support Group,,GDOS,,,,Flitwick ,,MK45 1AH,Tel: 01525 713 478,"La Leche Leagues aims are to help mothers to breastfeed through mother-to-mother support, encouragement, information and education and to promote ... <a href=https://www.netmums.com/local/l/la-leche-breastfeeding-support-group>Read more</a>",,
Islington Breastfeeding Welcome Venues - Breastfeed When Out And About,,GDOS,Bingfield Primary Care Centre,8 Bingfield Street,,Islington,London,N1 0AL,Tel: 020 3316 8439,"Babies need feeding frequently, so you will sometimes have to breastfeed while out of the house. Some mums can feel a bit unsure as to whether others ... <a href=https://www.netmums.com/local/l/breastfeeding-welcome>Read more</a>",,
Islington Breastfeeding Support - Bingfield Primary Care Centre,,GDOS,Bingfield Primary Care Centre,8 Bingfield Street,,Islington,London,N1 0AL,Tel: 020 3316 8439,COVID-19 UPDATE - WE ARE STILL RUNNING A SERVICE BUT OF COURSE LOTS OF THINGS HAVE CHANGED. FULL DETAILS AT https://www.facebook.com/notes/breastfeed... <a href="https://www.netmums.com/local/l/islington-breastfeeding-suport-bemerton-children-s-centre">Read more</a>,,
Islington Breastfeeding And Weaning Peer Support Service,,GDOS,Bingfield Primary Care Centre,8 Bingfield Street,,Islington,London,N1 0AL,Tel: 020 3316 8439,COVID-19 UPDATE - WE ARE STILL RUNNING A SERVICE BUT OF COURSE LOTS OF THINGS HAVE CHANGED. FULL DETAILS AT https://www.facebook.com/notes/breastfeed... <a href="https://www.netmums.com/local/l/islington-breastfeeding-and-weaning-peer-support-programme">Read more</a>,,
Breastfeeding Buddies,,GDOS,Welwyn Road,,,Hertford,,SG14 2DG,Tel: 01992 581258,Breastfeeding Buddies is a peer support group with health visiting lactation specialists on hand to provide additional help and support whether you ar... <a href="https://www.netmums.com/local/l/breastfeeding-buddies-3">Read more</a>,,
Islington Breastfeeding Support - Paradise Park Children'S Centre,,GDOS,Paradise Park Children's Centre,164 Mackenzie Road,,Islington,London,N7 8SE,Tel: 020 3316 8439,COVID-19 UPDATE - WE ARE STILL RUNNING A SERVICE BUT OF COURSE LOTS OF THINGS HAVE CHANGED. FULL DETAILS AT https://www.facebook.com/notes/breastfeed... <a href="https://www.netmums.com/local/l/islington-breastfeeding-support-paradise-park">Read more</a>,,
Islington Breastfeeding Support - Ambler Children'S Centre,,GDOS,Ambler Children's Centre,Romilly Road,,Islington,London,N4 2DR,Tel: 020 3316 8439,COVID-19 UPDATE - WE ARE STILL RUNNING A SERVICE BUT OF COURSE LOTS OF THINGS HAVE CHANGED. FULL DETAILS AT https://www.facebook.com/notes/breastfeed... <a href="https://www.netmums.com/local/l/highbury-grange-health-centre">Read more</a>,,
Islington Breastfeeding Support - Conewood Street Children'S Centre,,GDOS,Conewood Street Children's Centre,14 Conewood Street,,Islington,London,N5 1DL,Tel: 020 3316 8439,COVID-19 UPDATE - WE ARE STILL RUNNING A SERVICE BUT OF COURSE LOTS OF THINGS HAVE CHANGED. FULL DETAILS AT https://www.facebook.com/notes/breastfeed... <a href="https://www.netmums.com/local/l/islington-breastfeeding-support-conewood-street-children-s-centre">Read more</a>,,
The Maternio - Hypnobirthing And Mindful Breastfeeding,,GDOS,6 Horseshoe Close,,,Camberley,Surrey,GU15 4DJ,Tel: 07708104203,"The Maternio “ Run by Jodie Gladish, a Hypnobirthing Teacher, Mindful Breastfeeding Practitioner, and a Photographer. I am very passionate about bir... <a href=https://www.netmums.com/local/l/the-maternio-hypnobirthing-and-mindful-breastfeeding>Read more</a>",,
Wandsworth Nct Breastfeeding And New Baby Drop-In,,GDOS,St Michael's Church Cafe,Granville Road,Southfields,London,,SW18 5SQ,Tel: 07729 016654,Would you like support with feeding your baby or the chance to talk through anything about life with a new baby? Josie or Lucie will be there to offer... <a href="https://www.netmums.com/local/l/wandsworth-nct-breastfeeding-and-new-baby-drop-in">Read more</a>,,
Free Baby Feeding Support In Haringey With The Breastfeeding Network,,GDOS,"Triangle Children, Young People & Community Centre",91-93 Saint Ann's Road,,London,,N15 6NU,,"- Triangle Children, Young People &amp; Community Centre - Our friendly peer support team can help with breastfeeding, expressing, bottle feeding, wea... <a href=https://www.netmums.com/local/l/free-baby-feeding-support-in-haringey-with-the-breastfeeding-network-4>Read more</a>",,
Breastfeeding Support,,GDOS,St Mary's C of E High School,Lieutenant Ellis Way,,Cheshunt,Herts,EN7 5FB,Tel: 01992 633761,"Run by experienced Health Visitors in a relaxed and calm enviroment an opportunity to share experiences, gain peer support and specialist advice. Come... <a href=https://www.netmums.com/local/l/breastfeeding-support-51>Read more</a>",,
Babies: Birth And Baby Information Education Support,,GDOS,Toad Hall Nursery ,,,Hitchin,,SG5 1RT,Tel: 07985 500707,"BABIES provides a wealth of antenatal and postnatal classes, workshops, consultancy and support for new and expectant parents. We are able to do this... <a href=https://www.netmums.com/local/l/0-6-months-a-crash-course-in-having-a-baby-3>Read more</a>",,
Free Baby Feeding Support In Haringey With The Breastfeeding Network,,GDOS,Park Lane Children's Centre,139 Park Lane,,London,,N17 0HB,,"- Park Lane Children's Centre - Our friendly peer support team can help with breastfeeding, expressing, bottle feeding, weaning from the breast and in... <a href=https://www.netmums.com/local/l/free-baby-feeding-support-in-haringey-with-the-breastfeeding-network-2>Read more</a>",,
Free Baby Feeding Support In Haringey With The Breastfeeding Network,,GDOS,Welbourne Children's Centre,Stainby Road,,London,,N15 4EA,,"- Welbourne Children Centre -Our friendly peer support team can help with breastfeeding, expressing, bottle feeding, weaning from the breast and intro... <a href=https://www.netmums.com/local/l/free-baby-feeding-support-in-haringey-with-the-breastfeeding-network-6>Read more</a>",,
Doula And Lactation Support,,GDOS,1 Theseus walk ,,,London,,N1 8DS,Tel: 07527770090,"Wherever you are on your journey to becoming a parent, I am here to support you from conception to birth and beyond. I aim to offer individualised ca... <a href=https://www.netmums.com/local/l/doula-and-lactation-support>Read more</a>",,
Islington Breastfeeding Support - New River Green Children'S Centre,,GDOS,New River Green Children's Centre,23 Ramsey Walk,,Islington,London,N1 2SX,Tel: 020 3316 8439,COVID-19 UPDATE - WE ARE STILL RUNNING A SERVICE BUT OF COURSE LOTS OF THINGS HAVE CHANGED. FULL DETAILS AT https://www.facebook.com/notes/breastfeed... <a href="https://www.netmums.com/local/l/new-river-green-children-s-centre">Read more</a>,,
Pregnancy Relaxation Classes - Hertford,,GDOS,15 Buckwells field,,Hertford,Hertford,,SG14 3FF,Tel: 07852323447,Week 1 - Relaxation in PregnancyWeek 2 - Sleep in PregnancyWeek 3 - Fear in Pregnancy and BirthWeek 4 - Healthy ChoicesWeek 5 - Preparing for BirthWe... <a href="https://www.netmums.com/local/l/birth-preparation-class-hypnobirthing-hertford-women-only">Read more</a>,,
Islington Breastfeeding Support - Moreland Children'S Centre,,GDOS,Moreland Children's Centre,2 Gard Street,,Islington,London,EC1V 8BX,Tel: 020 3316 8439,COVID-19 UPDATE - WE ARE STILL RUNNING A SERVICE BUT OF COURSE LOTS OF THINGS HAVE CHANGED. FULL DETAILS AT https://www.facebook.com/notes/breastfeed... <a href="https://www.netmums.com/local/l/breastfeeding-support-13">Read more</a>,,
Pachamama - A Nurture Group For First Time Mums Hitchin,,GDOS,Walswort community centre,Awls worth td,,Hitchin,,SG4 0AU,Tel: 07421236562,Pachamama is an 8-week facilitated group experience for new mums.  We prioritise mums wellbeing because we know that becoming a mum is a joyous but... <a href="https://www.netmums.com/local/l/pachamama-a-nurture-group-for-first-time-mums">Read more</a>,,
Camberley Breastfeeding Hub,,GDOS,High Cross Church,Knoll Road,,Camberley,,GU15 3SY,,"Camberley Breastfeeding Hub is a safe space for families wishing to breast/chest feed, those who already do and for families who combi-feed by choice... <a href=https://www.netmums.com/local/l/camberley-breastfeeding-hub>Read more</a>",,
Difficulty Breastfeeding? Support Group &Amp; Meet Other Mums,,GDOS,45 Central Street,Clerkenwell,,London,London,EC1V 8AB,Tel: 07917356570,"More often than not there is huge pressure on women to breastfeed; coming from health care professionals, sometimes relatives, partners or self-impose... <a href=https://www.netmums.com/local/l/difficulty-breastfeeding-support-group-meet-other-mums>Read more</a>",,
Milk Spot,,GDOS,Coin Street Neighbourhood Centre,108 Stamford Street   ,,South Bank,London,SE1 9NH,Tel: 020 7021 1634,This weekly session allows mums to breastfeed their babies in a safe and comfortable environment.Every Wednesday 10.00am - 12 noonFree. Just drop-in... <a href="https://www.netmums.com/local/l/milk-spot">Read more</a>,,
Lll Woking Breastfeeding Support On The First Friday Of Each Month,,GDOS,Horsell Village Hall,117 High Street,Horsell,Woking,Surrey,GU21 4SS,,"Breastfeeding support with trained La Leche League GB (LLL) breastfeeding counsellors, free to attend, free parking. Breastfeeding counsellors alongsi... <a href=https://www.netmums.com/local/l/breastfeeding-support-free-to-attend-free-to-park>Read more</a>",,
Lactation Consultant Ibclc South West London,,GDOS,Wimbledon,,,London,,SW19 3RZ,Tel: 07765743693,"Caring specialist breastfeeding support, to help you achieve your breastfeeding goalsIndividualised evidence-based judgement-free support. Parents and... <a href=https://www.netmums.com/local/l/lactation-consultant-ibclc-south-west-london>Read more</a>",,
Free Breastfeeding Support By Henry,,GDOS,313 Billet road,,,london,,E17 5PX,Tel: 02084965222,Free breastfeeding support in cafes and children and family centres across waltham forestsee timetable for full list of sessions ... <a href="https://www.netmums.com/local/l/free-breastfeeding-support-by-henry">Read more</a>,,
Nct Clapham Breastfeeding Cafe &Amp; Support,,GDOS,The Grove,39 Oldridge Road,,Clapham,,SW12 8PN,,Are you breastfeeding a baby or planning to breastfeed?Would you like support or information on breastfeeding?Would you like to meet other breastfeedi... <a href="https://www.netmums.com/local/l/nct-clapham-breastfeeding-support">Read more</a>,,
Balham Breastfeeding Cafe,,GDOS,Harrisons Restaurant ,15-18 Bedford Hill,,Balham,,SW12 9EX,,Mondays 10 -12 ... <a href="https://www.netmums.com/local/l/balham-breastfeeding-cafe">Read more</a>,,