Organisation Name,NACS Code,Organisation Type,Address1,Address2,Address3,Address4,Address5,PostCode,Telephone Number,Information supplied by,Value  (Information supplied by),Banding Classification  (Information supplied by)
Breast Buddies - Rotherham,,GDOS,The Arnold Centre,Goldsmith Rd,,Rotherham,South Yorkshire,S65 2LY,Tel: 07904316826,We are a group of mothers who have all either breastfed or are still currently breastfeeding our children.We have all been trained by La Leche League ... <a href="https://www.netmums.com/local/l/breast-buddies-rotherham">Read more</a>,,
Breast Buddies - Thurcroft Children'S Centre,,GDOS,Thurcroft Infant School,Locksley Drive,,Rotherham,,S66 9NT,Tel: 01709 542538,"If you are pregnant and thinking of breastfeeding, or if you are breastfeeding your baby, then come along and meet us.We are a group of mums who have ... <a href=https://www.netmums.com/local/l/breast-buddies-thurcroft>Read more</a>",,
Breastfeeding Workshop,,GDOS,Walkley Community Centre,7a Fir Street,,Sheffield,,S6 3TG,Tel: 07825778973,Want to know more about breastfeeding in preparation for your new arrival?The Daisy Breastfeeding Workshop is designed to support parents in their pre... <a href="https://www.netmums.com/local/l/breastfeeding-workshop-8">Read more</a>,,
Breast Buddies - Dinnington Children'S Centre,,GDOS,Dinnington Primary School,School Street,,Dinnington,,S25 2RE,Tel: 01909 568226 (Children's Centre number),"If you are pregnant and thinking of breastfeeding, or if you are breastfeeding your baby, then come along and meet us.We are a group of mums who have ... <a href=https://www.netmums.com/local/l/breast-buddies-dinnington>Read more</a>",,
Breast Buddies Chat &Amp; Play: Stepping Stones Children'S Centre,,GDOS,Tickhill Road,,,Maltby,,S66 7NQ,Tel: 01709 334417,"This group is for all breastfeeding mums, mums to be or any family who would like more information regarding breastfeeding.In a relaxed parent and tod... <a href=https://www.netmums.com/local/l/breast-buddies-chat-play>Read more</a>",,
Breastfeeding In Sheffield,,GDOS,,,,Sheffield,,S17 4PP,Tel: 07583764953,This is the current list of Sheffield City Council's breastfeeding support groups. All groups are run by trained Breastfeeding Peer Support Workers a... <a href="https://www.netmums.com/local/l/breastfeeding-in-sheffield">Read more</a>,,
Breastfeeding Support Group - Hoyland Common,,GDOS,Hoyland Common Children's Centre,Sheffield Road,Hoyland Common,Barnsley,South Yorkshire,S74 0DJ,Tel: (01226) 352090,The group is open to all expectant and breastfeeding mums for parents to get support &amp; advice &amp; meet other parents and children.Breastfeeding ... <a href="https://www.netmums.com/local/l/breastfeeding-support-group-98">Read more</a>,,
Baby Clinic,,GDOS,The Dearne Community Children's Centre,"Billingley View,","Bolton-upon-Dearne,","Rotherham,",South Yorkshire,S63 8ES,Tel: 01709 890303,Led by the Health Visiting Team. A chance to get your child weighed. Health Visitors and Childrens Centre staff are available for advice and suppor... <a href="https://www.netmums.com/local/l/breast-is-best-group">Read more</a>,,
Breastfeeding Group - Darfield,,GDOS,Darfield Children's Centre,"School Street,","Darfield,","Barnsley,","South Yorkshire,",S73 9EU,Tel: 01226 753366,"For help, support or just a drink and a chat come along. Thursday 9.30”11 ... <a href=https://www.netmums.com/local/l/yummy-mummies-breastfeeding-peer-support>Read more</a>",,
La Leche League Barnsley Breastfeeding Support,,GDOS,Contact us for venue,,,Barnsley,,S35 7AL,Tel: 07821 482 321,LLL Barnsley is a friendly group offering mother-to-mother breastfeeding support in Barnsley and the surrounding area.Groups are held twice a month: ... <a href="https://www.netmums.com/local/l/la-leche-league-barnsley-breastfeeding-support">Read more</a>,,
Breastfeeding Group Cudworth,,GDOS,Buttercups Children's Centre ,Darfield Rd,Cudworth,"Barnsley,  ","South Yorkshire,",S72 8HG,Tel: 01226 780105,Come along to meet expectant and breastfeeding mums and find out about the support available to you! Tuesday 9.30am “ 10.30am... <a href="https://www.netmums.com/local/l/pinks-n-blues">Read more</a>,,
Bosom Buddies,,GDOS,Cedars Children's Centre,Barnsley Road,,Pontefract,West Yorkshire,WF9 4PU,Tel: 01977 722302,We are a group of mums who have breastfed our babies and have been trained to support you with your breastfeeding. Feel free to drop by to the group i... <a href="https://www.netmums.com/local/l/bosom-buddies">Read more</a>,,
Baby Group In Matlock With Breastfeeding Support (Breastmates Bfn),,GDOS,Hurst Farm Community Centre,Hazel Grove,,Matlock,,DE4 3TG,,"Baby group for all parents, with breastfeeding support from Breastmates, part of the Breastfeeding Network. Come and meet other parents in a friendly... <a href=https://www.netmums.com/local/l/baby-group-in-matlock-with-breastfeeding-support-breastmates-bfn>Read more</a>",,
Bosom Buddies Wakefield,,GDOS,The Castle Children's Centre,255 Barnsley Road,Sandal,Wakefield,,WF1 5NU,Tel: 01924 302 646,"We are a breastfeeding support group, run by mums who have recieved la leche league training. We also have a wonderful health visitor who pops in twic... <a href=https://www.netmums.com/local/l/bosom-buddies-10>Read more</a>",,
Nct Matlock Early Days Drop-In Baby Group (Free),,GDOS,Starkholmes Village Hall,105 Starkholmes Road,,Matlock,,DE4 3DE,,A friendly supportive group for parents to talk about some of the challenges facing them as new parents. Each week we will explore a different topic.... <a href="https://www.netmums.com/local/l/nct-matlock-early-days-drop-in-baby-group-free">Read more</a>,,
Breast Feeding Peer Support Group,,GDOS,Pomfret Children's Centre,Chequerfield Infants School,Rookhill Road,Pontefract,West Yorkshire,WF8 2DD,Tel: 01977 7022644,Friday 10:30 - 12:00. Please contact centre for more details. ... <a href="https://www.netmums.com/local/l/breast-feeding-peer-support-group">Read more</a>,,
Hypnobirthing &Amp; Breastfeeding Support In Leeds &Amp; Huddersfield,,GDOS,31 New Road,,,Holmfirth,,HD9 3XX,Tel: 07946582422,"5* rated, nurturing, personal support during pregnancy to help you prepare for birth, breastfeeding and baby. In-person in Leeds, Huddersfield and wi... <a href=https://www.netmums.com/local/l/hypnobirthing-breastfeeding-support-in-leeds-huddersfield>Read more</a>",,
My Doula Birth And Postnatal Support North And West Yorkshire,,GDOS,Brunswick Street ,,,,,WF13 4NF,,"Antenatal private sessions, labour and birth support, post natal care. We are here to support you through the birth and once at home we offer service... <a href=https://www.netmums.com/local/l/my-doula-birth-and-postnatal-support>Read more</a>",,
Bf Solutions/ Milk Matters: Breast &Amp; Bottle Feeding Support,,GDOS,116 Fitzwilliam St,,,Huddersfield,West Yorkshire,HD1 5PH,Tel: 0845 26 99 57 4 / 07411 276302,"We are qualified, insured, independent International Board Certified Lactation Consultants (IBCLC) specialising in difficult to resolve problems feedi... <a href=https://www.netmums.com/local/l/antenatal-postnatal-independent-breastfeeding-2>Read more</a>",,
Melody Makers Baby - Themed Sessions For Parents &Amp; Their Babies,,GDOS,Jubilee Centre,Market Street,Paddock,Huddersfield,,HD1 4SH,Tel: 01484551551,"Themed sessions for parents &amp; their babies Come and join us for a focussed session about enjoying your baby, making friends and learning new thing... <a href=https://www.netmums.com/local/l/melody-makers-baby-themed-sessions-for-parents-their-babies>Read more</a>",,
Twins &Amp; More - Stay &Amp; Play Group For Families With Twins &Amp; More,,GDOS,Jubilee Centre,Market Street,Paddock,Huddersfield,,HD1 4SH,Tel: 01484 551551,"Stay &amp; play group for families with twins, triplets &amp; more.A place for parents to meet and provide mutual support with those that understand t... <a href=https://www.netmums.com/local/l/twins-more-stay-play-group-for-families-with-twins-more>Read more</a>",,
Middleton Breastfeeding Support Group,,GDOS,Tenant's Hall Enterprise Centre,Acre Close,Middleton,Leeds,West Yorkshire,LS10 4HX,Tel: 07956077800,"A drop-in centre set out with coffee tables, comfy sofas and play areas for accompanying toddlers.  All pregnant or breastfeeding mums are welcome to ... <a href=https://www.netmums.com/local/l/middleton-baby-cafe>Read more</a>",,
